mesos-builds mailing list archives

Site index · List index
Message view « Date » · « Thread »
Top « Date » · « Thread »
From Apache Jenkins Server <jenk...@builds.apache.org>
Subject Build failed in Jenkins: Mesos » autotools,gcc,--verbose,GLOG_v=1 MESOS_VERBOSE=1,ubuntu:14.04,(docker||Hadoop)&&(!ubuntu-us1)&&(!ubuntu-6)&&(!ubuntu-eu2) #3096
Date Tue, 10 Jan 2017 05:46:33 GMT
See <https://builds.apache.org/job/Mesos/BUILDTOOL=autotools,COMPILER=gcc,CONFIGURATION=--verbose,ENVIRONMENT=GLOG_v=1%20MESOS_VERBOSE=1,OS=ubuntu%3A14.04,label_exp=(docker%7C%7CHadoop)&&(!ubuntu-us1)&&(!ubuntu-6)&&(!ubuntu-eu2)/3096/changes>

Changes:

[joris.van.remoortere] Fixed memory leak in implementation of Future<T>::after().

[mpark] CMake: renamed `stout_tests` to `stout-tests` to match autotools.

[mpark] CMake: renamed `process_tests` to `libprocess-tests` to match autotools.

[mpark] CMake: renamed test binaries to match autotools.

[mpark] Removed mpark's gmail address from `contributors.yaml`.

[mpark] Added a default move constructor for `Try`.

[benjamin.hindman] Used process::io::BUFFERED_READ_SIZE instead of constant.

[benjamin.hindman] Introduced ControlFlow for process::loop.

[benjamin.hindman] Updated Mesos process::loop uses with process::ControlFlow.

[benjamin.hindman] Used process::loop to avoid stack overflow due to recursion.

[benjamin.hindman] Used `loop` in implementation of io::read and io::write.

[vinodkone] Improved comments in agent.

[vinodkone] Cleaned up agent re-registration code in the master slightly.

[vinodkone] Improved OneWayPartitionTest.MasterToSlave.

[vinodkone] Cleaned up two test cases slightly.

[vinodkone] Cleaned up `using` statements.

[vinodkone] Fixed quoting in agent error message.

[vinodkone] Cleaned up slave recovery tests.

[vinodkone] Improved handling of agents that restart but never re-register.

[vinodkone] Cleaned up master logging code slightly.

[mpark] Install a symlink rather than building `mesos-agent` twice.

[mpark] Removed unsupported `friend` declaration.

[yujie.jay] Fixed an FD leak in the IO switchboard.

[mpark] Removed a redundant `return` statement in libprocess.

[mpark] Cleaned up `std::string` usage in stout.

[mpark] Cleaned up `std::string` usage in libprocess.

[mpark] Cleaned up `std::string` usage in mesos.

[mpark] Avoided unnecessary copies in mesos.

[mpark] Removed unused namespace alias declarations in libprocess.

[mpark] Removed unused namespace alias declarations in mesos.

[mpark] Avoided needless copies in log tests + some minor code cleanup.

[haosdent] Fix incorrect glyphicons-halflings-regular.woff2.

------------------------------------------
[...truncated 171329 lines...]
I0110 05:46:10.872203 30002 containerizer.cpp:220] Using isolation: posix/cpu,posix/mem,filesystem/posix,network/cni
W0110 05:46:10.872691 30002 backend.cpp:76] Failed to create 'aufs' backend: AufsBackend requires
root privileges, but is running as user mesos
W0110 05:46:10.872844 30002 backend.cpp:76] Failed to create 'bind' backend: BindBackend requires
root privileges
I0110 05:46:10.875670 30036 slave.cpp:209] Mesos agent started on (681)@172.17.0.2:53978
I0110 05:46:10.875694 30036 slave.cpp:210] Flags at startup: --acls="" --appc_simple_discovery_uri_prefix="http://"
--appc_store_dir="/tmp/mesos/store/appc" --authenticate_http_readonly="true" --authenticate_http_readwrite="true"
--authenticatee="crammd5" --authentication_backoff_factor="1secs" --authorizer="local" --cgroups_cpu_enable_pids_and_tids_count="false"
--cgroups_enable_cfs="false" --cgroups_hierarchy="/sys/fs/cgroup" --cgroups_limit_swap="false"
--cgroups_root="mesos" --container_disk_watch_interval="15secs" --containerizers="mesos" --credential="/tmp/Endpoint_SlaveEndpointTest_AuthorizedRequest_1_vcGK8D/credential"
--default_role="*" --disk_watch_interval="1mins" --docker="docker" --docker_kill_orphans="true"
--docker_registry="https://registry-1.docker.io" --docker_remove_delay="6hrs" --docker_socket="/var/run/docker.sock"
--docker_stop_timeout="0ns" --docker_store_dir="/tmp/mesos/store/docker" --docker_volume_checkpoint_dir="/var/run/mesos/isolators/docker/volume"
--enforce_container_disk_quota="false" --executor_registration_timeout="1mins" --executor_shutdown_grace_period="5secs"
--fetcher_cache_dir="/tmp/Endpoint_SlaveEndpointTest_AuthorizedRequest_1_vcGK8D/fetch" --fetcher_cache_size="2GB"
--frameworks_home="" --gc_delay="1weeks" --gc_disk_headroom="0.1" --hadoop_home="" --help="false"
--hostname_lookup="true" --http_authenticators="basic" --http_command_executor="false" --http_credentials="/tmp/Endpoint_SlaveEndpointTest_AuthorizedRequest_1_vcGK8D/http_credentials"
--http_heartbeat_interval="30secs" --image_provisioner_backend="copy" --initialize_driver_logging="true"
--isolation="posix/cpu,posix/mem" --launcher="posix" --launcher_dir="/mesos/mesos-1.2.0/_build/src"
--logbufsecs="0" --logging_level="INFO" --max_completed_executors_per_framework="150" --oversubscribed_resources_interval="15secs"
--perf_duration="10secs" --perf_interval="1mins" --qos_correction_interval_min="0ns" --quiet="false"
--recover="reconnect" --recovery_timeout="15mins" --registration_backoff_factor="10ms" --resources="cpus:2;gpus:0;mem:1024;disk:1024;ports:[31000-32000]"
--revocable_cpu_low_priority="true" --runtime_dir="/tmp/Endpoint_SlaveEndpointTest_AuthorizedRequest_1_vcGK8D"
--sandbox_directory="/mnt/mesos/sandbox" --strict="true" --switch_user="true" --systemd_enable_support="true"
--systemd_runtime_directory="/run/systemd/system" --version="false" --work_dir="/tmp/Endpoint_SlaveEndpointTest_AuthorizedRequest_1_RrB6ma"
I0110 05:46:10.876164 30036 credentials.hpp:86] Loading credential for authentication from
'/tmp/Endpoint_SlaveEndpointTest_AuthorizedRequest_1_vcGK8D/credential'
I0110 05:46:10.876302 30036 slave.cpp:352] Agent using credential for: test-principal
I0110 05:46:10.876327 30036 credentials.hpp:37] Loading credentials for authentication from
'/tmp/Endpoint_SlaveEndpointTest_AuthorizedRequest_1_vcGK8D/http_credentials'
I0110 05:46:10.876544 30036 http.cpp:922] Using default 'basic' HTTP authenticator for realm
'mesos-agent-readonly'
I0110 05:46:10.876672 30036 http.cpp:922] Using default 'basic' HTTP authenticator for realm
'mesos-agent-readwrite'
I0110 05:46:10.877642 30036 slave.cpp:539] Agent resources: cpus(*):2; mem(*):1024; disk(*):1024;
ports(*):[31000-32000]
I0110 05:46:10.877717 30036 slave.cpp:547] Agent attributes: [  ]
I0110 05:46:10.877732 30036 slave.cpp:552] Agent hostname: 1234e5da29c7
I0110 05:46:10.879166 30025 state.cpp:60] Recovering state from '/tmp/Endpoint_SlaveEndpointTest_AuthorizedRequest_1_RrB6ma/meta'
I0110 05:46:10.879410 30035 status_update_manager.cpp:203] Recovering status update manager
I0110 05:46:10.883527 30023 containerizer.cpp:599] Recovering containerizer
I0110 05:46:10.884853 30033 provisioner.cpp:251] Provisioner recovery complete
I0110 05:46:10.885241 30021 slave.cpp:5421] Finished recovery
I0110 05:46:10.885826 30021 slave.cpp:5595] Querying resource estimator for oversubscribable
resources
I0110 05:46:10.886173 30032 slave.cpp:5609] Received oversubscribable resources {} from the
resource estimator
I0110 05:46:10.889619 30035 process.cpp:3676] Handling HTTP event for process 'slave(681)'
with path: '/slave(681)/monitor/statistics.json'
I0110 05:46:10.890832 30028 http.cpp:874] Authorizing principal 'test-principal' to GET the
'/monitor/statistics.json' endpoint
I0110 05:46:10.894791 30029 slave.cpp:796] Agent terminating
[       OK ] Endpoint/SlaveEndpointTest.AuthorizedRequest/1 (31 ms)
[ RUN      ] Endpoint/SlaveEndpointTest.AuthorizedRequest/2
I0110 05:46:10.903285 30002 containerizer.cpp:220] Using isolation: posix/cpu,posix/mem,filesystem/posix,network/cni
W0110 05:46:10.903782 30002 backend.cpp:76] Failed to create 'aufs' backend: AufsBackend requires
root privileges, but is running as user mesos
W0110 05:46:10.903934 30002 backend.cpp:76] Failed to create 'bind' backend: BindBackend requires
root privileges
I0110 05:46:10.906836 30035 slave.cpp:209] Mesos agent started on (682)@172.17.0.2:53978
I0110 05:46:10.906855 30035 slave.cpp:210] Flags at startup: --acls="" --appc_simple_discovery_uri_prefix="http://"
--appc_store_dir="/tmp/mesos/store/appc" --authenticate_http_readonly="true" --authenticate_http_readwrite="true"
--authenticatee="crammd5" --authentication_backoff_factor="1secs" --authorizer="local" --cgroups_cpu_enable_pids_and_tids_count="false"
--cgroups_enable_cfs="false" --cgroups_hierarchy="/sys/fs/cgroup" --cgroups_limit_swap="false"
--cgroups_root="mesos" --container_disk_watch_interval="15secs" --containerizers="mesos" --credential="/tmp/Endpoint_SlaveEndpointTest_AuthorizedRequest_2_JFbGuz/credential"
--default_role="*" --disk_watch_interval="1mins" --docker="docker" --docker_kill_orphans="true"
--docker_registry="https://registry-1.docker.io" --docker_remove_delay="6hrs" --docker_socket="/var/run/docker.sock"
--docker_stop_timeout="0ns" --docker_store_dir="/tmp/mesos/store/docker" --docker_volume_checkpoint_dir="/var/run/mesos/isolators/docker/volume"
--enforce_container_disk_quota="false" --executor_registration_timeout="1mins" --executor_shutdown_grace_period="5secs"
--fetcher_cache_dir="/tmp/Endpoint_SlaveEndpointTest_AuthorizedRequest_2_JFbGuz/fetch" --fetcher_cache_size="2GB"
--frameworks_home="" --gc_delay="1weeks" --gc_disk_headroom="0.1" --hadoop_home="" --help="false"
--hostname_lookup="true" --http_authenticators="basic" --http_command_executor="false" --http_credentials="/tmp/Endpoint_SlaveEndpointTest_AuthorizedRequest_2_JFbGuz/http_credentials"
--http_heartbeat_interval="30secs" --image_provisioner_backend="copy" --initialize_driver_logging="true"
--isolation="posix/cpu,posix/mem" --launcher="posix" --launcher_dir="/mesos/mesos-1.2.0/_build/src"
--logbufsecs="0" --logging_level="INFO" --max_completed_executors_per_framework="150" --oversubscribed_resources_interval="15secs"
--perf_duration="10secs" --perf_interval="1mins" --qos_correction_interval_min="0ns" --quiet="false"
--recover="reconnect" --recovery_timeout="15mins" --registration_backoff_factor="10ms" --resources="cpus:2;gpus:0;mem:1024;disk:1024;ports:[31000-32000]"
--revocable_cpu_low_priority="true" --runtime_dir="/tmp/Endpoint_SlaveEndpointTest_AuthorizedRequest_2_JFbGuz"
--sandbox_directory="/mnt/mesos/sandbox" --strict="true" --switch_user="true" --systemd_enable_support="true"
--systemd_runtime_directory="/run/systemd/system" --version="false" --work_dir="/tmp/Endpoint_SlaveEndpointTest_AuthorizedRequest_2_VBtZD5"
I0110 05:46:10.907387 30035 credentials.hpp:86] Loading credential for authentication from
'/tmp/Endpoint_SlaveEndpointTest_AuthorizedRequest_2_JFbGuz/credential'
I0110 05:46:10.907528 30035 slave.cpp:352] Agent using credential for: test-principal
I0110 05:46:10.907554 30035 credentials.hpp:37] Loading credentials for authentication from
'/tmp/Endpoint_SlaveEndpointTest_AuthorizedRequest_2_JFbGuz/http_credentials'
I0110 05:46:10.907789 30035 http.cpp:922] Using default 'basic' HTTP authenticator for realm
'mesos-agent-readonly'
I0110 05:46:10.907927 30035 http.cpp:922] Using default 'basic' HTTP authenticator for realm
'mesos-agent-readwrite'
I0110 05:46:10.908902 30035 slave.cpp:539] Agent resources: cpus(*):2; mem(*):1024; disk(*):1024;
ports(*):[31000-32000]
I0110 05:46:10.908979 30035 slave.cpp:547] Agent attributes: [  ]
I0110 05:46:10.908993 30035 slave.cpp:552] Agent hostname: 1234e5da29c7
I0110 05:46:10.910370 30030 state.cpp:60] Recovering state from '/tmp/Endpoint_SlaveEndpointTest_AuthorizedRequest_2_VBtZD5/meta'
I0110 05:46:10.910650 30034 status_update_manager.cpp:203] Recovering status update manager
I0110 05:46:10.910851 30021 containerizer.cpp:599] Recovering containerizer
I0110 05:46:10.912058 30030 provisioner.cpp:251] Provisioner recovery complete
I0110 05:46:10.912415 30026 slave.cpp:5421] Finished recovery
I0110 05:46:10.912917 30026 slave.cpp:5595] Querying resource estimator for oversubscribable
resources
I0110 05:46:10.913192 30031 slave.cpp:5609] Received oversubscribable resources {} from the
resource estimator
I0110 05:46:10.916095 30031 process.cpp:3676] Handling HTTP event for process 'slave(682)'
with path: '/slave(682)/containers'
I0110 05:46:10.917290 30022 http.cpp:874] Authorizing principal 'test-principal' to GET the
'/containers' endpoint
I0110 05:46:10.920727 30031 slave.cpp:796] Agent terminating
[       OK ] Endpoint/SlaveEndpointTest.AuthorizedRequest/2 (26 ms)
[ RUN      ] Endpoint/SlaveEndpointTest.UnauthorizedRequest/0
I0110 05:46:10.929541 30002 containerizer.cpp:220] Using isolation: posix/cpu,posix/mem,filesystem/posix,network/cni
W0110 05:46:10.930025 30002 backend.cpp:76] Failed to create 'aufs' backend: AufsBackend requires
root privileges, but is running as user mesos
W0110 05:46:10.930164 30002 backend.cpp:76] Failed to create 'bind' backend: BindBackend requires
root privileges
I0110 05:46:10.933187 30027 slave.cpp:209] Mesos agent started on (683)@172.17.0.2:53978
I0110 05:46:10.933351 30027 slave.cpp:210] Flags at startup: --acls="" --appc_simple_discovery_uri_prefix="http://"
--appc_store_dir="/tmp/mesos/store/appc" --authenticate_http_readonly="true" --authenticate_http_readwrite="true"
--authenticatee="crammd5" --authentication_backoff_factor="1secs" --authorizer="local" --cgroups_cpu_enable_pids_and_tids_count="false"
--cgroups_enable_cfs="false" --cgroups_hierarchy="/sys/fs/cgroup" --cgroups_limit_swap="false"
--cgroups_root="mesos" --container_disk_watch_interval="15secs" --containerizers="mesos" --credential="/tmp/Endpoint_SlaveEndpointTest_UnauthorizedRequest_0_h9RM7u/credential"
--default_role="*" --disk_watch_interval="1mins" --docker="docker" --docker_kill_orphans="true"
--docker_registry="https://registry-1.docker.io" --docker_remove_delay="6hrs" --docker_socket="/var/run/docker.sock"
--docker_stop_timeout="0ns" --docker_store_dir="/tmp/mesos/store/docker" --docker_volume_checkpoint_dir="/var/run/mesos/isolators/docker/volume"
--enforce_container_disk_quota="false" --executor_registration_timeout="1mins" --executor_shutdown_grace_period="5secs"
--fetcher_cache_dir="/tmp/Endpoint_SlaveEndpointTest_UnauthorizedRequest_0_h9RM7u/fetch" --fetcher_cache_size="2GB"
--frameworks_home="" --gc_delay="1weeks" --gc_disk_headroom="0.1" --hadoop_home="" --help="false"
--hostname_lookup="true" --http_authenticators="basic" --http_command_executor="false" --http_credentials="/tmp/Endpoint_SlaveEndpointTest_UnauthorizedRequest_0_h9RM7u/http_credentials"
--http_heartbeat_interval="30secs" --image_provisioner_backend="copy" --initialize_driver_logging="true"
--isolation="posix/cpu,posix/mem" --launcher="posix" --launcher_dir="/mesos/mesos-1.2.0/_build/src"
--logbufsecs="0" --logging_level="INFO" --max_completed_executors_per_framework="150" --oversubscribed_resources_interval="15secs"
--perf_duration="10secs" --perf_interval="1mins" --qos_correction_interval_min="0ns" --quiet="false"
--recover="reconnect" --recovery_timeout="15mins" --registration_backoff_factor="10ms" --resources="cpus:2;gpus:0;mem:1024;disk:1024;ports:[31000-32000]"
--revocable_cpu_low_priority="true" --runtime_dir="/tmp/Endpoint_SlaveEndpointTest_UnauthorizedRequest_0_h9RM7u"
--sandbox_directory="/mnt/mesos/sandbox" --strict="true" --switch_user="true" --systemd_enable_support="true"
--systemd_runtime_directory="/run/systemd/system" --version="false" --work_dir="/tmp/Endpoint_SlaveEndpointTest_UnauthorizedRequest_0_vURPc1"
I0110 05:46:10.933759 30027 credentials.hpp:86] Loading credential for authentication from
'/tmp/Endpoint_SlaveEndpointTest_UnauthorizedRequest_0_h9RM7u/credential'
I0110 05:46:10.933899 30027 slave.cpp:352] Agent using credential for: test-principal
I0110 05:46:10.933920 30027 credentials.hpp:37] Loading credentials for authentication from
'/tmp/Endpoint_SlaveEndpointTest_UnauthorizedRequest_0_h9RM7u/http_credentials'
I0110 05:46:10.934145 30027 http.cpp:922] Using default 'basic' HTTP authenticator for realm
'mesos-agent-readonly'
I0110 05:46:10.934268 30027 http.cpp:922] Using default 'basic' HTTP authenticator for realm
'mesos-agent-readwrite'
I0110 05:46:10.935295 30027 slave.cpp:539] Agent resources: cpus(*):2; mem(*):1024; disk(*):1024;
ports(*):[31000-32000]
I0110 05:46:10.935384 30027 slave.cpp:547] Agent attributes: [  ]
I0110 05:46:10.935405 30027 slave.cpp:552] Agent hostname: 1234e5da29c7
I0110 05:46:10.936808 30023 state.cpp:60] Recovering state from '/tmp/Endpoint_SlaveEndpointTest_UnauthorizedRequest_0_vURPc1/meta'
I0110 05:46:10.937116 30028 status_update_manager.cpp:203] Recovering status update manager
I0110 05:46:10.937304 30028 containerizer.cpp:599] Recovering containerizer
I0110 05:46:10.938626 30036 provisioner.cpp:251] Provisioner recovery complete
I0110 05:46:10.939013 30023 slave.cpp:5421] Finished recovery
I0110 05:46:10.939707 30023 slave.cpp:5595] Querying resource estimator for oversubscribable
resources
I0110 05:46:10.939991 30026 slave.cpp:5609] Received oversubscribable resources {} from the
resource estimator
I0110 05:46:10.943399 30028 process.cpp:3676] Handling HTTP event for process 'slave(683)'
with path: '/slave(683)/monitor/statistics'
I0110 05:46:10.944671 30024 http.cpp:874] Authorizing principal 'test-principal' to GET the
'/monitor/statistics' endpoint
I0110 05:46:10.947517 30035 slave.cpp:796] Agent terminating
[       OK ] Endpoint/SlaveEndpointTest.UnauthorizedRequest/0 (26 ms)
[ RUN      ] Endpoint/SlaveEndpointTest.UnauthorizedRequest/1
I0110 05:46:10.956205 30002 containerizer.cpp:220] Using isolation: posix/cpu,posix/mem,filesystem/posix,network/cni
W0110 05:46:10.956727 30002 backend.cpp:76] Failed to create 'aufs' backend: AufsBackend requires
root privileges, but is running as user mesos
W0110 05:46:10.956882 30002 backend.cpp:76] Failed to create 'bind' backend: BindBackend requires
root privileges
I0110 05:46:10.959636 30034 slave.cpp:209] Mesos agent started on (684)@172.17.0.2:53978
I0110 05:46:10.959687 30034 slave.cpp:210] Flags at startup: --acls="" --appc_simple_discovery_uri_prefix="http://"
--appc_store_dir="/tmp/mesos/store/appc" --authenticate_http_readonly="true" --authenticate_http_readwrite="true"
--authenticatee="crammd5" --authentication_backoff_factor="1secs" --authorizer="local" --cgroups_cpu_enable_pids_and_tids_count="false"
--cgroups_enable_cfs="false" --cgroups_hierarchy="/sys/fs/cgroup" --cgroups_limit_swap="false"
--cgroups_root="mesos" --container_disk_watch_interval="15secs" --containerizers="mesos" --credential="/tmp/Endpoint_SlaveEndpointTest_UnauthorizedRequest_1_Fkqd2q/credential"
--default_role="*" --disk_watch_interval="1mins" --docker="docker" --docker_kill_orphans="true"
--docker_registry="https://registry-1.docker.io" --docker_remove_delay="6hrs" --docker_socket="/var/run/docker.sock"
--docker_stop_timeout="0ns" --docker_store_dir="/tmp/mesos/store/docker" --docker_volume_checkpoint_dir="/var/run/mesos/isolators/docker/volume"
--enforce_container_disk_quota="false" --executor_registration_timeout="1mins" --executor_shutdown_grace_period="5secs"
--fetcher_cache_dir="/tmp/Endpoint_SlaveEndpointTest_UnauthorizedRequest_1_Fkqd2q/fetch" --fetcher_cache_size="2GB"
--frameworks_home="" --gc_delay="1weeks" --gc_disk_headroom="0.1" --hadoop_home="" --help="false"
--hostname_lookup="true" --http_authenticators="basic" --http_command_executor="false" --http_credentials="/tmp/Endpoint_SlaveEndpointTest_UnauthorizedRequest_1_Fkqd2q/http_credentials"
--http_heartbeat_interval="30secs" --image_provisioner_backend="copy" --initialize_driver_logging="true"
--isolation="posix/cpu,posix/mem" --launcher="posix" --launcher_dir="/mesos/mesos-1.2.0/_build/src"
--logbufsecs="0" --logging_level="INFO" --max_completed_executors_per_framework="150" --oversubscribed_resources_interval="15secs"
--perf_duration="10secs" --perf_interval="1mins" --qos_correction_interval_min="0ns" --quiet="false"
--recover="reconnect" --recovery_timeout="15mins" --registration_backoff_factor="10ms" --resources="cpus:2;gpus:0;mem:1024;disk:1024;ports:[31000-32000]"
--revocable_cpu_low_priority="true" --runtime_dir="/tmp/Endpoint_SlaveEndpointTest_UnauthorizedRequest_1_Fkqd2q"
--sandbox_directory="/mnt/mesos/sandbox" --strict="true" --switch_user="true" --systemd_enable_support="true"
--systemd_runtime_directory="/run/systemd/system" --version="false" --work_dir="/tmp/Endpoint_SlaveEndpointTest_UnauthorizedRequest_1_VTKV2W"
I0110 05:46:10.960489 30034 credentials.hpp:86] Loading credential for authentication from
'/tmp/Endpoint_SlaveEndpointTest_UnauthorizedRequest_1_Fkqd2q/credential'
I0110 05:46:10.960777 30034 slave.cpp:352] Agent using credential for: test-principal
I0110 05:46:10.960803 30034 credentials.hpp:37] Loading credentials for authentication from
'/tmp/Endpoint_SlaveEndpointTest_UnauthorizedRequest_1_Fkqd2q/http_credentials'
I0110 05:46:10.961021 30034 http.cpp:922] Using default 'basic' HTTP authenticator for realm
'mesos-agent-readonly'
I0110 05:46:10.961213 30034 http.cpp:922] Using default 'basic' HTTP authenticator for realm
'mesos-agent-readwrite'
I0110 05:46:10.962237 30034 slave.cpp:539] Agent resources: cpus(*):2; mem(*):1024; disk(*):1024;
ports(*):[31000-32000]
I0110 05:46:10.962311 30034 slave.cpp:547] Agent attributes: [  ]
I0110 05:46:10.962324 30034 slave.cpp:552] Agent hostname: 1234e5da29c7
I0110 05:46:10.963819 30035 state.cpp:60] Recovering state from '/tmp/Endpoint_SlaveEndpointTest_UnauthorizedRequest_1_VTKV2W/meta'
I0110 05:46:10.964272 30023 status_update_manager.cpp:203] Recovering status update manager
I0110 05:46:10.964467 30022 containerizer.cpp:599] Recovering containerizer
I0110 05:46:10.965944 30023 provisioner.cpp:251] Provisioner recovery complete
I0110 05:46:10.966384 30027 slave.cpp:5421] Finished recovery
I0110 05:46:10.966850 30027 slave.cpp:5595] Querying resource estimator for oversubscribable
resources
I0110 05:46:10.967113 30034 slave.cpp:5609] Received oversubscribable resources {} from the
resource estimator
I0110 05:46:10.969846 30029 process.cpp:3676] Handling HTTP event for process 'slave(684)'
with path: '/slave(684)/monitor/statistics.json'
I0110 05:46:10.971371 30032 http.cpp:874] Authorizing principal 'test-principal' to GET the
'/monitor/statistics.json' endpoint
I0110 05:46:10.974369 30031 slave.cpp:796] Agent terminating
[       OK ] Endpoint/SlaveEndpointTest.UnauthorizedRequest/1 (26 ms)
[ RUN      ] Endpoint/SlaveEndpointTest.UnauthorizedRequest/2
I0110 05:46:10.982949 30002 containerizer.cpp:220] Using isolation: posix/cpu,posix/mem,filesystem/posix,network/cni
W0110 05:46:10.983489 30002 backend.cpp:76] Failed to create 'aufs' backend: AufsBackend requires
root privileges, but is running as user mesos
W0110 05:46:10.983628 30002 backend.cpp:76] Failed to create 'bind' backend: BindBackend requires
root privileges
I0110 05:46:10.986608 30032 slave.cpp:209] Mesos agent started on (685)@172.17.0.2:53978
I0110 05:46:10.986631 30032 slave.cpp:210] Flags at startup: --acls="" --appc_simple_discovery_uri_prefix="http://"
--appc_store_dir="/tmp/mesos/store/appc" --authenticate_http_readonly="true" --authenticate_http_readwrite="true"
--authenticatee="crammd5" --authentication_backoff_factor="1secs" --authorizer="local" --cgroups_cpu_enable_pids_and_tids_count="false"
--cgroups_enable_cfs="false" --cgroups_hierarchy="/sys/fs/cgroup" --cgroups_limit_swap="false"
--cgroups_root="mesos" --container_disk_watch_interval="15secs" --containerizers="mesos" --credential="/tmp/Endpoint_SlaveEndpointTest_UnauthorizedRequest_2_pqr8dn/credential"
--default_role="*" --disk_watch_interval="1mins" --docker="docker" --docker_kill_orphans="true"
--docker_registry="https://registry-1.docker.io" --docker_remove_delay="6hrs" --docker_socket="/var/run/docker.sock"
--docker_stop_timeout="0ns" --docker_store_dir="/tmp/mesos/store/docker" --docker_volume_checkpoint_dir="/var/run/mesos/isolators/docker/volume"
--enforce_container_disk_quota="false" --executor_registration_timeout="1mins" --executor_shutdown_grace_period="5secs"
--fetcher_cache_dir="/tmp/Endpoint_SlaveEndpointTest_UnauthorizedRequest_2_pqr8dn/fetch" --fetcher_cache_size="2GB"
--frameworks_home="" --gc_delay="1weeks" --gc_disk_headroom="0.1" --hadoop_home="" --help="false"
--hostname_lookup="true" --http_authenticators="basic" --http_command_executor="false" --http_credentials="/tmp/Endpoint_SlaveEndpointTest_UnauthorizedRequest_2_pqr8dn/http_credentials"
--http_heartbeat_interval="30secs" --image_provisioner_backend="copy" --initialize_driver_logging="true"
--isolation="posix/cpu,posix/mem" --launcher="posix" --launcher_dir="/mesos/mesos-1.2.0/_build/src"
--logbufsecs="0" --logging_level="INFO" --max_completed_executors_per_framework="150" --oversubscribed_resources_interval="15secs"
--perf_duration="10secs" --perf_interval="1mins" --qos_correction_interval_min="0ns" --quiet="false"
--recover="reconnect" --recovery_timeout="15mins" --registration_backoff_factor="10ms" --resources="cpus:2;gpus:0;mem:1024;disk:1024;ports:[31000-32000]"
--revocable_cpu_low_priority="true" --runtime_dir="/tmp/Endpoint_SlaveEndpointTest_UnauthorizedRequest_2_pqr8dn"
--sandbox_directory="/mnt/mesos/sandbox" --strict="true" --switch_user="true" --systemd_enable_support="true"
--systemd_runtime_directory="/run/systemd/system" --version="false" --work_dir="/tmp/Endpoint_SlaveEndpointTest_UnauthorizedRequest_2_fqovaT"
I0110 05:46:10.987092 30032 credentials.hpp:86] Loading credential for authentication from
'/tmp/Endpoint_SlaveEndpointTest_UnauthorizedRequest_2_pqr8dn/credential'
I0110 05:46:10.987239 30032 slave.cpp:352] Agent using credential for: test-principal
I0110 05:46:10.987268 30032 credentials.hpp:37] Loading credentials for authentication from
'/tmp/Endpoint_SlaveEndpointTest_UnauthorizedRequest_2_pqr8dn/http_credentials'
I0110 05:46:10.987480 30032 http.cpp:922] Using default 'basic' HTTP authenticator for realm
'mesos-agent-readonly'
I0110 05:46:10.987598 30032 http.cpp:922] Using default 'basic' HTTP authenticator for realm
'mesos-agent-readwrite'
I0110 05:46:10.988668 30032 slave.cpp:539] Agent resources: cpus(*):2; mem(*):1024; disk(*):1024;
ports(*):[31000-32000]
I0110 05:46:10.988751 30032 slave.cpp:547] Agent attributes: [  ]
I0110 05:46:10.988773 30032 slave.cpp:552] Agent hostname: 1234e5da29c7
I0110 05:46:10.990200 30035 state.cpp:60] Recovering state from '/tmp/Endpoint_SlaveEndpointTest_UnauthorizedRequest_2_fqovaT/meta'
I0110 05:46:10.990536 30032 status_update_manager.cpp:203] Recovering status update manager
I0110 05:46:10.990711 30031 containerizer.cpp:599] Recovering containerizer
I0110 05:46:10.992038 30026 provisioner.cpp:251] Provisioner recovery complete
I0110 05:46:10.992465 30029 slave.cpp:5421] Finished recovery
I0110 05:46:10.992949 30029 slave.cpp:5595] Querying resource estimator for oversubscribable
resources
I0110 05:46:10.993197 30024 slave.cpp:5609] Received oversubscribable resources {} from the
resource estimator
I0110 05:46:10.996075 30021 process.cpp:3676] Handling HTTP event for process 'slave(685)'
with path: '/slave(685)/containers'
I0110 05:46:10.997275 30033 http.cpp:874] Authorizing principal 'test-principal' to GET the
'/containers' endpoint
I0110 05:46:10.999647 30032 slave.cpp:796] Agent terminating
[       OK ] Endpoint/SlaveEndpointTest.UnauthorizedRequest/2 (25 ms)
[ RUN      ] Endpoint/SlaveEndpointTest.NoAuthorizer/0
I0110 05:46:11.008795 30002 containerizer.cpp:220] Using isolation: posix/cpu,posix/mem,filesystem/posix,network/cni
W0110 05:46:11.009330 30002 backend.cpp:76] Failed to create 'aufs' backend: AufsBackend requires
root privileges, but is running as user mesos
W0110 05:46:11.009477 30002 backend.cpp:76] Failed to create 'bind' backend: BindBackend requires
root privileges
I0110 05:46:11.010993 30002 cluster.cpp:446] Creating default 'local' authorizer
I0110 05:46:11.012446 30030 slave.cpp:209] Mesos agent started on (686)@172.17.0.2:53978
I0110 05:46:11.012475 30030 slave.cpp:210] Flags at startup: --acls="" --appc_simple_discovery_uri_prefix="http://"
--appc_store_dir="/tmp/mesos/store/appc" --authenticate_http_readonly="true" --authenticate_http_readwrite="true"
--authenticatee="crammd5" --authentication_backoff_factor="1secs" --authorizer="local" --cgroups_cpu_enable_pids_and_tids_count="false"
--cgroups_enable_cfs="false" --cgroups_hierarchy="/sys/fs/cgroup" --cgroups_limit_swap="false"
--cgroups_root="mesos" --container_disk_watch_interval="15secs" --containerizers="mesos" --credential="/tmp/Endpoint_SlaveEndpointTest_NoAuthorizer_0_99XHGj/credential"
--default_role="*" --disk_watch_interval="1mins" --docker="docker" --docker_kill_orphans="true"
--docker_registry="https://registry-1.docker.io" --docker_remove_delay="6hrs" --docker_socket="/var/run/docker.sock"
--docker_stop_timeout="0ns" --docker_store_dir="/tmp/mesos/store/docker" --docker_volume_checkpoint_dir="/var/run/mesos/isolators/docker/volume"
--enforce_container_disk_quota="false" --executor_registration_timeout="1mins" --executor_shutdown_grace_period="5secs"
--fetcher_cache_dir="/tmp/Endpoint_SlaveEndpointTest_NoAuthorizer_0_99XHGj/fetch" --fetcher_cache_size="2GB"
--frameworks_home="" --gc_delay="1weeks" --gc_disk_headroom="0.1" --hadoop_home="" --help="false"
--hostname_lookup="true" --http_authenticators="basic" --http_command_executor="false" --http_credentials="/tmp/Endpoint_SlaveEndpointTest_NoAuthorizer_0_99XHGj/http_credentials"
--http_heartbeat_interval="30secs" --image_provisioner_backend="copy" --initialize_driver_logging="true"
--isolation="posix/cpu,posix/mem" --launcher="posix" --launcher_dir="/mesos/mesos-1.2.0/_build/src"
--logbufsecs="0" --logging_level="INFO" --max_completed_executors_per_framework="150" --oversubscribed_resources_interval="15secs"
--perf_duration="10secs" --perf_interval="1mins" --qos_correction_interval_min="0ns" --quiet="false"
--recover="reconnect" --recovery_timeout="15mins" --registration_backoff_factor="10ms" --resources="cpus:2;gpus:0;mem:1024;disk:1024;ports:[31000-32000]"
--revocable_cpu_low_priority="true" --runtime_dir="/tmp/Endpoint_SlaveEndpointTest_NoAuthorizer_0_99XHGj"
--sandbox_directory="/mnt/mesos/sandbox" --strict="true" --switch_user="true" --systemd_enable_support="true"
--systemd_runtime_directory="/run/systemd/system" --version="false" --work_dir="/tmp/Endpoint_SlaveEndpointTest_NoAuthorizer_0_tdZVyP"
I0110 05:46:11.013213 30030 credentials.hpp:86] Loading credential for authentication from
'/tmp/Endpoint_SlaveEndpointTest_NoAuthorizer_0_99XHGj/credential'
I0110 05:46:11.013411 30030 slave.cpp:352] Agent using credential for: test-principal
I0110 05:46:11.013442 30030 credentials.hpp:37] Loading credentials for authentication from
'/tmp/Endpoint_SlaveEndpointTest_NoAuthorizer_0_99XHGj/http_credentials'
I0110 05:46:11.013763 30030 http.cpp:922] Using default 'basic' HTTP authenticator for realm
'mesos-agent-readonly'
I0110 05:46:11.013924 30030 http.cpp:922] Using default 'basic' HTTP authenticator for realm
'mesos-agent-readwrite'
I0110 05:46:11.015602 30030 slave.cpp:539] Agent resources: cpus(*):2; mem(*):1024; disk(*):1024;
ports(*):[31000-32000]
I0110 05:46:11.015733 30030 slave.cpp:547] Agent attributes: [  ]
I0110 05:46:11.015758 30030 slave.cpp:552] Agent hostname: 1234e5da29c7
I0110 05:46:11.017679 30036 state.cpp:60] Recovering state from '/tmp/Endpoint_SlaveEndpointTest_NoAuthorizer_0_tdZVyP/meta'
I0110 05:46:11.017992 30033 status_update_manager.cpp:203] Recovering status update manager
I0110 05:46:11.018193 30021 containerizer.cpp:599] Recovering containerizer
I0110 05:46:11.019565 30032 provisioner.cpp:251] Provisioner recovery complete
I0110 05:46:11.019959 30028 slave.cpp:5421] Finished recovery
I0110 05:46:11.020413 30028 slave.cpp:5595] Querying resource estimator for oversubscribable
resources
I0110 05:46:11.020707 30031 slave.cpp:5609] Received oversubscribable resources {} from the
resource estimator
I0110 05:46:11.023694 30024 process.cpp:3676] Handling HTTP event for process 'slave(686)'
with path: '/slave(686)/monitor/statistics'
I0110 05:46:11.024874 30027 http.cpp:874] Authorizing principal 'test-principal' to GET the
'/monitor/statistics' endpoint
I0110 05:46:11.028870 30025 slave.cpp:796] Agent terminating
[       OK ] Endpoint/SlaveEndpointTest.NoAuthorizer/0 (28 ms)
[ RUN      ] Endpoint/SlaveEndpointTest.NoAuthorizer/1
I0110 05:46:11.037215 30002 containerizer.cpp:220] Using isolation: posix/cpu,posix/mem,filesystem/posix,network/cni
W0110 05:46:11.037695 30002 backend.cpp:76] Failed to create 'aufs' backend: AufsBackend requires
root privileges, but is running as user mesos
W0110 05:46:11.037844 30002 backend.cpp:76] Failed to create 'bind' backend: BindBackend requires
root privileges
I0110 05:46:11.039355 30002 cluster.cpp:446] Creating default 'local' authorizer
I0110 05:46:11.040714 30036 slave.cpp:209] Mesos agent started on (687)@172.17.0.2:53978
I0110 05:46:11.040738 30036 slave.cpp:210] Flags at startup: --acls="" --appc_simple_discovery_uri_prefix="http://"
--appc_store_dir="/tmp/mesos/store/appc" --authenticate_http_readonly="true" --authenticate_http_readwrite="true"
--authenticatee="crammd5" --authentication_backoff_factor="1secs" --authorizer="local" --cgroups_cpu_enable_pids_and_tids_count="false"
--cgroups_enable_cfs="false" --cgroups_hierarchy="/sys/fs/cgroup" --cgroups_limit_swap="false"
--cgroups_root="mesos" --container_disk_watch_interval="15secs" --containerizers="mesos" --credential="/tmp/Endpoint_SlaveEndpointTest_NoAuthorizer_1_jPpErg/credential"
--default_role="*" --disk_watch_interval="1mins" --docker="docker" --docker_kill_orphans="true"
--docker_registry="https://registry-1.docker.io" --docker_remove_delay="6hrs" --docker_socket="/var/run/docker.sock"
--docker_stop_timeout="0ns" --docker_store_dir="/tmp/mesos/store/docker" --docker_volume_checkpoint_dir="/var/run/mesos/isolators/docker/volume"
--enforce_container_disk_quota="false" --executor_registration_timeout="1mins" --executor_shutdown_grace_period="5secs"
--fetcher_cache_dir="/tmp/Endpoint_SlaveEndpointTest_NoAuthorizer_1_jPpErg/fetch" --fetcher_cache_size="2GB"
--frameworks_home="" --gc_delay="1weeks" --gc_disk_headroom="0.1" --hadoop_home="" --help="false"
--hostname_lookup="true" --http_authenticators="basic" --http_command_executor="false" --http_credentials="/tmp/Endpoint_SlaveEndpointTest_NoAuthorizer_1_jPpErg/http_credentials"
--http_heartbeat_interval="30secs" --image_provisioner_backend="copy" --initialize_driver_logging="true"
--isolation="posix/cpu,posix/mem" --launcher="posix" --launcher_dir="/mesos/mesos-1.2.0/_build/src"
--logbufsecs="0" --logging_level="INFO" --max_completed_executors_per_framework="150" --oversubscribed_resources_interval="15secs"
--perf_duration="10secs" --perf_interval="1mins" --qos_correction_interval_min="0ns" --quiet="false"
--recover="reconnect" --recovery_timeout="15mins" --registration_backoff_factor="10ms" --resources="cpus:2;gpus:0;mem:1024;disk:1024;ports:[31000-32000]"
--revocable_cpu_low_priority="true" --runtime_dir="/tmp/Endpoint_SlaveEndpointTest_NoAuthorizer_1_jPpErg"
--sandbox_directory="/mnt/mesos/sandbox" --strict="true" --switch_user="true" --systemd_enable_support="true"
--systemd_runtime_directory="/run/systemd/system" --version="false" --work_dir="/tmp/Endpoint_SlaveEndpointTest_NoAuthorizer_1_LJlffM"
I0110 05:46:11.041302 30036 credentials.hpp:86] Loading credential for authentication from
'/tmp/Endpoint_SlaveEndpointTest_NoAuthorizer_1_jPpErg/credential'
I0110 05:46:11.041460 30036 slave.cpp:352] Agent using credential for: test-principal
I0110 05:46:11.041487 30036 credentials.hpp:37] Loading credentials for authentication from
'/tmp/Endpoint_SlaveEndpointTest_NoAuthorizer_1_jPpErg/http_credentials'
I0110 05:46:11.041744 30036 http.cpp:922] Using default 'basic' HTTP authenticator for realm
'mesos-agent-readonly'
I0110 05:46:11.041899 30036 http.cpp:922] Using default 'basic' HTTP authenticator for realm
'mesos-agent-readwrite'
I0110 05:46:11.042963 30036 slave.cpp:539] Agent resources: cpus(*):2; mem(*):1024; disk(*):1024;
ports(*):[31000-32000]
I0110 05:46:11.043040 30036 slave.cpp:547] Agent attributes: [  ]
I0110 05:46:11.043059 30036 slave.cpp:552] Agent hostname: 1234e5da29c7
I0110 05:46:11.044714 30027 state.cpp:60] Recovering state from '/tmp/Endpoint_SlaveEndpointTest_NoAuthorizer_1_LJlffM/meta'
I0110 05:46:11.044975 30026 status_update_manager.cpp:203] Recovering status update manager
I0110 05:46:11.047438 30021 containerizer.cpp:599] Recovering containerizer
I0110 05:46:11.048851 30023 provisioner.cpp:251] Provisioner recovery complete
I0110 05:46:11.049198 30023 slave.cpp:5421] Finished recovery
I0110 05:46:11.049716 30023 slave.cpp:5595] Querying resource estimator for oversubscribable
resources
I0110 05:46:11.050078 30026 slave.cpp:5609] Received oversubscribable resources {} from the
resource estimator
I0110 05:46:11.053064 30025 process.cpp:3676] Handling HTTP event for process 'slave(687)'
with path: '/slave(687)/monitor/statistics.json'
I0110 05:46:11.054352 30032 http.cpp:874] Authorizing principal 'test-principal' to GET the
'/monitor/statistics.json' endpoint
I0110 05:46:11.058063 30031 slave.cpp:796] Agent terminating
[       OK ] Endpoint/SlaveEndpointTest.NoAuthorizer/1 (29 ms)
[ RUN      ] Endpoint/SlaveEndpointTest.NoAuthorizer/2
I0110 05:46:11.067613 30002 containerizer.cpp:220] Using isolation: posix/cpu,posix/mem,filesystem/posix,network/cni
W0110 05:46:11.068132 30002 backend.cpp:76] Failed to create 'aufs' backend: AufsBackend requires
root privileges, but is running as user mesos
W0110 05:46:11.068305 30002 backend.cpp:76] Failed to create 'bind' backend: BindBackend requires
root privileges
I0110 05:46:11.069978 30002 cluster.cpp:446] Creating default 'local' authorizer
I0110 05:46:11.071563 30027 slave.cpp:209] Mesos agent started on (688)@172.17.0.2:53978
I0110 05:46:11.071602 30027 slave.cpp:210] Flags at startup: --acls="" --appc_simple_discovery_uri_prefix="http://"
--appc_store_dir="/tmp/mesos/store/appc" --authenticate_http_readonly="true" --authenticate_http_readwrite="true"
--authenticatee="crammd5" --authentication_backoff_factor="1secs" --authorizer="local" --cgroups_cpu_enable_pids_and_tids_count="false"
--cgroups_enable_cfs="false" --cgroups_hierarchy="/sys/fs/cgroup" --cgroups_limit_swap="false"
--cgroups_root="mesos" --container_disk_watch_interval="15secs" --containerizers="mesos" --credential="/tmp/Endpoint_SlaveEndpointTest_NoAuthorizer_2_EPL5vd/credential"
--default_role="*" --disk_watch_interval="1mins" --docker="docker" --docker_kill_orphans="true"
--docker_registry="https://registry-1.docker.io" --docker_remove_delay="6hrs" --docker_socket="/var/run/docker.sock"
--docker_stop_timeout="0ns" --docker_store_dir="/tmp/mesos/store/docker" --docker_volume_checkpoint_dir="/var/run/mesos/isolators/docker/volume"
--enforce_container_disk_quota="false" --executor_registration_timeout="1mins" --executor_shutdown_grace_period="5secs"
--fetcher_cache_dir="/tmp/Endpoint_SlaveEndpointTest_NoAuthorizer_2_EPL5vd/fetch" --fetcher_cache_size="2GB"
--frameworks_home="" --gc_delay="1weeks" --gc_disk_headroom="0.1" --hadoop_home="" --help="false"
--hostname_lookup="true" --http_authenticators="basic" --http_command_executor="false" --http_credentials="/tmp/Endpoint_SlaveEndpointTest_NoAuthorizer_2_EPL5vd/http_credentials"
--http_heartbeat_interval="30secs" --image_provisioner_backend="copy" --initialize_driver_logging="true"
--isolation="posix/cpu,posix/mem" --launcher="posix" --launcher_dir="/mesos/mesos-1.2.0/_build/src"
--logbufsecs="0" --logging_level="INFO" --max_completed_executors_per_framework="150" --oversubscribed_resources_interval="15secs"
--perf_duration="10secs" --perf_interval="1mins" --qos_correction_interval_min="0ns" --quiet="false"
--recover="reconnect" --recovery_timeout="15mins" --registration_backoff_factor="10ms" --resources="cpus:2;gpus:0;mem:1024;disk:1024;ports:[31000-32000]"
--revocable_cpu_low_priority="true" --runtime_dir="/tmp/Endpoint_SlaveEndpointTest_NoAuthorizer_2_EPL5vd"
--sandbox_directory="/mnt/mesos/sandbox" --strict="true" --switch_user="true" --systemd_enable_support="true"
--systemd_runtime_directory="/run/systemd/system" --version="false" --work_dir="/tmp/Endpoint_SlaveEndpointTest_NoAuthorizer_2_PaALeJ"
I0110 05:46:11.072408 30027 credentials.hpp:86] Loading credential for authentication from
'/tmp/Endpoint_SlaveEndpointTest_NoAuthorizer_2_EPL5vd/credential'
I0110 05:46:11.072649 30027 slave.cpp:352] Agent using credential for: test-principal
I0110 05:46:11.072676 30027 credentials.hpp:37] Loading credentials for authentication from
'/tmp/Endpoint_SlaveEndpointTest_NoAuthorizer_2_EPL5vd/http_credentials'
I0110 05:46:11.072927 30027 http.cpp:922] Using default 'basic' HTTP authenticator for realm
'mesos-agent-readonly'
I0110 05:46:11.073079 30027 http.cpp:922] Using default 'basic' HTTP authenticator for realm
'mesos-agent-readwrite'
I0110 05:46:11.074120 30027 slave.cpp:539] Agent resources: cpus(*):2; mem(*):1024; disk(*):1024;
ports(*):[31000-32000]
I0110 05:46:11.074201 30027 slave.cpp:547] Agent attributes: [  ]
I0110 05:46:11.074219 30027 slave.cpp:552] Agent hostname: 1234e5da29c7
I0110 05:46:11.075631 30035 state.cpp:60] Recovering state from '/tmp/Endpoint_SlaveEndpointTest_NoAuthorizer_2_PaALeJ/meta'
I0110 05:46:11.075979 30036 status_update_manager.cpp:203] Recovering status update manager
I0110 05:46:11.076179 30027 containerizer.cpp:599] Recovering containerizer
I0110 05:46:11.077625 30029 provisioner.cpp:251] Provisioner recovery complete
I0110 05:46:11.077980 30035 slave.cpp:5421] Finished recovery
I0110 05:46:11.078549 30035 slave.cpp:5595] Querying resource estimator for oversubscribable
resources
I0110 05:46:11.078940 30027 slave.cpp:5609] Received oversubscribable resources {} from the
resource estimator
I0110 05:46:11.081859 30036 process.cpp:3676] Handling HTTP event for process 'slave(688)'
with path: '/slave(688)/containers'
I0110 05:46:11.083483 30027 http.cpp:874] Authorizing principal 'test-principal' to GET the
'/containers' endpoint
I0110 05:46:11.087858 30002 slave.cpp:796] Agent terminating
[       OK ] Endpoint/SlaveEndpointTest.NoAuthorizer/2 (29 ms)
[----------] 9 tests from Endpoint/SlaveEndpointTest (253 ms total)

[----------] Global test environment tear-down
[==========] 1451 tests from 165 test cases ran. (411687 ms total)
[  PASSED  ] 1450 tests.
[  FAILED  ] 1 test, listed below:
[  FAILED  ] SlaveRecoveryTest/0.RecoverTerminatedExecutor, where TypeParam = mesos::internal::slave::MesosContainerizer

 1 FAILED TEST
  YOU HAVE 9 DISABLED TESTS

make[4]: *** [check-local] Error 1
make[4]: Leaving directory `/mesos/mesos-1.2.0/_build/src'
make[3]: *** [check-am] Error 2
make[3]: Leaving directory `/mesos/mesos-1.2.0/_build/src'
make[2]: *** [check] Error 2
make[2]: Leaving directory `/mesos/mesos-1.2.0/_build/src'
make[1]: *** [check-recursive] Error 1
make[1]: Leaving directory `/mesos/mesos-1.2.0/_build'
make: *** [distcheck] Error 1
+ docker rmi mesos-1484024509-7694
Untagged: mesos-1484024509-7694:latest
Deleted: sha256:7e1210bdb15177af10170cf5a04df8187d2e06ab8ce4b9eec2e25b88e50cd876
Deleted: sha256:4cb2353befe4609c53481e1ae636fc6d40af3bf4dc1aa7b9eeb793516a69c38a
Deleted: sha256:f373c135db14b0e6fd65d5d6310db3be18f14fb984981b491531f7dd6aa60469
Deleted: sha256:1a0ab9322906873be3e371f9acc281d6e83902a3babb812369ef07ea06a5e35b
Deleted: sha256:4cd63346e85b12e4c334d9b5301b593b3a458f15f55475e126e80933938d99a4
Deleted: sha256:bdf48fd89518ea73aa4ba7386168af13f2fb6922ff8160fa01eafc439fa3aee9
Deleted: sha256:fa9cf0b4a98d698e53214cf57914d5f292b12a81bd1a59c5763c900f329ccbdd
Deleted: sha256:2278366d80da7b5fb712ec5d59dbb72588861dcba48e880a5345b674e33b23bb
Deleted: sha256:1dd061b02db920b040f0c9f345a6742b156138f6a59fb35a082e8eafc672029e
Deleted: sha256:b8c7a9775a6b87e5601a6b20d5c246f43864b945f85e702d08ea996ac8c6f433
Deleted: sha256:598ba96a44f6194d90371693660924e46549c734047ec610bd2c79e87b6f44f8
Deleted: sha256:0a4bcf84c1a0562715663023e86a940950028946a7844d92dcc7871839650e4a
Deleted: sha256:26d9e31786642a051bdbe5f03cfe579b790de244775802e8205f23bf37238c2f
Deleted: sha256:44fbfca2a6d4a412853e7ea89928ee353f1418981a4122f9bcd622cb705c94a5
Deleted: sha256:92584b015f293efd1e2f8ce9d4b3314f743e41e2917687e8ef80ffacfb17dc0a
Deleted: sha256:989173c4ff4f68705a2f48ef5604908b0cb13faa45101de32a40d3b163daaafb
Deleted: sha256:92db6cc0c78c7826b11c9e07e7889be5175db52910940287ba45f7d5d356b62b
Deleted: sha256:a0869b552c989aee1e1f23e09b772a3bb2b3ba75c67cdea07e802bd8c7ac607c
Deleted: sha256:581e95f20b9d055d25984226aa4eedbc44d3534561bc4171aa8fd130d4ce7ab1
Deleted: sha256:174d83fb1ce8c4f5b90b2eabf753b08ada36f237e02c420ae1f74613966fc45e
Deleted: sha256:7223d7fb2ef059c9b7174c8df53965fee3a71b8b7fec1b6953ea1f54ffc22965
Deleted: sha256:cd1d383fb2a655eb93188d9ded6b7bfedb5f34247f535933941e54aa93ea7542
Deleted: sha256:b3a9ac731bf007a3d804edd78b46262e7120482a81f798f3208cf023b9f028fd
Deleted: sha256:81e85897da02ddbc54e78b69124f30690ab4a18923ca2292cfc4b16208e18f81
Build step 'Execute shell' marked build as failure

Mime
View raw message