mesos-builds mailing list archives

Site index · List index
Message view « Date » · « Thread »
Top « Date » · « Thread »
From Apache Jenkins Server <jenk...@builds.apache.org>
Subject Build failed in Jenkins: Mesos-Buildbot » cmake,clang,--verbose --enable-libevent --enable-ssl,GLOG_v=1 MESOS_VERBOSE=1,ubuntu:14.04,(docker||Hadoop)&&(!ubuntu-us1)&&(!ubuntu-6)&&(!ubuntu-eu2) #3107
Date Thu, 12 Jan 2017 21:59:15 GMT
See <https://builds.apache.org/job/Mesos-Buildbot/BUILDTOOL=cmake,COMPILER=clang,CONFIGURATION=--verbose%20--enable-libevent%20--enable-ssl,ENVIRONMENT=GLOG_v=1%20MESOS_VERBOSE=1,OS=ubuntu%3A14.04,label_exp=(docker%7C%7CHadoop)&&(!ubuntu-us1)&&(!ubuntu-6)&&(!ubuntu-eu2)/3107/changes>

Changes:

[josephwu] Fixed apply-reviews.py on ASF CI machines.

------------------------------------------
[...truncated 174228 lines...]
[       OK ] Endpoint/SlaveEndpointTest.AuthorizedRequest/0 (12 ms)
[ RUN      ] Endpoint/SlaveEndpointTest.AuthorizedRequest/1
I0112 21:58:59.816104 25278 containerizer.cpp:220] Using isolation: posix/cpu,posix/mem,filesystem/posix,network/cni
W0112 21:58:59.816480 25278 backend.cpp:76] Failed to create 'aufs' backend: AufsBackend requires
root privileges, but is running as user mesos
W0112 21:58:59.816565 25278 backend.cpp:76] Failed to create 'bind' backend: BindBackend requires
root privileges
I0112 21:58:59.817922 25293 slave.cpp:209] Mesos agent started on (675)@172.17.0.2:48080
I0112 21:58:59.817950 25293 slave.cpp:210] Flags at startup: --acls="" --appc_simple_discovery_uri_prefix="http://"
--appc_store_dir="/tmp/mesos/store/appc" --authenticate_http_readonly="true" --authenticate_http_readwrite="true"
--authenticatee="crammd5" --authentication_backoff_factor="1secs" --authorizer="local" --cgroups_cpu_enable_pids_and_tids_count="false"
--cgroups_enable_cfs="false" --cgroups_hierarchy="/sys/fs/cgroup" --cgroups_limit_swap="false"
--cgroups_root="mesos" --container_disk_watch_interval="15secs" --containerizers="mesos" --credential="/tmp/Endpoint_SlaveEndpointTest_AuthorizedRequest_1_blXktI/credential"
--default_role="*" --disk_watch_interval="1mins" --docker="docker" --docker_kill_orphans="true"
--docker_registry="https://registry-1.docker.io" --docker_remove_delay="6hrs" --docker_socket="/var/run/docker.sock"
--docker_stop_timeout="0ns" --docker_store_dir="/tmp/mesos/store/docker" --docker_volume_checkpoint_dir="/var/run/mesos/isolators/docker/volume"
--enforce_container_disk_quota="false" --executor_registration_timeout="1mins" --executor_shutdown_grace_period="5secs"
--fetcher_cache_dir="/tmp/Endpoint_SlaveEndpointTest_AuthorizedRequest_1_blXktI/fetch" --fetcher_cache_size="2GB"
--frameworks_home="" --gc_delay="1weeks" --gc_disk_headroom="0.1" --hadoop_home="" --help="false"
--hostname_lookup="true" --http_authenticators="basic" --http_command_executor="false" --http_credentials="/tmp/Endpoint_SlaveEndpointTest_AuthorizedRequest_1_blXktI/http_credentials"
--http_heartbeat_interval="30secs" --image_provisioner_backend="copy" --initialize_driver_logging="true"
--isolation="posix/cpu,posix/mem" --launcher="posix" --launcher_dir="/mesos/build/src" --logbufsecs="0"
--logging_level="INFO" --max_completed_executors_per_framework="150" --oversubscribed_resources_interval="15secs"
--perf_duration="10secs" --perf_interval="1mins" --qos_correction_interval_min="0ns" --quiet="false"
--recover="reconnect" --recovery_timeout="15mins" --registration_backoff_factor="10ms" --resources="cpus:2;gpus:0;mem:1024;disk:1024;ports:[31000-32000]"
--revocable_cpu_low_priority="true" --runtime_dir="/tmp/Endpoint_SlaveEndpointTest_AuthorizedRequest_1_blXktI"
--sandbox_directory="/mnt/mesos/sandbox" --strict="true" --switch_user="true" --systemd_enable_support="true"
--systemd_runtime_directory="/run/systemd/system" --version="false" --work_dir="/tmp/Endpoint_SlaveEndpointTest_AuthorizedRequest_1_1g8cve"
I0112 21:58:59.818356 25293 credentials.hpp:86] Loading credential for authentication from
'/tmp/Endpoint_SlaveEndpointTest_AuthorizedRequest_1_blXktI/credential'
I0112 21:58:59.818450 25293 slave.cpp:352] Agent using credential for: test-principal
I0112 21:58:59.818466 25293 credentials.hpp:37] Loading credentials for authentication from
'/tmp/Endpoint_SlaveEndpointTest_AuthorizedRequest_1_blXktI/http_credentials'
I0112 21:58:59.818588 25293 http.cpp:922] Using default 'basic' HTTP authenticator for realm
'mesos-agent-readonly'
I0112 21:58:59.818639 25293 http.cpp:922] Using default 'basic' HTTP authenticator for realm
'mesos-agent-readwrite'
I0112 21:58:59.819018 25293 slave.cpp:539] Agent resources: cpus(*):2; mem(*):1024; disk(*):1024;
ports(*):[31000-32000]
I0112 21:58:59.819058 25293 slave.cpp:547] Agent attributes: [  ]
I0112 21:58:59.819064 25293 slave.cpp:552] Agent hostname: 3bf0c87cf65e
I0112 21:58:59.819551 25284 state.cpp:60] Recovering state from '/tmp/Endpoint_SlaveEndpointTest_AuthorizedRequest_1_1g8cve/meta'
I0112 21:58:59.819752 25292 status_update_manager.cpp:203] Recovering status update manager
I0112 21:58:59.820128 25279 containerizer.cpp:599] Recovering containerizer
I0112 21:58:59.820716 25291 provisioner.cpp:251] Provisioner recovery complete
I0112 21:58:59.820911 25294 slave.cpp:5421] Finished recovery
I0112 21:58:59.821269 25294 slave.cpp:5595] Querying resource estimator for oversubscribable
resources
I0112 21:58:59.821449 25280 slave.cpp:5609] Received oversubscribable resources {} from the
resource estimator
I0112 21:58:59.822152 25284 process.cpp:3676] Handling HTTP event for process 'slave(675)'
with path: '/slave(675)/monitor/statistics.json'
I0112 21:58:59.822577 25286 http.cpp:874] Authorizing principal 'test-principal' to GET the
'/monitor/statistics.json' endpoint
I0112 21:58:59.824066 25282 slave.cpp:796] Agent terminating
[       OK ] Endpoint/SlaveEndpointTest.AuthorizedRequest/1 (13 ms)
[ RUN      ] Endpoint/SlaveEndpointTest.AuthorizedRequest/2
I0112 21:58:59.829459 25278 containerizer.cpp:220] Using isolation: posix/cpu,posix/mem,filesystem/posix,network/cni
W0112 21:58:59.829823 25278 backend.cpp:76] Failed to create 'aufs' backend: AufsBackend requires
root privileges, but is running as user mesos
W0112 21:58:59.829917 25278 backend.cpp:76] Failed to create 'bind' backend: BindBackend requires
root privileges
I0112 21:58:59.831085 25290 slave.cpp:209] Mesos agent started on (676)@172.17.0.2:48080
I0112 21:58:59.831120 25290 slave.cpp:210] Flags at startup: --acls="" --appc_simple_discovery_uri_prefix="http://"
--appc_store_dir="/tmp/mesos/store/appc" --authenticate_http_readonly="true" --authenticate_http_readwrite="true"
--authenticatee="crammd5" --authentication_backoff_factor="1secs" --authorizer="local" --cgroups_cpu_enable_pids_and_tids_count="false"
--cgroups_enable_cfs="false" --cgroups_hierarchy="/sys/fs/cgroup" --cgroups_limit_swap="false"
--cgroups_root="mesos" --container_disk_watch_interval="15secs" --containerizers="mesos" --credential="/tmp/Endpoint_SlaveEndpointTest_AuthorizedRequest_2_afmetE/credential"
--default_role="*" --disk_watch_interval="1mins" --docker="docker" --docker_kill_orphans="true"
--docker_registry="https://registry-1.docker.io" --docker_remove_delay="6hrs" --docker_socket="/var/run/docker.sock"
--docker_stop_timeout="0ns" --docker_store_dir="/tmp/mesos/store/docker" --docker_volume_checkpoint_dir="/var/run/mesos/isolators/docker/volume"
--enforce_container_disk_quota="false" --executor_registration_timeout="1mins" --executor_shutdown_grace_period="5secs"
--fetcher_cache_dir="/tmp/Endpoint_SlaveEndpointTest_AuthorizedRequest_2_afmetE/fetch" --fetcher_cache_size="2GB"
--frameworks_home="" --gc_delay="1weeks" --gc_disk_headroom="0.1" --hadoop_home="" --help="false"
--hostname_lookup="true" --http_authenticators="basic" --http_command_executor="false" --http_credentials="/tmp/Endpoint_SlaveEndpointTest_AuthorizedRequest_2_afmetE/http_credentials"
--http_heartbeat_interval="30secs" --image_provisioner_backend="copy" --initialize_driver_logging="true"
--isolation="posix/cpu,posix/mem" --launcher="posix" --launcher_dir="/mesos/build/src" --logbufsecs="0"
--logging_level="INFO" --max_completed_executors_per_framework="150" --oversubscribed_resources_interval="15secs"
--perf_duration="10secs" --perf_interval="1mins" --qos_correction_interval_min="0ns" --quiet="false"
--recover="reconnect" --recovery_timeout="15mins" --registration_backoff_factor="10ms" --resources="cpus:2;gpus:0;mem:1024;disk:1024;ports:[31000-32000]"
--revocable_cpu_low_priority="true" --runtime_dir="/tmp/Endpoint_SlaveEndpointTest_AuthorizedRequest_2_afmetE"
--sandbox_directory="/mnt/mesos/sandbox" --strict="true" --switch_user="true" --systemd_enable_support="true"
--systemd_runtime_directory="/run/systemd/system" --version="false" --work_dir="/tmp/Endpoint_SlaveEndpointTest_AuthorizedRequest_2_GCzVsa"
I0112 21:58:59.831578 25290 credentials.hpp:86] Loading credential for authentication from
'/tmp/Endpoint_SlaveEndpointTest_AuthorizedRequest_2_afmetE/credential'
I0112 21:58:59.831688 25290 slave.cpp:352] Agent using credential for: test-principal
I0112 21:58:59.831707 25290 credentials.hpp:37] Loading credentials for authentication from
'/tmp/Endpoint_SlaveEndpointTest_AuthorizedRequest_2_afmetE/http_credentials'
I0112 21:58:59.831836 25290 http.cpp:922] Using default 'basic' HTTP authenticator for realm
'mesos-agent-readonly'
I0112 21:58:59.831898 25290 http.cpp:922] Using default 'basic' HTTP authenticator for realm
'mesos-agent-readwrite'
I0112 21:58:59.832347 25290 slave.cpp:539] Agent resources: cpus(*):2; mem(*):1024; disk(*):1024;
ports(*):[31000-32000]
I0112 21:58:59.832391 25290 slave.cpp:547] Agent attributes: [  ]
I0112 21:58:59.832402 25290 slave.cpp:552] Agent hostname: 3bf0c87cf65e
I0112 21:58:59.832769 25283 state.cpp:60] Recovering state from '/tmp/Endpoint_SlaveEndpointTest_AuthorizedRequest_2_GCzVsa/meta'
I0112 21:58:59.832947 25288 status_update_manager.cpp:203] Recovering status update manager
I0112 21:58:59.833123 25294 containerizer.cpp:599] Recovering containerizer
I0112 21:58:59.833920 25280 provisioner.cpp:251] Provisioner recovery complete
I0112 21:58:59.834146 25289 slave.cpp:5421] Finished recovery
I0112 21:58:59.834496 25289 slave.cpp:5595] Querying resource estimator for oversubscribable
resources
I0112 21:58:59.834658 25290 slave.cpp:5609] Received oversubscribable resources {} from the
resource estimator
I0112 21:58:59.835502 25292 process.cpp:3676] Handling HTTP event for process 'slave(676)'
with path: '/slave(676)/containers'
I0112 21:58:59.835940 25287 http.cpp:874] Authorizing principal 'test-principal' to GET the
'/containers' endpoint
I0112 21:58:59.837889 25283 slave.cpp:796] Agent terminating
[       OK ] Endpoint/SlaveEndpointTest.AuthorizedRequest/2 (13 ms)
[ RUN      ] Endpoint/SlaveEndpointTest.UnauthorizedRequest/0
I0112 21:58:59.843665 25278 containerizer.cpp:220] Using isolation: posix/cpu,posix/mem,filesystem/posix,network/cni
W0112 21:58:59.844069 25278 backend.cpp:76] Failed to create 'aufs' backend: AufsBackend requires
root privileges, but is running as user mesos
W0112 21:58:59.844159 25278 backend.cpp:76] Failed to create 'bind' backend: BindBackend requires
root privileges
I0112 21:58:59.845481 25280 slave.cpp:209] Mesos agent started on (677)@172.17.0.2:48080
I0112 21:58:59.845515 25280 slave.cpp:210] Flags at startup: --acls="" --appc_simple_discovery_uri_prefix="http://"
--appc_store_dir="/tmp/mesos/store/appc" --authenticate_http_readonly="true" --authenticate_http_readwrite="true"
--authenticatee="crammd5" --authentication_backoff_factor="1secs" --authorizer="local" --cgroups_cpu_enable_pids_and_tids_count="false"
--cgroups_enable_cfs="false" --cgroups_hierarchy="/sys/fs/cgroup" --cgroups_limit_swap="false"
--cgroups_root="mesos" --container_disk_watch_interval="15secs" --containerizers="mesos" --credential="/tmp/Endpoint_SlaveEndpointTest_UnauthorizedRequest_0_W799BA/credential"
--default_role="*" --disk_watch_interval="1mins" --docker="docker" --docker_kill_orphans="true"
--docker_registry="https://registry-1.docker.io" --docker_remove_delay="6hrs" --docker_socket="/var/run/docker.sock"
--docker_stop_timeout="0ns" --docker_store_dir="/tmp/mesos/store/docker" --docker_volume_checkpoint_dir="/var/run/mesos/isolators/docker/volume"
--enforce_container_disk_quota="false" --executor_registration_timeout="1mins" --executor_shutdown_grace_period="5secs"
--fetcher_cache_dir="/tmp/Endpoint_SlaveEndpointTest_UnauthorizedRequest_0_W799BA/fetch" --fetcher_cache_size="2GB"
--frameworks_home="" --gc_delay="1weeks" --gc_disk_headroom="0.1" --hadoop_home="" --help="false"
--hostname_lookup="true" --http_authenticators="basic" --http_command_executor="false" --http_credentials="/tmp/Endpoint_SlaveEndpointTest_UnauthorizedRequest_0_W799BA/http_credentials"
--http_heartbeat_interval="30secs" --image_provisioner_backend="copy" --initialize_driver_logging="true"
--isolation="posix/cpu,posix/mem" --launcher="posix" --launcher_dir="/mesos/build/src" --logbufsecs="0"
--logging_level="INFO" --max_completed_executors_per_framework="150" --oversubscribed_resources_interval="15secs"
--perf_duration="10secs" --perf_interval="1mins" --qos_correction_interval_min="0ns" --quiet="false"
--recover="reconnect" --recovery_timeout="15mins" --registration_backoff_factor="10ms" --resources="cpus:2;gpus:0;mem:1024;disk:1024;ports:[31000-32000]"
--revocable_cpu_low_priority="true" --runtime_dir="/tmp/Endpoint_SlaveEndpointTest_UnauthorizedRequest_0_W799BA"
--sandbox_directory="/mnt/mesos/sandbox" --strict="true" --switch_user="true" --systemd_enable_support="true"
--systemd_runtime_directory="/run/systemd/system" --version="false" --work_dir="/tmp/Endpoint_SlaveEndpointTest_UnauthorizedRequest_0_2hYyz6"
I0112 21:58:59.846065 25280 credentials.hpp:86] Loading credential for authentication from
'/tmp/Endpoint_SlaveEndpointTest_UnauthorizedRequest_0_W799BA/credential'
I0112 21:58:59.846180 25280 slave.cpp:352] Agent using credential for: test-principal
I0112 21:58:59.846197 25280 credentials.hpp:37] Loading credentials for authentication from
'/tmp/Endpoint_SlaveEndpointTest_UnauthorizedRequest_0_W799BA/http_credentials'
I0112 21:58:59.846312 25280 http.cpp:922] Using default 'basic' HTTP authenticator for realm
'mesos-agent-readonly'
I0112 21:58:59.846362 25280 http.cpp:922] Using default 'basic' HTTP authenticator for realm
'mesos-agent-readwrite'
I0112 21:58:59.846740 25280 slave.cpp:539] Agent resources: cpus(*):2; mem(*):1024; disk(*):1024;
ports(*):[31000-32000]
I0112 21:58:59.846781 25280 slave.cpp:547] Agent attributes: [  ]
I0112 21:58:59.846788 25280 slave.cpp:552] Agent hostname: 3bf0c87cf65e
I0112 21:58:59.847173 25293 state.cpp:60] Recovering state from '/tmp/Endpoint_SlaveEndpointTest_UnauthorizedRequest_0_2hYyz6/meta'
I0112 21:58:59.847368 25282 status_update_manager.cpp:203] Recovering status update manager
I0112 21:58:59.847621 25284 containerizer.cpp:599] Recovering containerizer
I0112 21:58:59.848270 25281 provisioner.cpp:251] Provisioner recovery complete
I0112 21:58:59.848497 25288 slave.cpp:5421] Finished recovery
I0112 21:58:59.848892 25288 slave.cpp:5595] Querying resource estimator for oversubscribable
resources
I0112 21:58:59.849061 25286 slave.cpp:5609] Received oversubscribable resources {} from the
resource estimator
I0112 21:58:59.849799 25281 process.cpp:3676] Handling HTTP event for process 'slave(677)'
with path: '/slave(677)/monitor/statistics'
I0112 21:58:59.850277 25283 http.cpp:874] Authorizing principal 'test-principal' to GET the
'/monitor/statistics' endpoint
I0112 21:58:59.851861 25283 slave.cpp:796] Agent terminating
[       OK ] Endpoint/SlaveEndpointTest.UnauthorizedRequest/0 (13 ms)
[ RUN      ] Endpoint/SlaveEndpointTest.UnauthorizedRequest/1
I0112 21:58:59.857677 25278 containerizer.cpp:220] Using isolation: posix/cpu,posix/mem,filesystem/posix,network/cni
W0112 21:58:59.858042 25278 backend.cpp:76] Failed to create 'aufs' backend: AufsBackend requires
root privileges, but is running as user mesos
W0112 21:58:59.858129 25278 backend.cpp:76] Failed to create 'bind' backend: BindBackend requires
root privileges
I0112 21:58:59.859333 25282 slave.cpp:209] Mesos agent started on (678)@172.17.0.2:48080
I0112 21:58:59.859360 25282 slave.cpp:210] Flags at startup: --acls="" --appc_simple_discovery_uri_prefix="http://"
--appc_store_dir="/tmp/mesos/store/appc" --authenticate_http_readonly="true" --authenticate_http_readwrite="true"
--authenticatee="crammd5" --authentication_backoff_factor="1secs" --authorizer="local" --cgroups_cpu_enable_pids_and_tids_count="false"
--cgroups_enable_cfs="false" --cgroups_hierarchy="/sys/fs/cgroup" --cgroups_limit_swap="false"
--cgroups_root="mesos" --container_disk_watch_interval="15secs" --containerizers="mesos" --credential="/tmp/Endpoint_SlaveEndpointTest_UnauthorizedRequest_1_2wmhUw/credential"
--default_role="*" --disk_watch_interval="1mins" --docker="docker" --docker_kill_orphans="true"
--docker_registry="https://registry-1.docker.io" --docker_remove_delay="6hrs" --docker_socket="/var/run/docker.sock"
--docker_stop_timeout="0ns" --docker_store_dir="/tmp/mesos/store/docker" --docker_volume_checkpoint_dir="/var/run/mesos/isolators/docker/volume"
--enforce_container_disk_quota="false" --executor_registration_timeout="1mins" --executor_shutdown_grace_period="5secs"
--fetcher_cache_dir="/tmp/Endpoint_SlaveEndpointTest_UnauthorizedRequest_1_2wmhUw/fetch" --fetcher_cache_size="2GB"
--frameworks_home="" --gc_delay="1weeks" --gc_disk_headroom="0.1" --hadoop_home="" --help="false"
--hostname_lookup="true" --http_authenticators="basic" --http_command_executor="false" --http_credentials="/tmp/Endpoint_SlaveEndpointTest_UnauthorizedRequest_1_2wmhUw/http_credentials"
--http_heartbeat_interval="30secs" --image_provisioner_backend="copy" --initialize_driver_logging="true"
--isolation="posix/cpu,posix/mem" --launcher="posix" --launcher_dir="/mesos/build/src" --logbufsecs="0"
--logging_level="INFO" --max_completed_executors_per_framework="150" --oversubscribed_resources_interval="15secs"
--perf_duration="10secs" --perf_interval="1mins" --qos_correction_interval_min="0ns" --quiet="false"
--recover="reconnect" --recovery_timeout="15mins" --registration_backoff_factor="10ms" --resources="cpus:2;gpus:0;mem:1024;disk:1024;ports:[31000-32000]"
--revocable_cpu_low_priority="true" --runtime_dir="/tmp/Endpoint_SlaveEndpointTest_UnauthorizedRequest_1_2wmhUw"
--sandbox_directory="/mnt/mesos/sandbox" --strict="true" --switch_user="true" --systemd_enable_support="true"
--systemd_runtime_directory="/run/systemd/system" --version="false" --work_dir="/tmp/Endpoint_SlaveEndpointTest_UnauthorizedRequest_1_EwxoP2"
I0112 21:58:59.859725 25282 credentials.hpp:86] Loading credential for authentication from
'/tmp/Endpoint_SlaveEndpointTest_UnauthorizedRequest_1_2wmhUw/credential'
I0112 21:58:59.859855 25282 slave.cpp:352] Agent using credential for: test-principal
I0112 21:58:59.859879 25282 credentials.hpp:37] Loading credentials for authentication from
'/tmp/Endpoint_SlaveEndpointTest_UnauthorizedRequest_1_2wmhUw/http_credentials'
I0112 21:58:59.860031 25282 http.cpp:922] Using default 'basic' HTTP authenticator for realm
'mesos-agent-readonly'
I0112 21:58:59.860100 25282 http.cpp:922] Using default 'basic' HTTP authenticator for realm
'mesos-agent-readwrite'
I0112 21:58:59.860743 25282 slave.cpp:539] Agent resources: cpus(*):2; mem(*):1024; disk(*):1024;
ports(*):[31000-32000]
I0112 21:58:59.860786 25282 slave.cpp:547] Agent attributes: [  ]
I0112 21:58:59.860795 25282 slave.cpp:552] Agent hostname: 3bf0c87cf65e
I0112 21:58:59.861223 25289 state.cpp:60] Recovering state from '/tmp/Endpoint_SlaveEndpointTest_UnauthorizedRequest_1_EwxoP2/meta'
I0112 21:58:59.861430 25292 status_update_manager.cpp:203] Recovering status update manager
I0112 21:58:59.861584 25287 containerizer.cpp:599] Recovering containerizer
I0112 21:58:59.862246 25284 provisioner.cpp:251] Provisioner recovery complete
I0112 21:58:59.862462 25285 slave.cpp:5421] Finished recovery
I0112 21:58:59.862932 25285 slave.cpp:5595] Querying resource estimator for oversubscribable
resources
I0112 21:58:59.863072 25282 slave.cpp:5609] Received oversubscribable resources {} from the
resource estimator
I0112 21:58:59.863816 25288 process.cpp:3676] Handling HTTP event for process 'slave(678)'
with path: '/slave(678)/monitor/statistics.json'
I0112 21:58:59.864308 25281 http.cpp:874] Authorizing principal 'test-principal' to GET the
'/monitor/statistics.json' endpoint
I0112 21:58:59.865541 25278 slave.cpp:796] Agent terminating
[       OK ] Endpoint/SlaveEndpointTest.UnauthorizedRequest/1 (13 ms)
[ RUN      ] Endpoint/SlaveEndpointTest.UnauthorizedRequest/2
I0112 21:58:59.871038 25278 containerizer.cpp:220] Using isolation: posix/cpu,posix/mem,filesystem/posix,network/cni
W0112 21:58:59.871438 25278 backend.cpp:76] Failed to create 'aufs' backend: AufsBackend requires
root privileges, but is running as user mesos
W0112 21:58:59.871526 25278 backend.cpp:76] Failed to create 'bind' backend: BindBackend requires
root privileges
I0112 21:58:59.872777 25284 slave.cpp:209] Mesos agent started on (679)@172.17.0.2:48080
I0112 21:58:59.872812 25284 slave.cpp:210] Flags at startup: --acls="" --appc_simple_discovery_uri_prefix="http://"
--appc_store_dir="/tmp/mesos/store/appc" --authenticate_http_readonly="true" --authenticate_http_readwrite="true"
--authenticatee="crammd5" --authentication_backoff_factor="1secs" --authorizer="local" --cgroups_cpu_enable_pids_and_tids_count="false"
--cgroups_enable_cfs="false" --cgroups_hierarchy="/sys/fs/cgroup" --cgroups_limit_swap="false"
--cgroups_root="mesos" --container_disk_watch_interval="15secs" --containerizers="mesos" --credential="/tmp/Endpoint_SlaveEndpointTest_UnauthorizedRequest_2_45Dclt/credential"
--default_role="*" --disk_watch_interval="1mins" --docker="docker" --docker_kill_orphans="true"
--docker_registry="https://registry-1.docker.io" --docker_remove_delay="6hrs" --docker_socket="/var/run/docker.sock"
--docker_stop_timeout="0ns" --docker_store_dir="/tmp/mesos/store/docker" --docker_volume_checkpoint_dir="/var/run/mesos/isolators/docker/volume"
--enforce_container_disk_quota="false" --executor_registration_timeout="1mins" --executor_shutdown_grace_period="5secs"
--fetcher_cache_dir="/tmp/Endpoint_SlaveEndpointTest_UnauthorizedRequest_2_45Dclt/fetch" --fetcher_cache_size="2GB"
--frameworks_home="" --gc_delay="1weeks" --gc_disk_headroom="0.1" --hadoop_home="" --help="false"
--hostname_lookup="true" --http_authenticators="basic" --http_command_executor="false" --http_credentials="/tmp/Endpoint_SlaveEndpointTest_UnauthorizedRequest_2_45Dclt/http_credentials"
--http_heartbeat_interval="30secs" --image_provisioner_backend="copy" --initialize_driver_logging="true"
--isolation="posix/cpu,posix/mem" --launcher="posix" --launcher_dir="/mesos/build/src" --logbufsecs="0"
--logging_level="INFO" --max_completed_executors_per_framework="150" --oversubscribed_resources_interval="15secs"
--perf_duration="10secs" --perf_interval="1mins" --qos_correction_interval_min="0ns" --quiet="false"
--recover="reconnect" --recovery_timeout="15mins" --registration_backoff_factor="10ms" --resources="cpus:2;gpus:0;mem:1024;disk:1024;ports:[31000-32000]"
--revocable_cpu_low_priority="true" --runtime_dir="/tmp/Endpoint_SlaveEndpointTest_UnauthorizedRequest_2_45Dclt"
--sandbox_directory="/mnt/mesos/sandbox" --strict="true" --switch_user="true" --systemd_enable_support="true"
--systemd_runtime_directory="/run/systemd/system" --version="false" --work_dir="/tmp/Endpoint_SlaveEndpointTest_UnauthorizedRequest_2_G9a9dZ"
I0112 21:58:59.873227 25284 credentials.hpp:86] Loading credential for authentication from
'/tmp/Endpoint_SlaveEndpointTest_UnauthorizedRequest_2_45Dclt/credential'
I0112 21:58:59.873330 25284 slave.cpp:352] Agent using credential for: test-principal
I0112 21:58:59.873347 25284 credentials.hpp:37] Loading credentials for authentication from
'/tmp/Endpoint_SlaveEndpointTest_UnauthorizedRequest_2_45Dclt/http_credentials'
I0112 21:58:59.873458 25284 http.cpp:922] Using default 'basic' HTTP authenticator for realm
'mesos-agent-readonly'
I0112 21:58:59.873507 25284 http.cpp:922] Using default 'basic' HTTP authenticator for realm
'mesos-agent-readwrite'
I0112 21:58:59.873888 25284 slave.cpp:539] Agent resources: cpus(*):2; mem(*):1024; disk(*):1024;
ports(*):[31000-32000]
I0112 21:58:59.873929 25284 slave.cpp:547] Agent attributes: [  ]
I0112 21:58:59.873934 25284 slave.cpp:552] Agent hostname: 3bf0c87cf65e
I0112 21:58:59.874356 25288 state.cpp:60] Recovering state from '/tmp/Endpoint_SlaveEndpointTest_UnauthorizedRequest_2_G9a9dZ/meta'
I0112 21:58:59.874568 25281 status_update_manager.cpp:203] Recovering status update manager
I0112 21:58:59.874701 25293 containerizer.cpp:599] Recovering containerizer
I0112 21:58:59.875313 25294 provisioner.cpp:251] Provisioner recovery complete
I0112 21:58:59.875505 25281 slave.cpp:5421] Finished recovery
I0112 21:58:59.875963 25281 slave.cpp:5595] Querying resource estimator for oversubscribable
resources
I0112 21:58:59.876152 25284 slave.cpp:5609] Received oversubscribable resources {} from the
resource estimator
I0112 21:58:59.877012 25280 process.cpp:3676] Handling HTTP event for process 'slave(679)'
with path: '/slave(679)/containers'
I0112 21:58:59.877475 25281 http.cpp:874] Authorizing principal 'test-principal' to GET the
'/containers' endpoint
I0112 21:58:59.878945 25289 slave.cpp:796] Agent terminating
[       OK ] Endpoint/SlaveEndpointTest.UnauthorizedRequest/2 (13 ms)
[ RUN      ] Endpoint/SlaveEndpointTest.NoAuthorizer/0
I0112 21:58:59.885097 25278 containerizer.cpp:220] Using isolation: posix/cpu,posix/mem,filesystem/posix,network/cni
W0112 21:58:59.885462 25278 backend.cpp:76] Failed to create 'aufs' backend: AufsBackend requires
root privileges, but is running as user mesos
W0112 21:58:59.885552 25278 backend.cpp:76] Failed to create 'bind' backend: BindBackend requires
root privileges
I0112 21:58:59.886286 25278 cluster.cpp:446] Creating default 'local' authorizer
I0112 21:58:59.886863 25289 slave.cpp:209] Mesos agent started on (680)@172.17.0.2:48080
I0112 21:58:59.886896 25289 slave.cpp:210] Flags at startup: --acls="" --appc_simple_discovery_uri_prefix="http://"
--appc_store_dir="/tmp/mesos/store/appc" --authenticate_http_readonly="true" --authenticate_http_readwrite="true"
--authenticatee="crammd5" --authentication_backoff_factor="1secs" --authorizer="local" --cgroups_cpu_enable_pids_and_tids_count="false"
--cgroups_enable_cfs="false" --cgroups_hierarchy="/sys/fs/cgroup" --cgroups_limit_swap="false"
--cgroups_root="mesos" --container_disk_watch_interval="15secs" --containerizers="mesos" --credential="/tmp/Endpoint_SlaveEndpointTest_NoAuthorizer_0_SAuWUp/credential"
--default_role="*" --disk_watch_interval="1mins" --docker="docker" --docker_kill_orphans="true"
--docker_registry="https://registry-1.docker.io" --docker_remove_delay="6hrs" --docker_socket="/var/run/docker.sock"
--docker_stop_timeout="0ns" --docker_store_dir="/tmp/mesos/store/docker" --docker_volume_checkpoint_dir="/var/run/mesos/isolators/docker/volume"
--enforce_container_disk_quota="false" --executor_registration_timeout="1mins" --executor_shutdown_grace_period="5secs"
--fetcher_cache_dir="/tmp/Endpoint_SlaveEndpointTest_NoAuthorizer_0_SAuWUp/fetch" --fetcher_cache_size="2GB"
--frameworks_home="" --gc_delay="1weeks" --gc_disk_headroom="0.1" --hadoop_home="" --help="false"
--hostname_lookup="true" --http_authenticators="basic" --http_command_executor="false" --http_credentials="/tmp/Endpoint_SlaveEndpointTest_NoAuthorizer_0_SAuWUp/http_credentials"
--http_heartbeat_interval="30secs" --image_provisioner_backend="copy" --initialize_driver_logging="true"
--isolation="posix/cpu,posix/mem" --launcher="posix" --launcher_dir="/mesos/build/src" --logbufsecs="0"
--logging_level="INFO" --max_completed_executors_per_framework="150" --oversubscribed_resources_interval="15secs"
--perf_duration="10secs" --perf_interval="1mins" --qos_correction_interval_min="0ns" --quiet="false"
--recover="reconnect" --recovery_timeout="15mins" --registration_backoff_factor="10ms" --resources="cpus:2;gpus:0;mem:1024;disk:1024;ports:[31000-32000]"
--revocable_cpu_low_priority="true" --runtime_dir="/tmp/Endpoint_SlaveEndpointTest_NoAuthorizer_0_SAuWUp"
--sandbox_directory="/mnt/mesos/sandbox" --strict="true" --switch_user="true" --systemd_enable_support="true"
--systemd_runtime_directory="/run/systemd/system" --version="false" --work_dir="/tmp/Endpoint_SlaveEndpointTest_NoAuthorizer_0_Cx3DLV"
I0112 21:58:59.887394 25289 credentials.hpp:86] Loading credential for authentication from
'/tmp/Endpoint_SlaveEndpointTest_NoAuthorizer_0_SAuWUp/credential'
I0112 21:58:59.887519 25289 slave.cpp:352] Agent using credential for: test-principal
I0112 21:58:59.887544 25289 credentials.hpp:37] Loading credentials for authentication from
'/tmp/Endpoint_SlaveEndpointTest_NoAuthorizer_0_SAuWUp/http_credentials'
I0112 21:58:59.887677 25289 http.cpp:922] Using default 'basic' HTTP authenticator for realm
'mesos-agent-readonly'
I0112 21:58:59.887732 25289 http.cpp:922] Using default 'basic' HTTP authenticator for realm
'mesos-agent-readwrite'
I0112 21:58:59.888098 25289 slave.cpp:539] Agent resources: cpus(*):2; mem(*):1024; disk(*):1024;
ports(*):[31000-32000]
I0112 21:58:59.888139 25289 slave.cpp:547] Agent attributes: [  ]
I0112 21:58:59.888145 25289 slave.cpp:552] Agent hostname: 3bf0c87cf65e
I0112 21:58:59.888798 25289 state.cpp:60] Recovering state from '/tmp/Endpoint_SlaveEndpointTest_NoAuthorizer_0_Cx3DLV/meta'
I0112 21:58:59.888950 25289 status_update_manager.cpp:203] Recovering status update manager
I0112 21:58:59.889019 25289 containerizer.cpp:599] Recovering containerizer
I0112 21:58:59.889490 25289 provisioner.cpp:251] Provisioner recovery complete
I0112 21:58:59.889642 25289 slave.cpp:5421] Finished recovery
I0112 21:58:59.889998 25289 slave.cpp:5595] Querying resource estimator for oversubscribable
resources
I0112 21:58:59.890163 25289 slave.cpp:5609] Received oversubscribable resources {} from the
resource estimator
I0112 21:58:59.890964 25293 process.cpp:3676] Handling HTTP event for process 'slave(680)'
with path: '/slave(680)/monitor/statistics'
I0112 21:58:59.891510 25287 http.cpp:874] Authorizing principal 'test-principal' to GET the
'/monitor/statistics' endpoint
I0112 21:58:59.893020 25289 slave.cpp:796] Agent terminating
[       OK ] Endpoint/SlaveEndpointTest.NoAuthorizer/0 (13 ms)
[ RUN      ] Endpoint/SlaveEndpointTest.NoAuthorizer/1
I0112 21:58:59.898946 25278 containerizer.cpp:220] Using isolation: posix/cpu,posix/mem,filesystem/posix,network/cni
W0112 21:58:59.899327 25278 backend.cpp:76] Failed to create 'aufs' backend: AufsBackend requires
root privileges, but is running as user mesos
W0112 21:58:59.899415 25278 backend.cpp:76] Failed to create 'bind' backend: BindBackend requires
root privileges
I0112 21:58:59.900089 25278 cluster.cpp:446] Creating default 'local' authorizer
I0112 21:58:59.900593 25285 slave.cpp:209] Mesos agent started on (681)@172.17.0.2:48080
I0112 21:58:59.900626 25285 slave.cpp:210] Flags at startup: --acls="" --appc_simple_discovery_uri_prefix="http://"
--appc_store_dir="/tmp/mesos/store/appc" --authenticate_http_readonly="true" --authenticate_http_readwrite="true"
--authenticatee="crammd5" --authentication_backoff_factor="1secs" --authorizer="local" --cgroups_cpu_enable_pids_and_tids_count="false"
--cgroups_enable_cfs="false" --cgroups_hierarchy="/sys/fs/cgroup" --cgroups_limit_swap="false"
--cgroups_root="mesos" --container_disk_watch_interval="15secs" --containerizers="mesos" --credential="/tmp/Endpoint_SlaveEndpointTest_NoAuthorizer_1_8tbIDm/credential"
--default_role="*" --disk_watch_interval="1mins" --docker="docker" --docker_kill_orphans="true"
--docker_registry="https://registry-1.docker.io" --docker_remove_delay="6hrs" --docker_socket="/var/run/docker.sock"
--docker_stop_timeout="0ns" --docker_store_dir="/tmp/mesos/store/docker" --docker_volume_checkpoint_dir="/var/run/mesos/isolators/docker/volume"
--enforce_container_disk_quota="false" --executor_registration_timeout="1mins" --executor_shutdown_grace_period="5secs"
--fetcher_cache_dir="/tmp/Endpoint_SlaveEndpointTest_NoAuthorizer_1_8tbIDm/fetch" --fetcher_cache_size="2GB"
--frameworks_home="" --gc_delay="1weeks" --gc_disk_headroom="0.1" --hadoop_home="" --help="false"
--hostname_lookup="true" --http_authenticators="basic" --http_command_executor="false" --http_credentials="/tmp/Endpoint_SlaveEndpointTest_NoAuthorizer_1_8tbIDm/http_credentials"
--http_heartbeat_interval="30secs" --image_provisioner_backend="copy" --initialize_driver_logging="true"
--isolation="posix/cpu,posix/mem" --launcher="posix" --launcher_dir="/mesos/build/src" --logbufsecs="0"
--logging_level="INFO" --max_completed_executors_per_framework="150" --oversubscribed_resources_interval="15secs"
--perf_duration="10secs" --perf_interval="1mins" --qos_correction_interval_min="0ns" --quiet="false"
--recover="reconnect" --recovery_timeout="15mins" --registration_backoff_factor="10ms" --resources="cpus:2;gpus:0;mem:1024;disk:1024;ports:[31000-32000]"
--revocable_cpu_low_priority="true" --runtime_dir="/tmp/Endpoint_SlaveEndpointTest_NoAuthorizer_1_8tbIDm"
--sandbox_directory="/mnt/mesos/sandbox" --strict="true" --switch_user="true" --systemd_enable_support="true"
--systemd_runtime_directory="/run/systemd/system" --version="false" --work_dir="/tmp/Endpoint_SlaveEndpointTest_NoAuthorizer_1_47JasS"
I0112 21:58:59.901051 25285 credentials.hpp:86] Loading credential for authentication from
'/tmp/Endpoint_SlaveEndpointTest_NoAuthorizer_1_8tbIDm/credential'
I0112 21:58:59.901147 25285 slave.cpp:352] Agent using credential for: test-principal
I0112 21:58:59.901163 25285 credentials.hpp:37] Loading credentials for authentication from
'/tmp/Endpoint_SlaveEndpointTest_NoAuthorizer_1_8tbIDm/http_credentials'
I0112 21:58:59.901293 25285 http.cpp:922] Using default 'basic' HTTP authenticator for realm
'mesos-agent-readonly'
I0112 21:58:59.901347 25285 http.cpp:922] Using default 'basic' HTTP authenticator for realm
'mesos-agent-readwrite'
I0112 21:58:59.901796 25285 slave.cpp:539] Agent resources: cpus(*):2; mem(*):1024; disk(*):1024;
ports(*):[31000-32000]
I0112 21:58:59.901839 25285 slave.cpp:547] Agent attributes: [  ]
I0112 21:58:59.901844 25285 slave.cpp:552] Agent hostname: 3bf0c87cf65e
I0112 21:58:59.902336 25291 state.cpp:60] Recovering state from '/tmp/Endpoint_SlaveEndpointTest_NoAuthorizer_1_47JasS/meta'
I0112 21:58:59.902679 25292 status_update_manager.cpp:203] Recovering status update manager
I0112 21:58:59.903152 25292 containerizer.cpp:599] Recovering containerizer
I0112 21:58:59.903941 25283 provisioner.cpp:251] Provisioner recovery complete
I0112 21:58:59.904156 25285 slave.cpp:5421] Finished recovery
I0112 21:58:59.904474 25285 slave.cpp:5595] Querying resource estimator for oversubscribable
resources
I0112 21:58:59.904623 25288 slave.cpp:5609] Received oversubscribable resources {} from the
resource estimator
I0112 21:58:59.905402 25290 process.cpp:3676] Handling HTTP event for process 'slave(681)'
with path: '/slave(681)/monitor/statistics.json'
I0112 21:58:59.906074 25294 http.cpp:874] Authorizing principal 'test-principal' to GET the
'/monitor/statistics.json' endpoint
I0112 21:58:59.907686 25285 slave.cpp:796] Agent terminating
[       OK ] Endpoint/SlaveEndpointTest.NoAuthorizer/1 (14 ms)
[ RUN      ] Endpoint/SlaveEndpointTest.NoAuthorizer/2
I0112 21:58:59.913924 25278 containerizer.cpp:220] Using isolation: posix/cpu,posix/mem,filesystem/posix,network/cni
W0112 21:58:59.914321 25278 backend.cpp:76] Failed to create 'aufs' backend: AufsBackend requires
root privileges, but is running as user mesos
W0112 21:58:59.914422 25278 backend.cpp:76] Failed to create 'bind' backend: BindBackend requires
root privileges
I0112 21:58:59.915302 25278 cluster.cpp:446] Creating default 'local' authorizer
I0112 21:58:59.915995 25279 slave.cpp:209] Mesos agent started on (682)@172.17.0.2:48080
I0112 21:58:59.916018 25279 slave.cpp:210] Flags at startup: --acls="" --appc_simple_discovery_uri_prefix="http://"
--appc_store_dir="/tmp/mesos/store/appc" --authenticate_http_readonly="true" --authenticate_http_readwrite="true"
--authenticatee="crammd5" --authentication_backoff_factor="1secs" --authorizer="local" --cgroups_cpu_enable_pids_and_tids_count="false"
--cgroups_enable_cfs="false" --cgroups_hierarchy="/sys/fs/cgroup" --cgroups_limit_swap="false"
--cgroups_root="mesos" --container_disk_watch_interval="15secs" --containerizers="mesos" --credential="/tmp/Endpoint_SlaveEndpointTest_NoAuthorizer_2_4mP7vj/credential"
--default_role="*" --disk_watch_interval="1mins" --docker="docker" --docker_kill_orphans="true"
--docker_registry="https://registry-1.docker.io" --docker_remove_delay="6hrs" --docker_socket="/var/run/docker.sock"
--docker_stop_timeout="0ns" --docker_store_dir="/tmp/mesos/store/docker" --docker_volume_checkpoint_dir="/var/run/mesos/isolators/docker/volume"
--enforce_container_disk_quota="false" --executor_registration_timeout="1mins" --executor_shutdown_grace_period="5secs"
--fetcher_cache_dir="/tmp/Endpoint_SlaveEndpointTest_NoAuthorizer_2_4mP7vj/fetch" --fetcher_cache_size="2GB"
--frameworks_home="" --gc_delay="1weeks" --gc_disk_headroom="0.1" --hadoop_home="" --help="false"
--hostname_lookup="true" --http_authenticators="basic" --http_command_executor="false" --http_credentials="/tmp/Endpoint_SlaveEndpointTest_NoAuthorizer_2_4mP7vj/http_credentials"
--http_heartbeat_interval="30secs" --image_provisioner_backend="copy" --initialize_driver_logging="true"
--isolation="posix/cpu,posix/mem" --launcher="posix" --launcher_dir="/mesos/build/src" --logbufsecs="0"
--logging_level="INFO" --max_completed_executors_per_framework="150" --oversubscribed_resources_interval="15secs"
--perf_duration="10secs" --perf_interval="1mins" --qos_correction_interval_min="0ns" --quiet="false"
--recover="reconnect" --recovery_timeout="15mins" --registration_backoff_factor="10ms" --resources="cpus:2;gpus:0;mem:1024;disk:1024;ports:[31000-32000]"
--revocable_cpu_low_priority="true" --runtime_dir="/tmp/Endpoint_SlaveEndpointTest_NoAuthorizer_2_4mP7vj"
--sandbox_directory="/mnt/mesos/sandbox" --strict="true" --switch_user="true" --systemd_enable_support="true"
--systemd_runtime_directory="/run/systemd/system" --version="false" --work_dir="/tmp/Endpoint_SlaveEndpointTest_NoAuthorizer_2_Yew9hP"
I0112 21:58:59.916352 25279 credentials.hpp:86] Loading credential for authentication from
'/tmp/Endpoint_SlaveEndpointTest_NoAuthorizer_2_4mP7vj/credential'
I0112 21:58:59.916434 25279 slave.cpp:352] Agent using credential for: test-principal
I0112 21:58:59.916445 25279 credentials.hpp:37] Loading credentials for authentication from
'/tmp/Endpoint_SlaveEndpointTest_NoAuthorizer_2_4mP7vj/http_credentials'
I0112 21:58:59.916538 25279 http.cpp:922] Using default 'basic' HTTP authenticator for realm
'mesos-agent-readonly'
I0112 21:58:59.916591 25279 http.cpp:922] Using default 'basic' HTTP authenticator for realm
'mesos-agent-readwrite'
I0112 21:58:59.917042 25279 slave.cpp:539] Agent resources: cpus(*):2; mem(*):1024; disk(*):1024;
ports(*):[31000-32000]
I0112 21:58:59.917076 25279 slave.cpp:547] Agent attributes: [  ]
I0112 21:58:59.917083 25279 slave.cpp:552] Agent hostname: 3bf0c87cf65e
I0112 21:58:59.917516 25290 state.cpp:60] Recovering state from '/tmp/Endpoint_SlaveEndpointTest_NoAuthorizer_2_Yew9hP/meta'
I0112 21:58:59.917661 25289 status_update_manager.cpp:203] Recovering status update manager
I0112 21:58:59.917850 25291 containerizer.cpp:599] Recovering containerizer
I0112 21:58:59.918378 25288 provisioner.cpp:251] Provisioner recovery complete
I0112 21:58:59.918570 25283 slave.cpp:5421] Finished recovery
I0112 21:58:59.918927 25283 slave.cpp:5595] Querying resource estimator for oversubscribable
resources
I0112 21:58:59.919118 25289 slave.cpp:5609] Received oversubscribable resources {} from the
resource estimator
I0112 21:58:59.919781 25286 process.cpp:3676] Handling HTTP event for process 'slave(682)'
with path: '/slave(682)/containers'
I0112 21:58:59.920280 25288 http.cpp:874] Authorizing principal 'test-principal' to GET the
'/containers' endpoint
I0112 21:58:59.921610 25278 slave.cpp:796] Agent terminating
[       OK ] Endpoint/SlaveEndpointTest.NoAuthorizer/2 (13 ms)
[----------] 9 tests from Endpoint/SlaveEndpointTest (125 ms total)

[----------] Global test environment tear-down
[==========] 1400 tests from 157 test cases ran. (178401 ms total)
[  PASSED  ] 1399 tests.
[  FAILED  ] 1 test, listed below:
[  FAILED  ] IOSwitchboardTest.RecoverThenKillSwitchboardContainerDestroyed

 1 FAILED TEST
  YOU HAVE 14 DISABLED TESTS

make[3]: *** [CMakeFiles/check] Error 1
make[3]: Leaving directory `/mesos/build'
make[2]: *** [CMakeFiles/check.dir/all] Error 2
make[2]: Leaving directory `/mesos/build'
make[1]: *** [CMakeFiles/check.dir/rule] Error 2
make[1]: Leaving directory `/mesos/build'
make: *** [check] Error 2
+ docker rmi mesos-1484256364-6365
Untagged: mesos-1484256364-6365:latest
Deleted: sha256:d31f1775fabb83d069a365c4406bd17fba7792a4603cb2af5db55da58f048cc6
Deleted: sha256:c8f421e2ff822bb12c67cbce0567e0ec5c709129802d720bb20bc411fb160d3a
Deleted: sha256:e4c62cd28fb379e00aa84957fbd290e5bef6609b17d78e1d1123dcdf92d03c75
Deleted: sha256:1c00d307bf8047d51a2c7b9c5d3d6dcd0ea11505ac5817ef8d6df621a549afdf
Deleted: sha256:c9192b64f3ab12007555680f6b33e715ec66a1175a4405c9241b9e42f41cf9ae
Deleted: sha256:0a3eafdbb84dd3e41b54835c9ca3314f67d8d5281f7a425dd3982a0ae783948c
Deleted: sha256:006eb39e9c19eba008c7b8bbdd1b10b3074eb02f144b01a89459c95ee4458b93
Deleted: sha256:e36a28a8fd90b5ad401fd903296447ee4c6f63a61626f040460b007975e58812
Deleted: sha256:0a271fed8c41c25db32d6b269fd83f06c67d7605281e502c1ed6b1a58d15e069
Deleted: sha256:821bd6df30fb9b94e3eb7e1ea0743f3bce5d0a63efb30550b267613b470fde85
Deleted: sha256:0e11dff739b60732b12294092558ac839ca5cd14c0c1e57bb2c8f7f7ca340a79
Deleted: sha256:7568cb4973ecd2d30d09a2dcce6e51d74e025660a344e63f495882f3ed22bf88
Deleted: sha256:ae9d393b6482741c387441438413d6d9a265b7c63dd6240424ca88e02b946a1e
Deleted: sha256:e2d25bd7dbde7e81ab9111ad3759f30cc6db157ea7b86287501efd8caaecaf8d
Deleted: sha256:e5c5d5dc76900ac753566457b8a5c45b40cf9b289d157aa6ea96176900c712df
Deleted: sha256:f8f3af65dd7440b5d20809110e2abf0d38f4f783ee458a26c287d7871c3a274d
Deleted: sha256:9c33fa3aa705f34ed3051ff45af78cdd96250530492f763c15d5875a3b2e9cb8
Deleted: sha256:5192d8dc21879b97d14ef7674f96e31f05980312816d3ae3aca9abc66036d3a9
Deleted: sha256:575fd6f3172824de8a5696bee802820f9383d5c62dc051dfd2f10b3f42c1e649
Deleted: sha256:892c8aa751a9afbdee8135a60c1ca1a5e251ec6f6447e3acb9c89507d6a0f716
Deleted: sha256:b855fdac6db7312c267a440eb2a575da02a95238ccafd845fa47b71417aef123
Deleted: sha256:c198a9aff8b26a03112f71b3df4d11a0237323554cfb4a791dee79a405eba9ed
Deleted: sha256:178007216114a28bad6dad0c1b51c7898fd4d91890b4721e6fb01b0ae1d60075
Deleted: sha256:a4d67e41a6ff4a117801e5c2a2411e927c58fbde73aa911731b0a80cbdacf3f4
Build step 'Execute shell' marked build as failure

Mime
View raw message