mesos-builds mailing list archives

Site index · List index
Message view « Date » · « Thread »
Top « Date » · « Thread »
From Apache Jenkins Server <jenk...@builds.apache.org>
Subject Build failed in Jenkins: Mesos » cmake,clang,--verbose,GLOG_v=1 MESOS_VERBOSE=1,ubuntu:14.04,(docker||Hadoop)&&(!ubuntu-us1)&&(!ubuntu-6)&&(!ubuntu-eu2) #3102
Date Wed, 11 Jan 2017 11:58:33 GMT
See <https://builds.apache.org/job/Mesos/BUILDTOOL=cmake,COMPILER=clang,CONFIGURATION=--verbose,ENVIRONMENT=GLOG_v=1%20MESOS_VERBOSE=1,OS=ubuntu%3A14.04,label_exp=(docker%7C%7CHadoop)&&(!ubuntu-us1)&&(!ubuntu-6)&&(!ubuntu-eu2)/3102/changes>

Changes:

[benjamin.hindman] Eliminated an EOF race condition in libprocess SSL socket.

[benjamin.hindman] Future::after memory leak fix.

[benjamin.hindman] Used loop in Pipe::Reader::readAll.

[mpark] Removed unused peek function.

[mpark] Fix compilation error for `clang-3.5` type deduction error.

------------------------------------------
[...truncated 13808 lines...]
I0111 11:57:24.782565 24788 master.cpp:435] Master only allowing authenticated frameworks
to register
I0111 11:57:24.782582 24788 master.cpp:449] Master only allowing authenticated agents to register
I0111 11:57:24.782593 24788 master.cpp:462] Master only allowing authenticated HTTP frameworks
to register
I0111 11:57:24.782601 24788 credentials.hpp:37] Loading credentials for authentication from
'/tmp/6DIp23/credentials'
I0111 11:57:24.782769 24788 master.cpp:507] Using default 'crammd5' authenticator
I0111 11:57:24.782835 24788 http.cpp:922] Using default 'basic' HTTP authenticator for realm
'mesos-master-readonly'
I0111 11:57:24.782893 24788 http.cpp:922] Using default 'basic' HTTP authenticator for realm
'mesos-master-readwrite'
I0111 11:57:24.783004 24788 http.cpp:922] Using default 'basic' HTTP authenticator for realm
'mesos-master-scheduler'
I0111 11:57:24.783092 24788 master.cpp:587] Authorization enabled
I0111 11:57:24.783174 24796 whitelist_watcher.cpp:77] No whitelist given
I0111 11:57:24.783191 24795 hierarchical.cpp:149] Initialized hierarchical allocator process
I0111 11:57:24.784160 24788 master.cpp:2119] Elected as the leading master!
I0111 11:57:24.784179 24788 master.cpp:1641] Recovering from registrar
I0111 11:57:24.784296 24785 registrar.cpp:329] Recovering registrar
I0111 11:57:24.784775 24781 registrar.cpp:362] Successfully fetched the registry (0B) in 451072ns
I0111 11:57:24.784821 24781 registrar.cpp:461] Applied 1 operations in 13935ns; attempting
to update the registry
I0111 11:57:24.785223 24784 registrar.cpp:506] Successfully updated the registry in 371712ns
I0111 11:57:24.785302 24784 registrar.cpp:392] Successfully recovered registrar
I0111 11:57:24.785462 24790 master.cpp:1757] Recovered 0 agents from the registry (129B);
allowing 10mins for agents to re-register
I0111 11:57:24.785523 24782 hierarchical.cpp:176] Skipping recovery of hierarchical allocator:
nothing to recover
I0111 11:57:24.788091 24780 containerizer.cpp:220] Using isolation: posix/cpu,posix/mem,filesystem/posix,network/cni
W0111 11:57:24.788492 24780 backend.cpp:76] Failed to create 'aufs' backend: AufsBackend requires
root privileges, but is running as user mesos
W0111 11:57:24.788604 24780 backend.cpp:76] Failed to create 'bind' backend: BindBackend requires
root privileges
I0111 11:57:24.789222 24780 cluster.cpp:446] Creating default 'local' authorizer
I0111 11:57:24.789717 24790 slave.cpp:209] Mesos agent started on (18)@172.17.0.3:53609
I0111 11:57:24.789749 24790 slave.cpp:210] Flags at startup: --acls="" --appc_simple_discovery_uri_prefix="http://"
--appc_store_dir="/tmp/mesos/store/appc" --authenticate_http_readonly="true" --authenticate_http_readwrite="true"
--authenticatee="crammd5" --authentication_backoff_factor="1secs" --authorizer="local" --cgroups_cpu_enable_pids_and_tids_count="false"
--cgroups_enable_cfs="false" --cgroups_hierarchy="/sys/fs/cgroup" --cgroups_limit_swap="false"
--cgroups_root="mesos" --container_disk_watch_interval="15secs" --containerizers="mesos" --credential="/tmp/ExceptionTest_DisallowSchedulerCallbacksOnAbort_dPB95F/credential"
--default_role="*" --disk_watch_interval="1mins" --docker="docker" --docker_kill_orphans="true"
--docker_registry="https://registry-1.docker.io" --docker_remove_delay="6hrs" --docker_socket="/var/run/docker.sock"
--docker_stop_timeout="0ns" --docker_store_dir="/tmp/mesos/store/docker" --docker_volume_checkpoint_dir="/var/run/mesos/isolators/docker/volume"
--enforce_container_disk_quota="false" --executor_registration_timeout="1mins" --executor_shutdown_grace_period="5secs"
--fetcher_cache_dir="/tmp/ExceptionTest_DisallowSchedulerCallbacksOnAbort_dPB95F/fetch" --fetcher_cache_size="2GB"
--frameworks_home="" --gc_delay="1weeks" --gc_disk_headroom="0.1" --hadoop_home="" --help="false"
--hostname_lookup="true" --http_authenticators="basic" --http_command_executor="false" --http_credentials="/tmp/ExceptionTest_DisallowSchedulerCallbacksOnAbort_dPB95F/http_credentials"
--http_heartbeat_interval="30secs" --image_provisioner_backend="copy" --initialize_driver_logging="true"
--isolation="posix/cpu,posix/mem" --launcher="posix" --launcher_dir="/mesos/build/src" --logbufsecs="0"
--logging_level="INFO" --max_completed_executors_per_framework="150" --oversubscribed_resources_interval="15secs"
--perf_duration="10secs" --perf_interval="1mins" --qos_correction_interval_min="0ns" --quiet="false"
--recover="reconnect" --recovery_timeout="15mins" --registration_backoff_factor="10ms" --resources="cpus:2;gpus:0;mem:1024;disk:1024;ports:[31000-32000]"
--revocable_cpu_low_priority="true" --runtime_dir="/tmp/ExceptionTest_DisallowSchedulerCallbacksOnAbort_dPB95F"
--sandbox_directory="/mnt/mesos/sandbox" --strict="true" --switch_user="true" --systemd_enable_support="true"
--systemd_runtime_directory="/run/systemd/system" --version="false" --work_dir="/tmp/ExceptionTest_DisallowSchedulerCallbacksOnAbort_xuch4R"
I0111 11:57:24.790176 24790 credentials.hpp:86] Loading credential for authentication from
'/tmp/ExceptionTest_DisallowSchedulerCallbacksOnAbort_dPB95F/credential'
I0111 11:57:24.790269 24790 slave.cpp:352] Agent using credential for: test-principal
I0111 11:57:24.790287 24790 credentials.hpp:37] Loading credentials for authentication from
'/tmp/ExceptionTest_DisallowSchedulerCallbacksOnAbort_dPB95F/http_credentials'
I0111 11:57:24.790418 24790 http.cpp:922] Using default 'basic' HTTP authenticator for realm
'mesos-agent-readonly'
I0111 11:57:24.790508 24790 http.cpp:922] Using default 'basic' HTTP authenticator for realm
'mesos-agent-readwrite'
I0111 11:57:24.790554 24780 sched.cpp:232] Version: 1.2.0
I0111 11:57:24.791010 24784 sched.cpp:336] New master detected at master@172.17.0.3:53609
I0111 11:57:24.791059 24784 sched.cpp:407] Authenticating with master master@172.17.0.3:53609
I0111 11:57:24.791069 24784 sched.cpp:414] Using default CRAM-MD5 authenticatee
I0111 11:57:24.791133 24790 slave.cpp:539] Agent resources: cpus(*):2; mem(*):1024; disk(*):1024;
ports(*):[31000-32000]
I0111 11:57:24.791187 24794 authenticatee.cpp:121] Creating new client SASL connection
I0111 11:57:24.791194 24790 slave.cpp:547] Agent attributes: [  ]
I0111 11:57:24.791206 24790 slave.cpp:552] Agent hostname: 097bec2a154e
I0111 11:57:24.791347 24794 master.cpp:6835] Authenticating scheduler-9fd37784-32a0-43e7-bbb4-26a532ab0a55@172.17.0.3:53609
I0111 11:57:24.791438 24787 authenticator.cpp:414] Starting authentication session for crammd5-authenticatee(41)@172.17.0.3:53609
I0111 11:57:24.791586 24782 authenticator.cpp:98] Creating new server SASL connection
I0111 11:57:24.791671 24793 state.cpp:60] Recovering state from '/tmp/ExceptionTest_DisallowSchedulerCallbacksOnAbort_xuch4R/meta'
I0111 11:57:24.791795 24789 authenticatee.cpp:213] Received SASL authentication mechanisms:
CRAM-MD5
I0111 11:57:24.791947 24789 authenticatee.cpp:239] Attempting to authenticate with mechanism
'CRAM-MD5'
I0111 11:57:24.791996 24781 status_update_manager.cpp:203] Recovering status update manager
I0111 11:57:24.792028 24782 authenticator.cpp:204] Received SASL authentication start
I0111 11:57:24.792110 24782 authenticator.cpp:326] Authentication requires more steps
I0111 11:57:24.792188 24796 authenticatee.cpp:259] Received SASL authentication step
I0111 11:57:24.792271 24784 containerizer.cpp:599] Recovering containerizer
I0111 11:57:24.792337 24789 authenticator.cpp:232] Received SASL authentication step
I0111 11:57:24.792368 24789 auxprop.cpp:109] Request to lookup properties for user: 'test-principal'
realm: '097bec2a154e' server FQDN: '097bec2a154e' SASL_AUXPROP_VERIFY_AGAINST_HASH: false
SASL_AUXPROP_OVERRIDE: false SASL_AUXPROP_AUTHZID: false 
I0111 11:57:24.792377 24789 auxprop.cpp:181] Looking up auxiliary property '*userPassword'
I0111 11:57:24.792392 24789 auxprop.cpp:181] Looking up auxiliary property '*cmusaslsecretCRAM-MD5'
I0111 11:57:24.792402 24789 auxprop.cpp:109] Request to lookup properties for user: 'test-principal'
realm: '097bec2a154e' server FQDN: '097bec2a154e' SASL_AUXPROP_VERIFY_AGAINST_HASH: false
SASL_AUXPROP_OVERRIDE: false SASL_AUXPROP_AUTHZID: true 
I0111 11:57:24.792412 24789 auxprop.cpp:131] Skipping auxiliary property '*userPassword' since
SASL_AUXPROP_AUTHZID == true
I0111 11:57:24.792503 24789 auxprop.cpp:131] Skipping auxiliary property '*cmusaslsecretCRAM-MD5'
since SASL_AUXPROP_AUTHZID == true
I0111 11:57:24.792531 24789 authenticator.cpp:318] Authentication success
I0111 11:57:24.792656 24782 master.cpp:6865] Successfully authenticated principal 'test-principal'
at scheduler-9fd37784-32a0-43e7-bbb4-26a532ab0a55@172.17.0.3:53609
I0111 11:57:24.792724 24791 authenticator.cpp:432] Authentication session cleanup for crammd5-authenticatee(41)@172.17.0.3:53609
I0111 11:57:24.792773 24796 authenticatee.cpp:299] Authentication success
I0111 11:57:24.793107 24796 sched.cpp:513] Successfully authenticated with master master@172.17.0.3:53609
I0111 11:57:24.793123 24796 sched.cpp:836] Sending SUBSCRIBE call to master@172.17.0.3:53609
I0111 11:57:24.793169 24796 sched.cpp:869] Will retry registration in 33.121384ms if necessary
I0111 11:57:24.793246 24783 master.cpp:2707] Received SUBSCRIBE call for framework 'default'
at scheduler-9fd37784-32a0-43e7-bbb4-26a532ab0a55@172.17.0.3:53609
I0111 11:57:24.793274 24783 master.cpp:2155] Authorizing framework principal 'test-principal'
to receive offers for role '*'
I0111 11:57:24.793334 24781 provisioner.cpp:251] Provisioner recovery complete
I0111 11:57:24.793488 24794 master.cpp:2783] Subscribing framework default with checkpointing
disabled and capabilities [  ]
I0111 11:57:24.793540 24786 slave.cpp:5421] Finished recovery
I0111 11:57:24.793705 24781 hierarchical.cpp:277] Added framework 170c6e30-476f-49be-a93b-706af57a233d-0000
I0111 11:57:24.793787 24781 hierarchical.cpp:1690] No allocations performed
I0111 11:57:24.793732 24788 sched.cpp:759] Framework registered with 170c6e30-476f-49be-a93b-706af57a233d-0000
I0111 11:57:24.793896 24781 hierarchical.cpp:1785] No inverse offers to send out!
I0111 11:57:24.793972 24781 hierarchical.cpp:1292] Performed allocation for 0 agents in 207831ns
I0111 11:57:24.793946 24788 sched.cpp:773] Scheduler::registered took 75349ns
I0111 11:57:24.794045 24786 slave.cpp:5595] Querying resource estimator for oversubscribable
resources
I0111 11:57:24.794168 24786 slave.cpp:924] New master detected at master@172.17.0.3:53609
I0111 11:57:24.794183 24785 status_update_manager.cpp:177] Pausing sending status updates
I0111 11:57:24.794271 24786 slave.cpp:959] Detecting new master
I0111 11:57:24.794391 24786 slave.cpp:5609] Received oversubscribable resources {} from the
resource estimator
I0111 11:57:24.800444 24787 slave.cpp:986] Authenticating with master master@172.17.0.3:53609
I0111 11:57:24.800478 24787 slave.cpp:997] Using default CRAM-MD5 authenticatee
I0111 11:57:24.800572 24795 authenticatee.cpp:121] Creating new client SASL connection
I0111 11:57:24.800786 24796 master.cpp:6835] Authenticating slave(18)@172.17.0.3:53609
I0111 11:57:24.800858 24795 authenticator.cpp:414] Starting authentication session for crammd5-authenticatee(42)@172.17.0.3:53609
I0111 11:57:24.800971 24790 authenticator.cpp:98] Creating new server SASL connection
I0111 11:57:24.801116 24796 authenticatee.cpp:213] Received SASL authentication mechanisms:
CRAM-MD5
I0111 11:57:24.801139 24796 authenticatee.cpp:239] Attempting to authenticate with mechanism
'CRAM-MD5'
I0111 11:57:24.801208 24783 authenticator.cpp:204] Received SASL authentication start
I0111 11:57:24.801254 24783 authenticator.cpp:326] Authentication requires more steps
I0111 11:57:24.801301 24783 authenticatee.cpp:259] Received SASL authentication step
I0111 11:57:24.801379 24793 authenticator.cpp:232] Received SASL authentication step
I0111 11:57:24.801409 24793 auxprop.cpp:109] Request to lookup properties for user: 'test-principal'
realm: '097bec2a154e' server FQDN: '097bec2a154e' SASL_AUXPROP_VERIFY_AGAINST_HASH: false
SASL_AUXPROP_OVERRIDE: false SASL_AUXPROP_AUTHZID: false 
I0111 11:57:24.801419 24793 auxprop.cpp:181] Looking up auxiliary property '*userPassword'
I0111 11:57:24.801429 24793 auxprop.cpp:181] Looking up auxiliary property '*cmusaslsecretCRAM-MD5'
I0111 11:57:24.801440 24793 auxprop.cpp:109] Request to lookup properties for user: 'test-principal'
realm: '097bec2a154e' server FQDN: '097bec2a154e' SASL_AUXPROP_VERIFY_AGAINST_HASH: false
SASL_AUXPROP_OVERRIDE: false SASL_AUXPROP_AUTHZID: true 
I0111 11:57:24.801446 24793 auxprop.cpp:131] Skipping auxiliary property '*userPassword' since
SASL_AUXPROP_AUTHZID == true
I0111 11:57:24.801451 24793 auxprop.cpp:131] Skipping auxiliary property '*cmusaslsecretCRAM-MD5'
since SASL_AUXPROP_AUTHZID == true
I0111 11:57:24.801465 24793 authenticator.cpp:318] Authentication success
I0111 11:57:24.801524 24791 authenticatee.cpp:299] Authentication success
I0111 11:57:24.801556 24783 master.cpp:6865] Successfully authenticated principal 'test-principal'
at slave(18)@172.17.0.3:53609
I0111 11:57:24.801584 24793 authenticator.cpp:432] Authentication session cleanup for crammd5-authenticatee(42)@172.17.0.3:53609
I0111 11:57:24.801674 24791 slave.cpp:1081] Successfully authenticated with master master@172.17.0.3:53609
I0111 11:57:24.801743 24791 slave.cpp:1503] Will retry registration in 12.50627ms if necessary
I0111 11:57:24.801826 24786 master.cpp:5234] Registering agent at slave(18)@172.17.0.3:53609
(097bec2a154e) with id 170c6e30-476f-49be-a93b-706af57a233d-S0
I0111 11:57:24.802034 24793 registrar.cpp:461] Applied 1 operations in 23665ns; attempting
to update the registry
I0111 11:57:24.802374 24787 registrar.cpp:506] Successfully updated the registry in 314112ns
I0111 11:57:24.802678 24790 slave.cpp:4285] Received ping from slave-observer(13)@172.17.0.3:53609
I0111 11:57:24.802705 24784 master.cpp:5305] Registered agent 170c6e30-476f-49be-a93b-706af57a233d-S0
at slave(18)@172.17.0.3:53609 (097bec2a154e) with cpus(*):2; mem(*):1024; disk(*):1024; ports(*):[31000-32000]
I0111 11:57:24.802755 24790 slave.cpp:1127] Registered with master master@172.17.0.3:53609;
given agent ID 170c6e30-476f-49be-a93b-706af57a233d-S0
I0111 11:57:24.802773 24790 fetcher.cpp:90] Clearing fetcher cache
I0111 11:57:24.802809 24786 hierarchical.cpp:491] Added agent 170c6e30-476f-49be-a93b-706af57a233d-S0
(097bec2a154e) with cpus(*):2; mem(*):1024; disk(*):1024; ports(*):[31000-32000] (allocated:
{})
I0111 11:57:24.802940 24792 status_update_manager.cpp:184] Resuming sending status updates
I0111 11:57:24.803102 24786 hierarchical.cpp:1785] No inverse offers to send out!
I0111 11:57:24.803122 24790 slave.cpp:1155] Checkpointing SlaveInfo to '/tmp/ExceptionTest_DisallowSchedulerCallbacksOnAbort_xuch4R/meta/slaves/170c6e30-476f-49be-a93b-706af57a233d-S0/slave.info'
I0111 11:57:24.803124 24786 hierarchical.cpp:1315] Performed allocation for agent 170c6e30-476f-49be-a93b-706af57a233d-S0
in 288487ns
I0111 11:57:24.803266 24792 master.cpp:6664] Sending 1 offers to framework 170c6e30-476f-49be-a93b-706af57a233d-0000
(default) at scheduler-9fd37784-32a0-43e7-bbb4-26a532ab0a55@172.17.0.3:53609
I0111 11:57:24.803414 24790 slave.cpp:1193] Forwarding total oversubscribed resources {}
I0111 11:57:24.803457 24792 sched.cpp:933] Scheduler::resourceOffers took 61450ns
I0111 11:57:24.803611 24781 master.cpp:5712] Received update of agent 170c6e30-476f-49be-a93b-706af57a233d-S0
at slave(18)@172.17.0.3:53609 (097bec2a154e) with total oversubscribed resources {}
I0111 11:57:24.803762 24785 hierarchical.cpp:561] Agent 170c6e30-476f-49be-a93b-706af57a233d-S0
(097bec2a154e) updated with oversubscribed resources {} (total: cpus(*):2; mem(*):1024; disk(*):1024;
ports(*):[31000-32000], allocated: cpus(*):2; mem(*):1024; disk(*):1024; ports(*):[31000-32000])
I0111 11:57:24.803823 24785 hierarchical.cpp:1690] No allocations performed
I0111 11:57:24.803827 24780 sched.cpp:2055] Asked to abort the driver
I0111 11:57:24.803845 24785 hierarchical.cpp:1785] No inverse offers to send out!
I0111 11:57:24.803877 24785 hierarchical.cpp:1315] Performed allocation for agent 170c6e30-476f-49be-a93b-706af57a233d-S0
in 87451ns
I0111 11:57:24.803956 24785 sched.cpp:1233] Aborting framework 170c6e30-476f-49be-a93b-706af57a233d-0000
I0111 11:57:24.804100 24785 sched.cpp:939] Ignoring rescind offer message because the driver
is not running!
I0111 11:57:24.804231 24793 master.cpp:3016] Deactivating framework 170c6e30-476f-49be-a93b-706af57a233d-0000
(default) at scheduler-9fd37784-32a0-43e7-bbb4-26a532ab0a55@172.17.0.3:53609
I0111 11:57:24.804443 24780 sched.cpp:2021] Asked to stop the driver
I0111 11:57:24.804466 24787 hierarchical.cpp:392] Deactivated framework 170c6e30-476f-49be-a93b-706af57a233d-0000
I0111 11:57:24.804572 24795 sched.cpp:1203] Stopping framework 170c6e30-476f-49be-a93b-706af57a233d-0000
I0111 11:57:24.804710 24787 hierarchical.cpp:1024] Recovered cpus(*):2; mem(*):1024; disk(*):1024;
ports(*):[31000-32000] (total: cpus(*):2; mem(*):1024; disk(*):1024; ports(*):[31000-32000],
allocated: {}) on agent 170c6e30-476f-49be-a93b-706af57a233d-S0 from framework 170c6e30-476f-49be-a93b-706af57a233d-0000
I0111 11:57:24.804769 24793 master.cpp:7375] Processing TEARDOWN call for framework 170c6e30-476f-49be-a93b-706af57a233d-0000
(default) at scheduler-9fd37784-32a0-43e7-bbb4-26a532ab0a55@172.17.0.3:53609
I0111 11:57:24.804814 24793 master.cpp:7387] Removing framework 170c6e30-476f-49be-a93b-706af57a233d-0000
(default) at scheduler-9fd37784-32a0-43e7-bbb4-26a532ab0a55@172.17.0.3:53609
I0111 11:57:24.804975 24792 slave.cpp:2595] Asked to shut down framework 170c6e30-476f-49be-a93b-706af57a233d-0000
by master@172.17.0.3:53609
I0111 11:57:24.805002 24792 slave.cpp:2610] Cannot shut down unknown framework 170c6e30-476f-49be-a93b-706af57a233d-0000
I0111 11:57:24.805222 24783 hierarchical.cpp:343] Removed framework 170c6e30-476f-49be-a93b-706af57a233d-0000
I0111 11:57:24.806224 24787 slave.cpp:796] Agent terminating
I0111 11:57:24.806380 24789 master.cpp:1261] Agent 170c6e30-476f-49be-a93b-706af57a233d-S0
at slave(18)@172.17.0.3:53609 (097bec2a154e) disconnected
I0111 11:57:24.806406 24789 master.cpp:3051] Disconnecting agent 170c6e30-476f-49be-a93b-706af57a233d-S0
at slave(18)@172.17.0.3:53609 (097bec2a154e)
I0111 11:57:24.806466 24789 master.cpp:3070] Deactivating agent 170c6e30-476f-49be-a93b-706af57a233d-S0
at slave(18)@172.17.0.3:53609 (097bec2a154e)
I0111 11:57:24.806534 24783 hierarchical.cpp:590] Agent 170c6e30-476f-49be-a93b-706af57a233d-S0
deactivated
I0111 11:57:24.808723 24788 master.cpp:1100] Master terminating
I0111 11:57:24.808959 24783 hierarchical.cpp:523] Removed agent 170c6e30-476f-49be-a93b-706af57a233d-S0
[       OK ] ExceptionTest.DisallowSchedulerCallbacksOnAbort (31 ms)
[----------] 3 tests from ExceptionTest (74 ms total)

[----------] 4 tests from ExecutorHttpApiTest
[ RUN      ] ExecutorHttpApiTest.NoContentType
I0111 11:57:24.813575 24780 cluster.cpp:160] Creating default 'local' authorizer
I0111 11:57:24.814952 24785 master.cpp:383] Master 5231fa61-ebba-4440-86ef-be5ec13c4279 (097bec2a154e)
started on 172.17.0.3:53609
I0111 11:57:24.814985 24785 master.cpp:385] Flags at startup: --acls="" --agent_ping_timeout="15secs"
--agent_reregister_timeout="10mins" --allocation_interval="1secs" --allocator="HierarchicalDRF"
--authenticate_agents="true" --authenticate_frameworks="true" --authenticate_http_frameworks="true"
--authenticate_http_readonly="true" --authenticate_http_readwrite="true" --authenticators="crammd5"
--authorizers="local" --credentials="/tmp/eaDLj6/credentials" --framework_sorter="drf" --help="false"
--hostname_lookup="true" --http_authenticators="basic" --http_framework_authenticators="basic"
--initialize_driver_logging="true" --log_auto_initialize="true" --logbufsecs="0" --logging_level="INFO"
--max_agent_ping_timeouts="5" --max_completed_frameworks="50" --max_completed_tasks_per_framework="1000"
--quiet="false" --recovery_agent_removal_limit="100%" --registry="in_memory" --registry_fetch_timeout="1mins"
--registry_gc_interval="15mins" --registry_max_agent_age="2weeks" --registry_max_agent_count="102400"
--registry_store_timeout="100secs" --registry_strict="false" --root_submissions="true" --user_sorter="drf"
--version="false" --webui_dir="/usr/local/share/mesos/webui" --work_dir="/tmp/eaDLj6/master"
--zk_session_timeout="10secs"
I0111 11:57:24.815261 24785 master.cpp:435] Master only allowing authenticated frameworks
to register
I0111 11:57:24.815277 24785 master.cpp:449] Master only allowing authenticated agents to register
I0111 11:57:24.815290 24785 master.cpp:462] Master only allowing authenticated HTTP frameworks
to register
I0111 11:57:24.815304 24785 credentials.hpp:37] Loading credentials for authentication from
'/tmp/eaDLj6/credentials'
I0111 11:57:24.815479 24785 master.cpp:507] Using default 'crammd5' authenticator
I0111 11:57:24.815544 24785 http.cpp:922] Using default 'basic' HTTP authenticator for realm
'mesos-master-readonly'
I0111 11:57:24.815618 24785 http.cpp:922] Using default 'basic' HTTP authenticator for realm
'mesos-master-readwrite'
I0111 11:57:24.815698 24785 http.cpp:922] Using default 'basic' HTTP authenticator for realm
'mesos-master-scheduler'
I0111 11:57:24.815753 24785 master.cpp:587] Authorization enabled
I0111 11:57:24.815937 24784 whitelist_watcher.cpp:77] No whitelist given
I0111 11:57:24.816007 24793 hierarchical.cpp:149] Initialized hierarchical allocator process
I0111 11:57:24.816876 24785 master.cpp:2119] Elected as the leading master!
I0111 11:57:24.816892 24785 master.cpp:1641] Recovering from registrar
I0111 11:57:24.816954 24792 registrar.cpp:329] Recovering registrar
I0111 11:57:24.817215 24794 registrar.cpp:362] Successfully fetched the registry (0B) in 229120ns
I0111 11:57:24.817258 24794 registrar.cpp:461] Applied 1 operations in 13950ns; attempting
to update the registry
I0111 11:57:24.817507 24787 registrar.cpp:506] Successfully updated the registry in 216064ns
I0111 11:57:24.817567 24787 registrar.cpp:392] Successfully recovered registrar
I0111 11:57:24.817781 24782 master.cpp:1757] Recovered 0 agents from the registry (129B);
allowing 10mins for agents to re-register
I0111 11:57:24.817843 24784 hierarchical.cpp:176] Skipping recovery of hierarchical allocator:
nothing to recover
I0111 11:57:24.820484 24780 containerizer.cpp:220] Using isolation: posix/cpu,posix/mem,filesystem/posix,network/cni
W0111 11:57:24.820885 24780 backend.cpp:76] Failed to create 'aufs' backend: AufsBackend requires
root privileges, but is running as user mesos
W0111 11:57:24.820976 24780 backend.cpp:76] Failed to create 'bind' backend: BindBackend requires
root privileges
I0111 11:57:24.821627 24780 cluster.cpp:446] Creating default 'local' authorizer
I0111 11:57:24.822266 24793 slave.cpp:209] Mesos agent started on (19)@172.17.0.3:53609
I0111 11:57:24.822296 24793 slave.cpp:210] Flags at startup: --acls="" --appc_simple_discovery_uri_prefix="http://"
--appc_store_dir="/tmp/mesos/store/appc" --authenticate_http_readonly="true" --authenticate_http_readwrite="true"
--authenticatee="crammd5" --authentication_backoff_factor="1secs" --authorizer="local" --cgroups_cpu_enable_pids_and_tids_count="false"
--cgroups_enable_cfs="false" --cgroups_hierarchy="/sys/fs/cgroup" --cgroups_limit_swap="false"
--cgroups_root="mesos" --container_disk_watch_interval="15secs" --containerizers="mesos" --credential="/tmp/ExecutorHttpApiTest_NoContentType_GYwZxI/credential"
--default_role="*" --disk_watch_interval="1mins" --docker="docker" --docker_kill_orphans="true"
--docker_registry="https://registry-1.docker.io" --docker_remove_delay="6hrs" --docker_socket="/var/run/docker.sock"
--docker_stop_timeout="0ns" --docker_store_dir="/tmp/mesos/store/docker" --docker_volume_checkpoint_dir="/var/run/mesos/isolators/docker/volume"
--enforce_container_disk_quota="false" --executor_registration_timeout="1mins" --executor_shutdown_grace_period="5secs"
--fetcher_cache_dir="/tmp/ExecutorHttpApiTest_NoContentType_GYwZxI/fetch" --fetcher_cache_size="2GB"
--frameworks_home="" --gc_delay="1weeks" --gc_disk_headroom="0.1" --hadoop_home="" --help="false"
--hostname_lookup="true" --http_authenticators="basic" --http_command_executor="false" --http_credentials="/tmp/ExecutorHttpApiTest_NoContentType_GYwZxI/http_credentials"
--http_heartbeat_interval="30secs" --image_provisioner_backend="copy" --initialize_driver_logging="true"
--isolation="posix/cpu,posix/mem" --launcher="posix" --launcher_dir="/mesos/build/src" --logbufsecs="0"
--logging_level="INFO" --max_completed_executors_per_framework="150" --oversubscribed_resources_interval="15secs"
--perf_duration="10secs" --perf_interval="1mins" --qos_correction_interval_min="0ns" --quiet="false"
--recover="reconnect" --recovery_timeout="15mins" --registration_backoff_factor="10ms" --resources="cpus:2;gpus:0;mem:1024;disk:1024;ports:[31000-32000]"
--revocable_cpu_low_priority="true" --runtime_dir="/tmp/ExecutorHttpApiTest_NoContentType_GYwZxI"
--sandbox_directory="/mnt/mesos/sandbox" --strict="true" --switch_user="true" --systemd_enable_support="true"
--systemd_runtime_directory="/run/systemd/system" --version="false" --work_dir="/tmp/ExecutorHttpApiTest_NoContentType_8d3RqU"
I0111 11:57:24.822823 24793 credentials.hpp:86] Loading credential for authentication from
'/tmp/ExecutorHttpApiTest_NoContentType_GYwZxI/credential'
I0111 11:57:24.822929 24793 slave.cpp:352] Agent using credential for: test-principal
I0111 11:57:24.822945 24793 credentials.hpp:37] Loading credentials for authentication from
'/tmp/ExecutorHttpApiTest_NoContentType_GYwZxI/http_credentials'
I0111 11:57:24.823068 24793 http.cpp:922] Using default 'basic' HTTP authenticator for realm
'mesos-agent-readonly'
I0111 11:57:24.823134 24793 http.cpp:922] Using default 'basic' HTTP authenticator for realm
'mesos-agent-readwrite'
I0111 11:57:24.823693 24793 slave.cpp:539] Agent resources: cpus(*):2; mem(*):1024; disk(*):1024;
ports(*):[31000-32000]
I0111 11:57:24.823734 24793 slave.cpp:547] Agent attributes: [  ]
I0111 11:57:24.823740 24793 slave.cpp:552] Agent hostname: 097bec2a154e
I0111 11:57:24.824188 24790 state.cpp:60] Recovering state from '/tmp/ExecutorHttpApiTest_NoContentType_8d3RqU/meta'
I0111 11:57:24.824370 24791 status_update_manager.cpp:203] Recovering status update manager
I0111 11:57:24.824513 24785 containerizer.cpp:599] Recovering containerizer
I0111 11:57:24.825160 24782 provisioner.cpp:251] Provisioner recovery complete
I0111 11:57:24.825551 24785 slave.cpp:5421] Finished recovery
I0111 11:57:24.826129 24785 slave.cpp:5595] Querying resource estimator for oversubscribable
resources
I0111 11:57:24.826299 24785 slave.cpp:924] New master detected at master@172.17.0.3:53609
I0111 11:57:24.826326 24788 status_update_manager.cpp:177] Pausing sending status updates
I0111 11:57:24.826455 24785 slave.cpp:959] Detecting new master
I0111 11:57:24.826607 24785 slave.cpp:5609] Received oversubscribable resources {} from the
resource estimator
I0111 11:57:24.832669 24782 process.cpp:3676] Handling HTTP event for process 'slave(19)'
with path: '/slave(19)/api/v1/executor'
*** Error in `src/mesos-tests': double free or corruption (fasttop): 0x00002ae0b4006560 ***
*** Aborted at 1484135844 (unix time) try "date -d @1484135844" if you are using GNU date
***
PC: @     0x2ae0a4ff6c37 (unknown)
*** SIGABRT (@0x3e8000060cc) received by PID 24780 (TID 0x2ae0ac182700) from PID 24780; stack
trace: ***
    @     0x2ae0a4592330 (unknown)
    @     0x2ae0a4ff6c37 (unknown)
    @     0x2ae0a4ffa028 (unknown)
    @     0x2ae0a50332a4 (unknown)
    @     0x2ae0a503f55e (unknown)
    @     0x2ae0a1746d39 _ZNSt14_Function_base13_Base_managerIZN7process8internal4LoopIZNS1_4http4Pipe6Reader7readAllEvE3$_7ZNS6_7readAllEvE3$_8SsSsE3runENS1_6FutureISsEEEUlvE1_E10_M_managerERSt9_Any_dataRKSE_St18_Manager_operation
    @     0x2ae0a1745caa process::internal::Loop<>::run()
    @     0x2ae0a170aed5 process::http::Pipe::Reader::readAll()
    @     0x2ae0a182a338 process::ProcessBase::visit()
    @     0x2ae0a1827a67 process::ProcessManager::resume()
    @     0x2ae0a183c20f std::thread::_Impl<>::_M_run()
    @     0x2ae0a4851a60 (unknown)
    @     0x2ae0a458a184 start_thread
    @     0x2ae0a50ba37d (unknown)
make[3]: *** [CMakeFiles/check] Aborted
make[3]: Leaving directory `/mesos/build'
make[2]: *** [CMakeFiles/check.dir/all] Error 2
make[2]: Leaving directory `/mesos/build'
make[1]: Leaving directory `/mesos/build'
make[1]: *** [CMakeFiles/check.dir/rule] Error 2
make: *** [check] Error 2
+ docker rmi mesos-1484133701-8013
Untagged: mesos-1484133701-8013:latest
Deleted: sha256:866d6755c297c253e4434623cd074a12d44d5a864b4aef54e240422c1c35c060
Deleted: sha256:839e805e95260a9cbecef561441f338bcfb651eb052deb70c66e209dacab1f6e
Deleted: sha256:17bac51bce8e5ea9f95c061571acc4b341aa5a3f2a4a7487ab346a4ab2d03211
Deleted: sha256:cdefefd55ded613bb01345381f92b39019ba6db590bb420909430092e365e8d2
Deleted: sha256:b5fc565e623a490c4363b43c03e1ed689ed8187a6ca31cb80bab825435058d2e
Deleted: sha256:c58d2fa7df109327986bcfa193932c9f7c778f1d1717d1b53b20a29c92410cda
Deleted: sha256:922c98e4a7290690c55f9c36cc0855f20a8672fcf4c826583298d22524e80317
Deleted: sha256:97ace497739bc77af870e9d45e4510fc0ddf09a9a749253acd25dbf0bde8183f
Deleted: sha256:4097a8877ab5f2256fe83d3dc4612160529c6b70ec5c35da916f9ee086587c1c
Deleted: sha256:d83049172d8183a044d7713a7e556a97bd565badfcf381cde57da791f6a8c133
Deleted: sha256:fc4d2b55fa06355501a60f38f2eb285002e074b5d9e5fa87091d90e5bc01484e
Deleted: sha256:a2356a27b0c92fb26c614a654ff9ac757111b541e8443a57b2e6a947a67fb9d0
Deleted: sha256:5f1ae363ba12cddc15be9c4b1a6e4040d29126cb2a65a4c6b64090f51070d14e
Deleted: sha256:901cc29225c2d4de15d97cb2e62ac5fc2b5e820b4e61eaefb700c50a094e71d1
Deleted: sha256:f2f46375706d24219ebe38c0e2e227663f796fb744824f37908daaab3f71b253
Deleted: sha256:c368b0be7284295b3c3dcc53f0e32d53868afe6d174c1e01c9655687d7f9437f
Deleted: sha256:dc835244db87418253a5d81870b8bc145e3df66943dd088621079a9cad440263
Deleted: sha256:223dd0e7f86df9c7645b4427cc095c20ec815e51b9bc3705abb6eae98e2fc923
Deleted: sha256:60692174bf11ad3b7e2be717b6d3a07a4f5f568f698cc97d0a6696b3bc3dbd02
Deleted: sha256:3296a818bd13e8f5efc0bb9e8eb938fc5cb1b16d8134dff698b2066e668de701
Deleted: sha256:ee90918a408ec8215408a9f3595e55d8a94f7c88f758888724914c2f3dd2d2a6
Deleted: sha256:94c98dd3632f4c44ed3474a8d9b59b9a2d60535580ad5156656d1e4ae59cc6fd
Deleted: sha256:fbd945d3d7dbbfa045603764a8517813770ef1f88d9fbcebc9144a41755a8fac
Deleted: sha256:4698f16a723967dd8858a81184354f2f33e57b516999cf50ba45b43d949761fe
Build step 'Execute shell' marked build as failure

Mime
View raw message