mesos-builds mailing list archives

Site index · List index
Message view « Date » · « Thread »
Top « Date » · « Thread »
From Apache Jenkins Server <jenk...@builds.apache.org>
Subject Build failed in Jenkins: Mesos » cmake,gcc,--verbose --enable-libevent --enable-ssl,GLOG_v=1 MESOS_VERBOSE=1,ubuntu:14.04,(docker||Hadoop)&&(!ubuntu-us1)&&(!ubuntu-6)&&(!ubuntu-eu2) #3096
Date Tue, 10 Jan 2017 06:22:21 GMT
See <https://builds.apache.org/job/Mesos/BUILDTOOL=cmake,COMPILER=gcc,CONFIGURATION=--verbose%20--enable-libevent%20--enable-ssl,ENVIRONMENT=GLOG_v=1%20MESOS_VERBOSE=1,OS=ubuntu%3A14.04,label_exp=(docker%7C%7CHadoop)&&(!ubuntu-us1)&&(!ubuntu-6)&&(!ubuntu-eu2)/3096/changes>

Changes:

[joris.van.remoortere] Fixed memory leak in implementation of Future<T>::after().

[mpark] CMake: renamed `stout_tests` to `stout-tests` to match autotools.

[mpark] CMake: renamed `process_tests` to `libprocess-tests` to match autotools.

[mpark] CMake: renamed test binaries to match autotools.

[mpark] Removed mpark's gmail address from `contributors.yaml`.

[mpark] Added a default move constructor for `Try`.

[benjamin.hindman] Used process::io::BUFFERED_READ_SIZE instead of constant.

[benjamin.hindman] Introduced ControlFlow for process::loop.

[benjamin.hindman] Updated Mesos process::loop uses with process::ControlFlow.

[benjamin.hindman] Used process::loop to avoid stack overflow due to recursion.

[benjamin.hindman] Used `loop` in implementation of io::read and io::write.

[vinodkone] Improved comments in agent.

[vinodkone] Cleaned up agent re-registration code in the master slightly.

[vinodkone] Improved OneWayPartitionTest.MasterToSlave.

[vinodkone] Cleaned up two test cases slightly.

[vinodkone] Cleaned up `using` statements.

[vinodkone] Fixed quoting in agent error message.

[vinodkone] Cleaned up slave recovery tests.

[vinodkone] Improved handling of agents that restart but never re-register.

[vinodkone] Cleaned up master logging code slightly.

[mpark] Install a symlink rather than building `mesos-agent` twice.

[mpark] Removed unsupported `friend` declaration.

[yujie.jay] Fixed an FD leak in the IO switchboard.

[mpark] Removed a redundant `return` statement in libprocess.

[mpark] Cleaned up `std::string` usage in stout.

[mpark] Cleaned up `std::string` usage in libprocess.

[mpark] Cleaned up `std::string` usage in mesos.

[mpark] Avoided unnecessary copies in mesos.

[mpark] Removed unused namespace alias declarations in libprocess.

[mpark] Removed unused namespace alias declarations in mesos.

[mpark] Avoided needless copies in log tests + some minor code cleanup.

[haosdent] Fix incorrect glyphicons-halflings-regular.woff2.

------------------------------------------
[...truncated 165089 lines...]
I0110 06:21:55.646195 27069 containerizer.cpp:220] Using isolation: posix/cpu,posix/mem,filesystem/posix,network/cni
W0110 06:21:55.646580 27069 backend.cpp:76] Failed to create 'aufs' backend: AufsBackend requires
root privileges, but is running as user mesos
W0110 06:21:55.646728 27069 backend.cpp:76] Failed to create 'bind' backend: BindBackend requires
root privileges
I0110 06:21:55.647904 27085 slave.cpp:209] Mesos agent started on (678)@172.17.0.3:36595
I0110 06:21:55.647919 27085 slave.cpp:210] Flags at startup: --acls="" --appc_simple_discovery_uri_prefix="http://"
--appc_store_dir="/tmp/mesos/store/appc" --authenticate_http_readonly="true" --authenticate_http_readwrite="true"
--authenticatee="crammd5" --authentication_backoff_factor="1secs" --authorizer="local" --cgroups_cpu_enable_pids_and_tids_count="false"
--cgroups_enable_cfs="false" --cgroups_hierarchy="/sys/fs/cgroup" --cgroups_limit_swap="false"
--cgroups_root="mesos" --container_disk_watch_interval="15secs" --containerizers="mesos" --credential="/tmp/Endpoint_SlaveEndpointTest_AuthorizedRequest_1_xBPJca/credential"
--default_role="*" --disk_watch_interval="1mins" --docker="docker" --docker_kill_orphans="true"
--docker_registry="https://registry-1.docker.io" --docker_remove_delay="6hrs" --docker_socket="/var/run/docker.sock"
--docker_stop_timeout="0ns" --docker_store_dir="/tmp/mesos/store/docker" --docker_volume_checkpoint_dir="/var/run/mesos/isolators/docker/volume"
--enforce_container_disk_quota="false" --executor_registration_timeout="1mins" --executor_shutdown_grace_period="5secs"
--fetcher_cache_dir="/tmp/Endpoint_SlaveEndpointTest_AuthorizedRequest_1_xBPJca/fetch" --fetcher_cache_size="2GB"
--frameworks_home="" --gc_delay="1weeks" --gc_disk_headroom="0.1" --hadoop_home="" --help="false"
--hostname_lookup="true" --http_authenticators="basic" --http_command_executor="false" --http_credentials="/tmp/Endpoint_SlaveEndpointTest_AuthorizedRequest_1_xBPJca/http_credentials"
--http_heartbeat_interval="30secs" --image_provisioner_backend="copy" --initialize_driver_logging="true"
--isolation="posix/cpu,posix/mem" --launcher="posix" --launcher_dir="/mesos/build/src" --logbufsecs="0"
--logging_level="INFO" --max_completed_executors_per_framework="150" --oversubscribed_resources_interval="15secs"
--perf_duration="10secs" --perf_interval="1mins" --qos_correction_interval_min="0ns" --quiet="false"
--recover="reconnect" --recovery_timeout="15mins" --registration_backoff_factor="10ms" --resources="cpus:2;gpus:0;mem:1024;disk:1024;ports:[31000-32000]"
--revocable_cpu_low_priority="true" --runtime_dir="/tmp/Endpoint_SlaveEndpointTest_AuthorizedRequest_1_xBPJca"
--sandbox_directory="/mnt/mesos/sandbox" --strict="true" --switch_user="true" --systemd_enable_support="true"
--systemd_runtime_directory="/run/systemd/system" --version="false" --work_dir="/tmp/Endpoint_SlaveEndpointTest_AuthorizedRequest_1_0FlDy3"
I0110 06:21:55.648205 27085 credentials.hpp:86] Loading credential for authentication from
'/tmp/Endpoint_SlaveEndpointTest_AuthorizedRequest_1_xBPJca/credential'
I0110 06:21:55.648294 27085 slave.cpp:352] Agent using credential for: test-principal
I0110 06:21:55.648308 27085 credentials.hpp:37] Loading credentials for authentication from
'/tmp/Endpoint_SlaveEndpointTest_AuthorizedRequest_1_xBPJca/http_credentials'
I0110 06:21:55.648422 27085 http.cpp:922] Using default 'basic' HTTP authenticator for realm
'mesos-agent-readonly'
I0110 06:21:55.648504 27085 http.cpp:922] Using default 'basic' HTTP authenticator for realm
'mesos-agent-readwrite'
I0110 06:21:55.648861 27085 slave.cpp:539] Agent resources: cpus(*):2; mem(*):1024; disk(*):1024;
ports(*):[31000-32000]
I0110 06:21:55.648895 27085 slave.cpp:547] Agent attributes: [  ]
I0110 06:21:55.648905 27085 slave.cpp:552] Agent hostname: 313c7f34b260
I0110 06:21:55.649333 27072 state.cpp:60] Recovering state from '/tmp/Endpoint_SlaveEndpointTest_AuthorizedRequest_1_0FlDy3/meta'
I0110 06:21:55.649482 27076 status_update_manager.cpp:203] Recovering status update manager
I0110 06:21:55.649597 27079 containerizer.cpp:599] Recovering containerizer
I0110 06:21:55.650143 27080 provisioner.cpp:251] Provisioner recovery complete
I0110 06:21:55.650341 27081 slave.cpp:5421] Finished recovery
I0110 06:21:55.650748 27081 slave.cpp:5595] Querying resource estimator for oversubscribable
resources
I0110 06:21:55.650919 27079 slave.cpp:5609] Received oversubscribable resources {} from the
resource estimator
I0110 06:21:55.651607 27076 process.cpp:3676] Handling HTTP event for process 'slave(678)'
with path: '/slave(678)/monitor/statistics.json'
I0110 06:21:55.651995 27079 http.cpp:874] Authorizing principal 'test-principal' to GET the
'/monitor/statistics.json' endpoint
I0110 06:21:55.653458 27073 slave.cpp:796] Agent terminating
[       OK ] Endpoint/SlaveEndpointTest.AuthorizedRequest/1 (12 ms)
[ RUN      ] Endpoint/SlaveEndpointTest.AuthorizedRequest/2
I0110 06:21:55.657548 27069 containerizer.cpp:220] Using isolation: posix/cpu,posix/mem,filesystem/posix,network/cni
W0110 06:21:55.657855 27069 backend.cpp:76] Failed to create 'aufs' backend: AufsBackend requires
root privileges, but is running as user mesos
W0110 06:21:55.657944 27069 backend.cpp:76] Failed to create 'bind' backend: BindBackend requires
root privileges
I0110 06:21:55.658941 27078 slave.cpp:209] Mesos agent started on (679)@172.17.0.3:36595
I0110 06:21:55.658958 27078 slave.cpp:210] Flags at startup: --acls="" --appc_simple_discovery_uri_prefix="http://"
--appc_store_dir="/tmp/mesos/store/appc" --authenticate_http_readonly="true" --authenticate_http_readwrite="true"
--authenticatee="crammd5" --authentication_backoff_factor="1secs" --authorizer="local" --cgroups_cpu_enable_pids_and_tids_count="false"
--cgroups_enable_cfs="false" --cgroups_hierarchy="/sys/fs/cgroup" --cgroups_limit_swap="false"
--cgroups_root="mesos" --container_disk_watch_interval="15secs" --containerizers="mesos" --credential="/tmp/Endpoint_SlaveEndpointTest_AuthorizedRequest_2_vwWLTA/credential"
--default_role="*" --disk_watch_interval="1mins" --docker="docker" --docker_kill_orphans="true"
--docker_registry="https://registry-1.docker.io" --docker_remove_delay="6hrs" --docker_socket="/var/run/docker.sock"
--docker_stop_timeout="0ns" --docker_store_dir="/tmp/mesos/store/docker" --docker_volume_checkpoint_dir="/var/run/mesos/isolators/docker/volume"
--enforce_container_disk_quota="false" --executor_registration_timeout="1mins" --executor_shutdown_grace_period="5secs"
--fetcher_cache_dir="/tmp/Endpoint_SlaveEndpointTest_AuthorizedRequest_2_vwWLTA/fetch" --fetcher_cache_size="2GB"
--frameworks_home="" --gc_delay="1weeks" --gc_disk_headroom="0.1" --hadoop_home="" --help="false"
--hostname_lookup="true" --http_authenticators="basic" --http_command_executor="false" --http_credentials="/tmp/Endpoint_SlaveEndpointTest_AuthorizedRequest_2_vwWLTA/http_credentials"
--http_heartbeat_interval="30secs" --image_provisioner_backend="copy" --initialize_driver_logging="true"
--isolation="posix/cpu,posix/mem" --launcher="posix" --launcher_dir="/mesos/build/src" --logbufsecs="0"
--logging_level="INFO" --max_completed_executors_per_framework="150" --oversubscribed_resources_interval="15secs"
--perf_duration="10secs" --perf_interval="1mins" --qos_correction_interval_min="0ns" --quiet="false"
--recover="reconnect" --recovery_timeout="15mins" --registration_backoff_factor="10ms" --resources="cpus:2;gpus:0;mem:1024;disk:1024;ports:[31000-32000]"
--revocable_cpu_low_priority="true" --runtime_dir="/tmp/Endpoint_SlaveEndpointTest_AuthorizedRequest_2_vwWLTA"
--sandbox_directory="/mnt/mesos/sandbox" --strict="true" --switch_user="true" --systemd_enable_support="true"
--systemd_runtime_directory="/run/systemd/system" --version="false" --work_dir="/tmp/Endpoint_SlaveEndpointTest_AuthorizedRequest_2_k1NJdu"
I0110 06:21:55.659420 27078 credentials.hpp:86] Loading credential for authentication from
'/tmp/Endpoint_SlaveEndpointTest_AuthorizedRequest_2_vwWLTA/credential'
I0110 06:21:55.659508 27078 slave.cpp:352] Agent using credential for: test-principal
I0110 06:21:55.659538 27078 credentials.hpp:37] Loading credentials for authentication from
'/tmp/Endpoint_SlaveEndpointTest_AuthorizedRequest_2_vwWLTA/http_credentials'
I0110 06:21:55.659643 27078 http.cpp:922] Using default 'basic' HTTP authenticator for realm
'mesos-agent-readonly'
I0110 06:21:55.659683 27078 http.cpp:922] Using default 'basic' HTTP authenticator for realm
'mesos-agent-readwrite'
I0110 06:21:55.659996 27078 slave.cpp:539] Agent resources: cpus(*):2; mem(*):1024; disk(*):1024;
ports(*):[31000-32000]
I0110 06:21:55.660027 27078 slave.cpp:547] Agent attributes: [  ]
I0110 06:21:55.660034 27078 slave.cpp:552] Agent hostname: 313c7f34b260
I0110 06:21:55.660342 27078 state.cpp:60] Recovering state from '/tmp/Endpoint_SlaveEndpointTest_AuthorizedRequest_2_k1NJdu/meta'
I0110 06:21:55.660487 27079 status_update_manager.cpp:203] Recovering status update manager
I0110 06:21:55.660601 27080 containerizer.cpp:599] Recovering containerizer
I0110 06:21:55.661092 27071 provisioner.cpp:251] Provisioner recovery complete
I0110 06:21:55.661305 27078 slave.cpp:5421] Finished recovery
I0110 06:21:55.661620 27078 slave.cpp:5595] Querying resource estimator for oversubscribable
resources
I0110 06:21:55.661737 27085 slave.cpp:5609] Received oversubscribable resources {} from the
resource estimator
I0110 06:21:55.662403 27070 process.cpp:3676] Handling HTTP event for process 'slave(679)'
with path: '/slave(679)/containers'
I0110 06:21:55.662885 27073 http.cpp:874] Authorizing principal 'test-principal' to GET the
'/containers' endpoint
I0110 06:21:55.664144 27069 slave.cpp:796] Agent terminating
[       OK ] Endpoint/SlaveEndpointTest.AuthorizedRequest/2 (11 ms)
[ RUN      ] Endpoint/SlaveEndpointTest.UnauthorizedRequest/0
I0110 06:21:55.668710 27069 containerizer.cpp:220] Using isolation: posix/cpu,posix/mem,filesystem/posix,network/cni
W0110 06:21:55.668997 27069 backend.cpp:76] Failed to create 'aufs' backend: AufsBackend requires
root privileges, but is running as user mesos
W0110 06:21:55.669062 27069 backend.cpp:76] Failed to create 'bind' backend: BindBackend requires
root privileges
I0110 06:21:55.669924 27077 slave.cpp:209] Mesos agent started on (680)@172.17.0.3:36595
I0110 06:21:55.670063 27077 slave.cpp:210] Flags at startup: --acls="" --appc_simple_discovery_uri_prefix="http://"
--appc_store_dir="/tmp/mesos/store/appc" --authenticate_http_readonly="true" --authenticate_http_readwrite="true"
--authenticatee="crammd5" --authentication_backoff_factor="1secs" --authorizer="local" --cgroups_cpu_enable_pids_and_tids_count="false"
--cgroups_enable_cfs="false" --cgroups_hierarchy="/sys/fs/cgroup" --cgroups_limit_swap="false"
--cgroups_root="mesos" --container_disk_watch_interval="15secs" --containerizers="mesos" --credential="/tmp/Endpoint_SlaveEndpointTest_UnauthorizedRequest_0_ZJoXH1/credential"
--default_role="*" --disk_watch_interval="1mins" --docker="docker" --docker_kill_orphans="true"
--docker_registry="https://registry-1.docker.io" --docker_remove_delay="6hrs" --docker_socket="/var/run/docker.sock"
--docker_stop_timeout="0ns" --docker_store_dir="/tmp/mesos/store/docker" --docker_volume_checkpoint_dir="/var/run/mesos/isolators/docker/volume"
--enforce_container_disk_quota="false" --executor_registration_timeout="1mins" --executor_shutdown_grace_period="5secs"
--fetcher_cache_dir="/tmp/Endpoint_SlaveEndpointTest_UnauthorizedRequest_0_ZJoXH1/fetch" --fetcher_cache_size="2GB"
--frameworks_home="" --gc_delay="1weeks" --gc_disk_headroom="0.1" --hadoop_home="" --help="false"
--hostname_lookup="true" --http_authenticators="basic" --http_command_executor="false" --http_credentials="/tmp/Endpoint_SlaveEndpointTest_UnauthorizedRequest_0_ZJoXH1/http_credentials"
--http_heartbeat_interval="30secs" --image_provisioner_backend="copy" --initialize_driver_logging="true"
--isolation="posix/cpu,posix/mem" --launcher="posix" --launcher_dir="/mesos/build/src" --logbufsecs="0"
--logging_level="INFO" --max_completed_executors_per_framework="150" --oversubscribed_resources_interval="15secs"
--perf_duration="10secs" --perf_interval="1mins" --qos_correction_interval_min="0ns" --quiet="false"
--recover="reconnect" --recovery_timeout="15mins" --registration_backoff_factor="10ms" --resources="cpus:2;gpus:0;mem:1024;disk:1024;ports:[31000-32000]"
--revocable_cpu_low_priority="true" --runtime_dir="/tmp/Endpoint_SlaveEndpointTest_UnauthorizedRequest_0_ZJoXH1"
--sandbox_directory="/mnt/mesos/sandbox" --strict="true" --switch_user="true" --systemd_enable_support="true"
--systemd_runtime_directory="/run/systemd/system" --version="false" --work_dir="/tmp/Endpoint_SlaveEndpointTest_UnauthorizedRequest_0_0mW7ZU"
I0110 06:21:55.670308 27077 credentials.hpp:86] Loading credential for authentication from
'/tmp/Endpoint_SlaveEndpointTest_UnauthorizedRequest_0_ZJoXH1/credential'
I0110 06:21:55.670389 27077 slave.cpp:352] Agent using credential for: test-principal
I0110 06:21:55.670402 27077 credentials.hpp:37] Loading credentials for authentication from
'/tmp/Endpoint_SlaveEndpointTest_UnauthorizedRequest_0_ZJoXH1/http_credentials'
I0110 06:21:55.670483 27077 http.cpp:922] Using default 'basic' HTTP authenticator for realm
'mesos-agent-readonly'
I0110 06:21:55.670524 27077 http.cpp:922] Using default 'basic' HTTP authenticator for realm
'mesos-agent-readwrite'
I0110 06:21:55.670851 27077 slave.cpp:539] Agent resources: cpus(*):2; mem(*):1024; disk(*):1024;
ports(*):[31000-32000]
I0110 06:21:55.670883 27077 slave.cpp:547] Agent attributes: [  ]
I0110 06:21:55.670892 27077 slave.cpp:552] Agent hostname: 313c7f34b260
I0110 06:21:55.671257 27084 state.cpp:60] Recovering state from '/tmp/Endpoint_SlaveEndpointTest_UnauthorizedRequest_0_0mW7ZU/meta'
I0110 06:21:55.671393 27074 status_update_manager.cpp:203] Recovering status update manager
I0110 06:21:55.671543 27076 containerizer.cpp:599] Recovering containerizer
I0110 06:21:55.672016 27071 provisioner.cpp:251] Provisioner recovery complete
I0110 06:21:55.672188 27073 slave.cpp:5421] Finished recovery
I0110 06:21:55.672535 27073 slave.cpp:5595] Querying resource estimator for oversubscribable
resources
I0110 06:21:55.672624 27071 slave.cpp:5609] Received oversubscribable resources {} from the
resource estimator
I0110 06:21:55.673272 27073 process.cpp:3676] Handling HTTP event for process 'slave(680)'
with path: '/slave(680)/monitor/statistics'
I0110 06:21:55.673669 27075 http.cpp:874] Authorizing principal 'test-principal' to GET the
'/monitor/statistics' endpoint
I0110 06:21:55.674525 27080 slave.cpp:796] Agent terminating
[       OK ] Endpoint/SlaveEndpointTest.UnauthorizedRequest/0 (10 ms)
[ RUN      ] Endpoint/SlaveEndpointTest.UnauthorizedRequest/1
I0110 06:21:55.678916 27069 containerizer.cpp:220] Using isolation: posix/cpu,posix/mem,filesystem/posix,network/cni
W0110 06:21:55.679198 27069 backend.cpp:76] Failed to create 'aufs' backend: AufsBackend requires
root privileges, but is running as user mesos
W0110 06:21:55.679303 27069 backend.cpp:76] Failed to create 'bind' backend: BindBackend requires
root privileges
I0110 06:21:55.680193 27079 slave.cpp:209] Mesos agent started on (681)@172.17.0.3:36595
I0110 06:21:55.680207 27079 slave.cpp:210] Flags at startup: --acls="" --appc_simple_discovery_uri_prefix="http://"
--appc_store_dir="/tmp/mesos/store/appc" --authenticate_http_readonly="true" --authenticate_http_readwrite="true"
--authenticatee="crammd5" --authentication_backoff_factor="1secs" --authorizer="local" --cgroups_cpu_enable_pids_and_tids_count="false"
--cgroups_enable_cfs="false" --cgroups_hierarchy="/sys/fs/cgroup" --cgroups_limit_swap="false"
--cgroups_root="mesos" --container_disk_watch_interval="15secs" --containerizers="mesos" --credential="/tmp/Endpoint_SlaveEndpointTest_UnauthorizedRequest_1_zyNUCs/credential"
--default_role="*" --disk_watch_interval="1mins" --docker="docker" --docker_kill_orphans="true"
--docker_registry="https://registry-1.docker.io" --docker_remove_delay="6hrs" --docker_socket="/var/run/docker.sock"
--docker_stop_timeout="0ns" --docker_store_dir="/tmp/mesos/store/docker" --docker_volume_checkpoint_dir="/var/run/mesos/isolators/docker/volume"
--enforce_container_disk_quota="false" --executor_registration_timeout="1mins" --executor_shutdown_grace_period="5secs"
--fetcher_cache_dir="/tmp/Endpoint_SlaveEndpointTest_UnauthorizedRequest_1_zyNUCs/fetch" --fetcher_cache_size="2GB"
--frameworks_home="" --gc_delay="1weeks" --gc_disk_headroom="0.1" --hadoop_home="" --help="false"
--hostname_lookup="true" --http_authenticators="basic" --http_command_executor="false" --http_credentials="/tmp/Endpoint_SlaveEndpointTest_UnauthorizedRequest_1_zyNUCs/http_credentials"
--http_heartbeat_interval="30secs" --image_provisioner_backend="copy" --initialize_driver_logging="true"
--isolation="posix/cpu,posix/mem" --launcher="posix" --launcher_dir="/mesos/build/src" --logbufsecs="0"
--logging_level="INFO" --max_completed_executors_per_framework="150" --oversubscribed_resources_interval="15secs"
--perf_duration="10secs" --perf_interval="1mins" --qos_correction_interval_min="0ns" --quiet="false"
--recover="reconnect" --recovery_timeout="15mins" --registration_backoff_factor="10ms" --resources="cpus:2;gpus:0;mem:1024;disk:1024;ports:[31000-32000]"
--revocable_cpu_low_priority="true" --runtime_dir="/tmp/Endpoint_SlaveEndpointTest_UnauthorizedRequest_1_zyNUCs"
--sandbox_directory="/mnt/mesos/sandbox" --strict="true" --switch_user="true" --systemd_enable_support="true"
--systemd_runtime_directory="/run/systemd/system" --version="false" --work_dir="/tmp/Endpoint_SlaveEndpointTest_UnauthorizedRequest_1_sbTpTl"
I0110 06:21:55.680529 27079 credentials.hpp:86] Loading credential for authentication from
'/tmp/Endpoint_SlaveEndpointTest_UnauthorizedRequest_1_zyNUCs/credential'
I0110 06:21:55.680636 27079 slave.cpp:352] Agent using credential for: test-principal
I0110 06:21:55.680670 27079 credentials.hpp:37] Loading credentials for authentication from
'/tmp/Endpoint_SlaveEndpointTest_UnauthorizedRequest_1_zyNUCs/http_credentials'
I0110 06:21:55.680793 27079 http.cpp:922] Using default 'basic' HTTP authenticator for realm
'mesos-agent-readonly'
I0110 06:21:55.680862 27079 http.cpp:922] Using default 'basic' HTTP authenticator for realm
'mesos-agent-readwrite'
I0110 06:21:55.681362 27079 slave.cpp:539] Agent resources: cpus(*):2; mem(*):1024; disk(*):1024;
ports(*):[31000-32000]
I0110 06:21:55.681396 27079 slave.cpp:547] Agent attributes: [  ]
I0110 06:21:55.681406 27079 slave.cpp:552] Agent hostname: 313c7f34b260
I0110 06:21:55.681790 27072 state.cpp:60] Recovering state from '/tmp/Endpoint_SlaveEndpointTest_UnauthorizedRequest_1_sbTpTl/meta'
I0110 06:21:55.681957 27084 status_update_manager.cpp:203] Recovering status update manager
I0110 06:21:55.682075 27076 containerizer.cpp:599] Recovering containerizer
I0110 06:21:55.682564 27074 provisioner.cpp:251] Provisioner recovery complete
I0110 06:21:55.682932 27083 slave.cpp:5421] Finished recovery
I0110 06:21:55.683401 27083 slave.cpp:5595] Querying resource estimator for oversubscribable
resources
I0110 06:21:55.683584 27076 slave.cpp:5609] Received oversubscribable resources {} from the
resource estimator
I0110 06:21:55.684188 27075 process.cpp:3676] Handling HTTP event for process 'slave(681)'
with path: '/slave(681)/monitor/statistics.json'
I0110 06:21:55.684674 27073 http.cpp:874] Authorizing principal 'test-principal' to GET the
'/monitor/statistics.json' endpoint
I0110 06:21:55.685436 27073 slave.cpp:796] Agent terminating
[       OK ] Endpoint/SlaveEndpointTest.UnauthorizedRequest/1 (10 ms)
[ RUN      ] Endpoint/SlaveEndpointTest.UnauthorizedRequest/2
I0110 06:21:55.689919 27069 containerizer.cpp:220] Using isolation: posix/cpu,posix/mem,filesystem/posix,network/cni
W0110 06:21:55.690227 27069 backend.cpp:76] Failed to create 'aufs' backend: AufsBackend requires
root privileges, but is running as user mesos
W0110 06:21:55.690315 27069 backend.cpp:76] Failed to create 'bind' backend: BindBackend requires
root privileges
I0110 06:21:55.691231 27083 slave.cpp:209] Mesos agent started on (682)@172.17.0.3:36595
I0110 06:21:55.691251 27083 slave.cpp:210] Flags at startup: --acls="" --appc_simple_discovery_uri_prefix="http://"
--appc_store_dir="/tmp/mesos/store/appc" --authenticate_http_readonly="true" --authenticate_http_readwrite="true"
--authenticatee="crammd5" --authentication_backoff_factor="1secs" --authorizer="local" --cgroups_cpu_enable_pids_and_tids_count="false"
--cgroups_enable_cfs="false" --cgroups_hierarchy="/sys/fs/cgroup" --cgroups_limit_swap="false"
--cgroups_root="mesos" --container_disk_watch_interval="15secs" --containerizers="mesos" --credential="/tmp/Endpoint_SlaveEndpointTest_UnauthorizedRequest_2_9Oq0ET/credential"
--default_role="*" --disk_watch_interval="1mins" --docker="docker" --docker_kill_orphans="true"
--docker_registry="https://registry-1.docker.io" --docker_remove_delay="6hrs" --docker_socket="/var/run/docker.sock"
--docker_stop_timeout="0ns" --docker_store_dir="/tmp/mesos/store/docker" --docker_volume_checkpoint_dir="/var/run/mesos/isolators/docker/volume"
--enforce_container_disk_quota="false" --executor_registration_timeout="1mins" --executor_shutdown_grace_period="5secs"
--fetcher_cache_dir="/tmp/Endpoint_SlaveEndpointTest_UnauthorizedRequest_2_9Oq0ET/fetch" --fetcher_cache_size="2GB"
--frameworks_home="" --gc_delay="1weeks" --gc_disk_headroom="0.1" --hadoop_home="" --help="false"
--hostname_lookup="true" --http_authenticators="basic" --http_command_executor="false" --http_credentials="/tmp/Endpoint_SlaveEndpointTest_UnauthorizedRequest_2_9Oq0ET/http_credentials"
--http_heartbeat_interval="30secs" --image_provisioner_backend="copy" --initialize_driver_logging="true"
--isolation="posix/cpu,posix/mem" --launcher="posix" --launcher_dir="/mesos/build/src" --logbufsecs="0"
--logging_level="INFO" --max_completed_executors_per_framework="150" --oversubscribed_resources_interval="15secs"
--perf_duration="10secs" --perf_interval="1mins" --qos_correction_interval_min="0ns" --quiet="false"
--recover="reconnect" --recovery_timeout="15mins" --registration_backoff_factor="10ms" --resources="cpus:2;gpus:0;mem:1024;disk:1024;ports:[31000-32000]"
--revocable_cpu_low_priority="true" --runtime_dir="/tmp/Endpoint_SlaveEndpointTest_UnauthorizedRequest_2_9Oq0ET"
--sandbox_directory="/mnt/mesos/sandbox" --strict="true" --switch_user="true" --systemd_enable_support="true"
--systemd_runtime_directory="/run/systemd/system" --version="false" --work_dir="/tmp/Endpoint_SlaveEndpointTest_UnauthorizedRequest_2_SEuITM"
I0110 06:21:55.691712 27083 credentials.hpp:86] Loading credential for authentication from
'/tmp/Endpoint_SlaveEndpointTest_UnauthorizedRequest_2_9Oq0ET/credential'
I0110 06:21:55.691823 27083 slave.cpp:352] Agent using credential for: test-principal
I0110 06:21:55.691836 27083 credentials.hpp:37] Loading credentials for authentication from
'/tmp/Endpoint_SlaveEndpointTest_UnauthorizedRequest_2_9Oq0ET/http_credentials'
I0110 06:21:55.691921 27083 http.cpp:922] Using default 'basic' HTTP authenticator for realm
'mesos-agent-readonly'
I0110 06:21:55.691979 27083 http.cpp:922] Using default 'basic' HTTP authenticator for realm
'mesos-agent-readwrite'
I0110 06:21:55.692335 27083 slave.cpp:539] Agent resources: cpus(*):2; mem(*):1024; disk(*):1024;
ports(*):[31000-32000]
I0110 06:21:55.692369 27083 slave.cpp:547] Agent attributes: [  ]
I0110 06:21:55.692378 27083 slave.cpp:552] Agent hostname: 313c7f34b260
I0110 06:21:55.692759 27083 state.cpp:60] Recovering state from '/tmp/Endpoint_SlaveEndpointTest_UnauthorizedRequest_2_SEuITM/meta'
I0110 06:21:55.692925 27078 status_update_manager.cpp:203] Recovering status update manager
I0110 06:21:55.692994 27078 containerizer.cpp:599] Recovering containerizer
I0110 06:21:55.693606 27074 provisioner.cpp:251] Provisioner recovery complete
I0110 06:21:55.693801 27083 slave.cpp:5421] Finished recovery
I0110 06:21:55.694193 27083 slave.cpp:5595] Querying resource estimator for oversubscribable
resources
I0110 06:21:55.694317 27084 slave.cpp:5609] Received oversubscribable resources {} from the
resource estimator
I0110 06:21:55.694946 27076 process.cpp:3676] Handling HTTP event for process 'slave(682)'
with path: '/slave(682)/containers'
I0110 06:21:55.695394 27082 http.cpp:874] Authorizing principal 'test-principal' to GET the
'/containers' endpoint
I0110 06:21:55.696249 27084 slave.cpp:796] Agent terminating
[       OK ] Endpoint/SlaveEndpointTest.UnauthorizedRequest/2 (10 ms)
[ RUN      ] Endpoint/SlaveEndpointTest.NoAuthorizer/0
I0110 06:21:55.700852 27069 containerizer.cpp:220] Using isolation: posix/cpu,posix/mem,filesystem/posix,network/cni
W0110 06:21:55.701159 27069 backend.cpp:76] Failed to create 'aufs' backend: AufsBackend requires
root privileges, but is running as user mesos
W0110 06:21:55.701297 27069 backend.cpp:76] Failed to create 'bind' backend: BindBackend requires
root privileges
I0110 06:21:55.701886 27069 cluster.cpp:446] Creating default 'local' authorizer
I0110 06:21:55.702397 27080 slave.cpp:209] Mesos agent started on (683)@172.17.0.3:36595
I0110 06:21:55.702416 27080 slave.cpp:210] Flags at startup: --acls="" --appc_simple_discovery_uri_prefix="http://"
--appc_store_dir="/tmp/mesos/store/appc" --authenticate_http_readonly="true" --authenticate_http_readwrite="true"
--authenticatee="crammd5" --authentication_backoff_factor="1secs" --authorizer="local" --cgroups_cpu_enable_pids_and_tids_count="false"
--cgroups_enable_cfs="false" --cgroups_hierarchy="/sys/fs/cgroup" --cgroups_limit_swap="false"
--cgroups_root="mesos" --container_disk_watch_interval="15secs" --containerizers="mesos" --credential="/tmp/Endpoint_SlaveEndpointTest_NoAuthorizer_0_VgF8Nk/credential"
--default_role="*" --disk_watch_interval="1mins" --docker="docker" --docker_kill_orphans="true"
--docker_registry="https://registry-1.docker.io" --docker_remove_delay="6hrs" --docker_socket="/var/run/docker.sock"
--docker_stop_timeout="0ns" --docker_store_dir="/tmp/mesos/store/docker" --docker_volume_checkpoint_dir="/var/run/mesos/isolators/docker/volume"
--enforce_container_disk_quota="false" --executor_registration_timeout="1mins" --executor_shutdown_grace_period="5secs"
--fetcher_cache_dir="/tmp/Endpoint_SlaveEndpointTest_NoAuthorizer_0_VgF8Nk/fetch" --fetcher_cache_size="2GB"
--frameworks_home="" --gc_delay="1weeks" --gc_disk_headroom="0.1" --hadoop_home="" --help="false"
--hostname_lookup="true" --http_authenticators="basic" --http_command_executor="false" --http_credentials="/tmp/Endpoint_SlaveEndpointTest_NoAuthorizer_0_VgF8Nk/http_credentials"
--http_heartbeat_interval="30secs" --image_provisioner_backend="copy" --initialize_driver_logging="true"
--isolation="posix/cpu,posix/mem" --launcher="posix" --launcher_dir="/mesos/build/src" --logbufsecs="0"
--logging_level="INFO" --max_completed_executors_per_framework="150" --oversubscribed_resources_interval="15secs"
--perf_duration="10secs" --perf_interval="1mins" --qos_correction_interval_min="0ns" --quiet="false"
--recover="reconnect" --recovery_timeout="15mins" --registration_backoff_factor="10ms" --resources="cpus:2;gpus:0;mem:1024;disk:1024;ports:[31000-32000]"
--revocable_cpu_low_priority="true" --runtime_dir="/tmp/Endpoint_SlaveEndpointTest_NoAuthorizer_0_VgF8Nk"
--sandbox_directory="/mnt/mesos/sandbox" --strict="true" --switch_user="true" --systemd_enable_support="true"
--systemd_runtime_directory="/run/systemd/system" --version="false" --work_dir="/tmp/Endpoint_SlaveEndpointTest_NoAuthorizer_0_0KH50d"
I0110 06:21:55.702841 27080 credentials.hpp:86] Loading credential for authentication from
'/tmp/Endpoint_SlaveEndpointTest_NoAuthorizer_0_VgF8Nk/credential'
I0110 06:21:55.702924 27080 slave.cpp:352] Agent using credential for: test-principal
I0110 06:21:55.702935 27080 credentials.hpp:37] Loading credentials for authentication from
'/tmp/Endpoint_SlaveEndpointTest_NoAuthorizer_0_VgF8Nk/http_credentials'
I0110 06:21:55.703030 27080 http.cpp:922] Using default 'basic' HTTP authenticator for realm
'mesos-agent-readonly'
I0110 06:21:55.703124 27080 http.cpp:922] Using default 'basic' HTTP authenticator for realm
'mesos-agent-readwrite'
I0110 06:21:55.703558 27080 slave.cpp:539] Agent resources: cpus(*):2; mem(*):1024; disk(*):1024;
ports(*):[31000-32000]
I0110 06:21:55.703594 27080 slave.cpp:547] Agent attributes: [  ]
I0110 06:21:55.703603 27080 slave.cpp:552] Agent hostname: 313c7f34b260
I0110 06:21:55.704022 27078 state.cpp:60] Recovering state from '/tmp/Endpoint_SlaveEndpointTest_NoAuthorizer_0_0KH50d/meta'
I0110 06:21:55.704241 27084 status_update_manager.cpp:203] Recovering status update manager
I0110 06:21:55.704349 27074 containerizer.cpp:599] Recovering containerizer
I0110 06:21:55.704895 27077 provisioner.cpp:251] Provisioner recovery complete
I0110 06:21:55.705066 27083 slave.cpp:5421] Finished recovery
I0110 06:21:55.705404 27083 slave.cpp:5595] Querying resource estimator for oversubscribable
resources
I0110 06:21:55.705526 27074 slave.cpp:5609] Received oversubscribable resources {} from the
resource estimator
I0110 06:21:55.706137 27083 process.cpp:3676] Handling HTTP event for process 'slave(683)'
with path: '/slave(683)/monitor/statistics'
I0110 06:21:55.706516 27078 http.cpp:874] Authorizing principal 'test-principal' to GET the
'/monitor/statistics' endpoint
I0110 06:21:55.707706 27080 slave.cpp:796] Agent terminating
[       OK ] Endpoint/SlaveEndpointTest.NoAuthorizer/0 (12 ms)
[ RUN      ] Endpoint/SlaveEndpointTest.NoAuthorizer/1
I0110 06:21:55.712795 27069 containerizer.cpp:220] Using isolation: posix/cpu,posix/mem,filesystem/posix,network/cni
W0110 06:21:55.713088 27069 backend.cpp:76] Failed to create 'aufs' backend: AufsBackend requires
root privileges, but is running as user mesos
W0110 06:21:55.713176 27069 backend.cpp:76] Failed to create 'bind' backend: BindBackend requires
root privileges
I0110 06:21:55.713868 27069 cluster.cpp:446] Creating default 'local' authorizer
I0110 06:21:55.714402 27074 slave.cpp:209] Mesos agent started on (684)@172.17.0.3:36595
I0110 06:21:55.714418 27074 slave.cpp:210] Flags at startup: --acls="" --appc_simple_discovery_uri_prefix="http://"
--appc_store_dir="/tmp/mesos/store/appc" --authenticate_http_readonly="true" --authenticate_http_readwrite="true"
--authenticatee="crammd5" --authentication_backoff_factor="1secs" --authorizer="local" --cgroups_cpu_enable_pids_and_tids_count="false"
--cgroups_enable_cfs="false" --cgroups_hierarchy="/sys/fs/cgroup" --cgroups_limit_swap="false"
--cgroups_root="mesos" --container_disk_watch_interval="15secs" --containerizers="mesos" --credential="/tmp/Endpoint_SlaveEndpointTest_NoAuthorizer_1_9pbU4L/credential"
--default_role="*" --disk_watch_interval="1mins" --docker="docker" --docker_kill_orphans="true"
--docker_registry="https://registry-1.docker.io" --docker_remove_delay="6hrs" --docker_socket="/var/run/docker.sock"
--docker_stop_timeout="0ns" --docker_store_dir="/tmp/mesos/store/docker" --docker_volume_checkpoint_dir="/var/run/mesos/isolators/docker/volume"
--enforce_container_disk_quota="false" --executor_registration_timeout="1mins" --executor_shutdown_grace_period="5secs"
--fetcher_cache_dir="/tmp/Endpoint_SlaveEndpointTest_NoAuthorizer_1_9pbU4L/fetch" --fetcher_cache_size="2GB"
--frameworks_home="" --gc_delay="1weeks" --gc_disk_headroom="0.1" --hadoop_home="" --help="false"
--hostname_lookup="true" --http_authenticators="basic" --http_command_executor="false" --http_credentials="/tmp/Endpoint_SlaveEndpointTest_NoAuthorizer_1_9pbU4L/http_credentials"
--http_heartbeat_interval="30secs" --image_provisioner_backend="copy" --initialize_driver_logging="true"
--isolation="posix/cpu,posix/mem" --launcher="posix" --launcher_dir="/mesos/build/src" --logbufsecs="0"
--logging_level="INFO" --max_completed_executors_per_framework="150" --oversubscribed_resources_interval="15secs"
--perf_duration="10secs" --perf_interval="1mins" --qos_correction_interval_min="0ns" --quiet="false"
--recover="reconnect" --recovery_timeout="15mins" --registration_backoff_factor="10ms" --resources="cpus:2;gpus:0;mem:1024;disk:1024;ports:[31000-32000]"
--revocable_cpu_low_priority="true" --runtime_dir="/tmp/Endpoint_SlaveEndpointTest_NoAuthorizer_1_9pbU4L"
--sandbox_directory="/mnt/mesos/sandbox" --strict="true" --switch_user="true" --systemd_enable_support="true"
--systemd_runtime_directory="/run/systemd/system" --version="false" --work_dir="/tmp/Endpoint_SlaveEndpointTest_NoAuthorizer_1_Yr0UfF"
I0110 06:21:55.714772 27074 credentials.hpp:86] Loading credential for authentication from
'/tmp/Endpoint_SlaveEndpointTest_NoAuthorizer_1_9pbU4L/credential'
I0110 06:21:55.714862 27074 slave.cpp:352] Agent using credential for: test-principal
I0110 06:21:55.714874 27074 credentials.hpp:37] Loading credentials for authentication from
'/tmp/Endpoint_SlaveEndpointTest_NoAuthorizer_1_9pbU4L/http_credentials'
I0110 06:21:55.714957 27074 http.cpp:922] Using default 'basic' HTTP authenticator for realm
'mesos-agent-readonly'
I0110 06:21:55.714996 27074 http.cpp:922] Using default 'basic' HTTP authenticator for realm
'mesos-agent-readwrite'
I0110 06:21:55.715414 27074 slave.cpp:539] Agent resources: cpus(*):2; mem(*):1024; disk(*):1024;
ports(*):[31000-32000]
I0110 06:21:55.715448 27074 slave.cpp:547] Agent attributes: [  ]
I0110 06:21:55.715456 27074 slave.cpp:552] Agent hostname: 313c7f34b260
I0110 06:21:55.715878 27085 state.cpp:60] Recovering state from '/tmp/Endpoint_SlaveEndpointTest_NoAuthorizer_1_Yr0UfF/meta'
I0110 06:21:55.716003 27081 status_update_manager.cpp:203] Recovering status update manager
I0110 06:21:55.716104 27083 containerizer.cpp:599] Recovering containerizer
I0110 06:21:55.716642 27081 provisioner.cpp:251] Provisioner recovery complete
I0110 06:21:55.716816 27083 slave.cpp:5421] Finished recovery
I0110 06:21:55.717162 27083 slave.cpp:5595] Querying resource estimator for oversubscribable
resources
I0110 06:21:55.717452 27080 slave.cpp:5609] Received oversubscribable resources {} from the
resource estimator
I0110 06:21:55.718080 27083 process.cpp:3676] Handling HTTP event for process 'slave(684)'
with path: '/slave(684)/monitor/statistics.json'
I0110 06:21:55.718474 27080 http.cpp:874] Authorizing principal 'test-principal' to GET the
'/monitor/statistics.json' endpoint
I0110 06:21:55.719722 27075 slave.cpp:796] Agent terminating
[       OK ] Endpoint/SlaveEndpointTest.NoAuthorizer/1 (11 ms)
[ RUN      ] Endpoint/SlaveEndpointTest.NoAuthorizer/2
I0110 06:21:55.724087 27069 containerizer.cpp:220] Using isolation: posix/cpu,posix/mem,filesystem/posix,network/cni
W0110 06:21:55.724391 27069 backend.cpp:76] Failed to create 'aufs' backend: AufsBackend requires
root privileges, but is running as user mesos
W0110 06:21:55.724472 27069 backend.cpp:76] Failed to create 'bind' backend: BindBackend requires
root privileges
I0110 06:21:55.725049 27069 cluster.cpp:446] Creating default 'local' authorizer
I0110 06:21:55.725623 27081 slave.cpp:209] Mesos agent started on (685)@172.17.0.3:36595
I0110 06:21:55.725639 27081 slave.cpp:210] Flags at startup: --acls="" --appc_simple_discovery_uri_prefix="http://"
--appc_store_dir="/tmp/mesos/store/appc" --authenticate_http_readonly="true" --authenticate_http_readwrite="true"
--authenticatee="crammd5" --authentication_backoff_factor="1secs" --authorizer="local" --cgroups_cpu_enable_pids_and_tids_count="false"
--cgroups_enable_cfs="false" --cgroups_hierarchy="/sys/fs/cgroup" --cgroups_limit_swap="false"
--cgroups_root="mesos" --container_disk_watch_interval="15secs" --containerizers="mesos" --credential="/tmp/Endpoint_SlaveEndpointTest_NoAuthorizer_2_b2q1sd/credential"
--default_role="*" --disk_watch_interval="1mins" --docker="docker" --docker_kill_orphans="true"
--docker_registry="https://registry-1.docker.io" --docker_remove_delay="6hrs" --docker_socket="/var/run/docker.sock"
--docker_stop_timeout="0ns" --docker_store_dir="/tmp/mesos/store/docker" --docker_volume_checkpoint_dir="/var/run/mesos/isolators/docker/volume"
--enforce_container_disk_quota="false" --executor_registration_timeout="1mins" --executor_shutdown_grace_period="5secs"
--fetcher_cache_dir="/tmp/Endpoint_SlaveEndpointTest_NoAuthorizer_2_b2q1sd/fetch" --fetcher_cache_size="2GB"
--frameworks_home="" --gc_delay="1weeks" --gc_disk_headroom="0.1" --hadoop_home="" --help="false"
--hostname_lookup="true" --http_authenticators="basic" --http_command_executor="false" --http_credentials="/tmp/Endpoint_SlaveEndpointTest_NoAuthorizer_2_b2q1sd/http_credentials"
--http_heartbeat_interval="30secs" --image_provisioner_backend="copy" --initialize_driver_logging="true"
--isolation="posix/cpu,posix/mem" --launcher="posix" --launcher_dir="/mesos/build/src" --logbufsecs="0"
--logging_level="INFO" --max_completed_executors_per_framework="150" --oversubscribed_resources_interval="15secs"
--perf_duration="10secs" --perf_interval="1mins" --qos_correction_interval_min="0ns" --quiet="false"
--recover="reconnect" --recovery_timeout="15mins" --registration_backoff_factor="10ms" --resources="cpus:2;gpus:0;mem:1024;disk:1024;ports:[31000-32000]"
--revocable_cpu_low_priority="true" --runtime_dir="/tmp/Endpoint_SlaveEndpointTest_NoAuthorizer_2_b2q1sd"
--sandbox_directory="/mnt/mesos/sandbox" --strict="true" --switch_user="true" --systemd_enable_support="true"
--systemd_runtime_directory="/run/systemd/system" --version="false" --work_dir="/tmp/Endpoint_SlaveEndpointTest_NoAuthorizer_2_KqEdC6"
I0110 06:21:55.725968 27081 credentials.hpp:86] Loading credential for authentication from
'/tmp/Endpoint_SlaveEndpointTest_NoAuthorizer_2_b2q1sd/credential'
I0110 06:21:55.726055 27081 slave.cpp:352] Agent using credential for: test-principal
I0110 06:21:55.726066 27081 credentials.hpp:37] Loading credentials for authentication from
'/tmp/Endpoint_SlaveEndpointTest_NoAuthorizer_2_b2q1sd/http_credentials'
I0110 06:21:55.726147 27081 http.cpp:922] Using default 'basic' HTTP authenticator for realm
'mesos-agent-readonly'
I0110 06:21:55.726202 27081 http.cpp:922] Using default 'basic' HTTP authenticator for realm
'mesos-agent-readwrite'
I0110 06:21:55.726559 27081 slave.cpp:539] Agent resources: cpus(*):2; mem(*):1024; disk(*):1024;
ports(*):[31000-32000]
I0110 06:21:55.726589 27081 slave.cpp:547] Agent attributes: [  ]
I0110 06:21:55.726594 27081 slave.cpp:552] Agent hostname: 313c7f34b260
I0110 06:21:55.726888 27075 state.cpp:60] Recovering state from '/tmp/Endpoint_SlaveEndpointTest_NoAuthorizer_2_KqEdC6/meta'
I0110 06:21:55.727004 27085 status_update_manager.cpp:203] Recovering status update manager
I0110 06:21:55.727115 27080 containerizer.cpp:599] Recovering containerizer
I0110 06:21:55.727635 27084 provisioner.cpp:251] Provisioner recovery complete
I0110 06:21:55.727804 27072 slave.cpp:5421] Finished recovery
I0110 06:21:55.728200 27072 slave.cpp:5595] Querying resource estimator for oversubscribable
resources
I0110 06:21:55.728318 27076 slave.cpp:5609] Received oversubscribable resources {} from the
resource estimator
I0110 06:21:55.728895 27071 process.cpp:3676] Handling HTTP event for process 'slave(685)'
with path: '/slave(685)/containers'
I0110 06:21:55.729276 27082 http.cpp:874] Authorizing principal 'test-principal' to GET the
'/containers' endpoint
I0110 06:21:55.730432 27078 slave.cpp:796] Agent terminating
[       OK ] Endpoint/SlaveEndpointTest.NoAuthorizer/2 (11 ms)
[----------] 9 tests from Endpoint/SlaveEndpointTest (102 ms total)

[----------] Global test environment tear-down
[==========] 1404 tests from 158 test cases ran. (260803 ms total)
[  PASSED  ] 1401 tests.
[  FAILED  ] 3 tests, listed below:
[  FAILED  ] FaultToleranceTest.FrameworkReregister
[  FAILED  ] SlaveRecoveryTest/0.RegisterDisconnectedSlave, where TypeParam = mesos::internal::slave::MesosContainerizer
[  FAILED  ] ContentType/AgentAPITest.LaunchNestedContainerSession/1, where GetParam() = application/json

 3 FAILED TESTS
  YOU HAVE 9 DISABLED TESTS

make[3]: Leaving directory `/mesos/build'
make[3]: *** [CMakeFiles/check] Error 1
make[2]: *** [CMakeFiles/check.dir/all] Error 2
make[2]: Leaving directory `/mesos/build'
make[1]: *** [CMakeFiles/check.dir/rule] Error 2
make[1]: Leaving directory `/mesos/build'
make: *** [check] Error 2
+ docker rmi mesos-1484026246-17221
Untagged: mesos-1484026246-17221:latest
Deleted: sha256:573a9a3ec1b40c904882659f375a4861924e83ce98f2e6cf9075935a3bd42602
Deleted: sha256:76448db381cc218b7549da7fbbc6b5d7c60e78e6cf9120655d00b259cd945ab2
Deleted: sha256:937eb31af3badc2d4a50220896d5c55703aab310f0d4a2cbdec594d7efcb9867
Deleted: sha256:dc6b508bf7be380a641faa7f7da95959bf587c9d54a13326010a66da036ad78b
Deleted: sha256:dfe0467773d198f29cb8ca7cc635bf99253f9a5a685530a32040768cf4c90d18
Deleted: sha256:29213455285b769ba73c65cbfdf785c5c998f6abf70a38cad5abfe84878b6846
Deleted: sha256:d1fdfc9019010cd7e372dfc77a221f9f78eaa0fd577613188f020c47657524d6
Deleted: sha256:08fbec879435673f24b595ddabe0fed95809abb8421e6244ca77102c21c6c754
Deleted: sha256:ed951dbe205dec2bb38852f7480554147df489f1cc2a55ab7fdee1b2bc0eb810
Deleted: sha256:9e8226967045c3e066bdf213bdf266d3db2af65fe26b1bc47a827500d4c4621a
Deleted: sha256:d49ac11ade9dac290c68fe681b7ee40452bad685e3bfb3e1f6b6440dcfe7a363
Deleted: sha256:84c14f3fc9cc3b09a649b2fffdf841d02900a234b93843f82f94f2f1dca8748e
Deleted: sha256:a52aefb758cb3510d7957856bebb9468727fe7dda0c472fb17ab94148d924665
Deleted: sha256:b09bac8f6c75263f2e676d527e5b785e26b96fd1e5ced0e36be46f3b3dfc564d
Deleted: sha256:cdc8523dd6edccc779826b512f6493167d0c2e857239d55c56fbd0cc2794c1d7
Deleted: sha256:c3f4f5e3a9882b76fa541d031792d6685373d9ac1624ccb9a22618319ff0e810
Deleted: sha256:3d30cefdc7e6f112311fc886ed5ceaf7b71df1857972419dbea9de13800eb432
Deleted: sha256:cf3fe87f39c73fb49550b976ba5d40fec32520f0281dc3bac4aa8802850b1b06
Deleted: sha256:077dcc2cffb7b3f9832b8788667d7a1b84fba77c35184495b194bcaaf48247d8
Deleted: sha256:9385521e251cc32237d093fedcede34654402a1d3548c93312a2043116f85b34
Deleted: sha256:4805bf4d4b20629b9b7453a8546654060b257418452928d657cda44a4040d90a
Deleted: sha256:52189ee43f1c1dc823fc9695f69c4f1cde2a34e01ffd1f85600763729cda6734
Deleted: sha256:90ca75a75d76b05919180ace98b21282bdd2bf4b3b053d89db362b1bb25a1283
Deleted: sha256:16b81b6d67d1644f426d01464f1747328ee64d1e3b88991ec7bac1720e3c5082
Build step 'Execute shell' marked build as failure

Mime
View raw message