mesos-builds mailing list archives

Site index · List index
Message view « Date » · « Thread »
Top « Date » · « Thread »
From Apache Jenkins Server <jenk...@builds.apache.org>
Subject Build failed in Jenkins: Mesos-Buildbot » cmake,gcc,--verbose,GLOG_v=1 MESOS_VERBOSE=1,centos:7,(docker||Hadoop)&&(!ubuntu-us1)&&(!ubuntu-6)&&(!ubuntu-eu2) #3124
Date Wed, 18 Jan 2017 04:52:03 GMT
See <https://builds.apache.org/job/Mesos-Buildbot/BUILDTOOL=cmake,COMPILER=gcc,CONFIGURATION=--verbose,ENVIRONMENT=GLOG_v=1%20MESOS_VERBOSE=1,OS=centos%3A7,label_exp=(docker%7C%7CHadoop)&&(!ubuntu-us1)&&(!ubuntu-6)&&(!ubuntu-eu2)/3124/changes>

Changes:

[mpark] Removed duplicate code that caused redeclaration build failure.

------------------------------------------
[...truncated 159078 lines...]
[ RUN      ] Endpoint/SlaveEndpointTest.AuthorizedRequest/1
I0118 04:51:48.235435 25416 containerizer.cpp:220] Using isolation: posix/cpu,posix/mem,filesystem/posix,network/cni
W0118 04:51:48.235783 25416 backend.cpp:76] Failed to create 'aufs' backend: AufsBackend requires
root privileges, but is running as user mesos
W0118 04:51:48.235867 25416 backend.cpp:76] Failed to create 'bind' backend: BindBackend requires
root privileges
I0118 04:51:48.236989 25432 slave.cpp:209] Mesos agent started on (672)@172.17.0.4:35335
I0118 04:51:48.237007 25432 slave.cpp:210] Flags at startup: --acls="" --appc_simple_discovery_uri_prefix="http://"
--appc_store_dir="/tmp/mesos/store/appc" --authenticate_http_readonly="true" --authenticate_http_readwrite="true"
--authenticatee="crammd5" --authentication_backoff_factor="1secs" --authorizer="local" --cgroups_cpu_enable_pids_and_tids_count="false"
--cgroups_enable_cfs="false" --cgroups_hierarchy="/sys/fs/cgroup" --cgroups_limit_swap="false"
--cgroups_root="mesos" --container_disk_watch_interval="15secs" --containerizers="mesos" --credential="/tmp/Endpoint_SlaveEndpointTest_AuthorizedRequest_1_PHBHPO/credential"
--default_role="*" --disk_watch_interval="1mins" --docker="docker" --docker_kill_orphans="true"
--docker_registry="https://registry-1.docker.io" --docker_remove_delay="6hrs" --docker_socket="/var/run/docker.sock"
--docker_stop_timeout="0ns" --docker_store_dir="/tmp/mesos/store/docker" --docker_volume_checkpoint_dir="/var/run/mesos/isolators/docker/volume"
--enforce_container_disk_quota="false" --executor_registration_timeout="1mins" --executor_shutdown_grace_period="5secs"
--fetcher_cache_dir="/tmp/Endpoint_SlaveEndpointTest_AuthorizedRequest_1_PHBHPO/fetch" --fetcher_cache_size="2GB"
--frameworks_home="" --gc_delay="1weeks" --gc_disk_headroom="0.1" --hadoop_home="" --help="false"
--hostname_lookup="true" --http_authenticators="basic" --http_command_executor="false" --http_credentials="/tmp/Endpoint_SlaveEndpointTest_AuthorizedRequest_1_PHBHPO/http_credentials"
--http_heartbeat_interval="30secs" --image_provisioner_backend="copy" --initialize_driver_logging="true"
--isolation="posix/cpu,posix/mem" --launcher="posix" --launcher_dir="/mesos/build/src" --logbufsecs="0"
--logging_level="INFO" --max_completed_executors_per_framework="150" --oversubscribed_resources_interval="15secs"
--perf_duration="10secs" --perf_interval="1mins" --qos_correction_interval_min="0ns" --quiet="false"
--recover="reconnect" --recovery_timeout="15mins" --registration_backoff_factor="10ms" --resources="cpus:2;gpus:0;mem:1024;disk:1024;ports:[31000-32000]"
--revocable_cpu_low_priority="true" --runtime_dir="/tmp/Endpoint_SlaveEndpointTest_AuthorizedRequest_1_PHBHPO"
--sandbox_directory="/mnt/mesos/sandbox" --strict="true" --switch_user="true" --systemd_enable_support="true"
--systemd_runtime_directory="/run/systemd/system" --version="false" --work_dir="/tmp/Endpoint_SlaveEndpointTest_AuthorizedRequest_1_L9E5cR"
I0118 04:51:48.237483 25432 credentials.hpp:86] Loading credential for authentication from
'/tmp/Endpoint_SlaveEndpointTest_AuthorizedRequest_1_PHBHPO/credential'
I0118 04:51:48.237587 25432 slave.cpp:352] Agent using credential for: test-principal
I0118 04:51:48.237603 25432 credentials.hpp:37] Loading credentials for authentication from
'/tmp/Endpoint_SlaveEndpointTest_AuthorizedRequest_1_PHBHPO/http_credentials'
I0118 04:51:48.237705 25432 http.cpp:922] Using default 'basic' HTTP authenticator for realm
'mesos-agent-readonly'
I0118 04:51:48.237746 25432 http.cpp:922] Using default 'basic' HTTP authenticator for realm
'mesos-agent-readwrite'
I0118 04:51:48.238103 25432 slave.cpp:539] Agent resources: cpus(*):2; mem(*):1024; disk(*):1024;
ports(*):[31000-32000]
I0118 04:51:48.238145 25432 slave.cpp:547] Agent attributes: [  ]
I0118 04:51:48.238155 25432 slave.cpp:552] Agent hostname: d930eb0e49cd
I0118 04:51:48.238585 25427 state.cpp:60] Recovering state from '/tmp/Endpoint_SlaveEndpointTest_AuthorizedRequest_1_L9E5cR/meta'
I0118 04:51:48.238726 25418 status_update_manager.cpp:203] Recovering status update manager
I0118 04:51:48.238924 25427 containerizer.cpp:599] Recovering containerizer
I0118 04:51:48.239471 25423 provisioner.cpp:251] Provisioner recovery complete
I0118 04:51:48.239642 25427 slave.cpp:5417] Finished recovery
I0118 04:51:48.240072 25427 slave.cpp:5591] Querying resource estimator for oversubscribable
resources
I0118 04:51:48.240234 25425 slave.cpp:5605] Received oversubscribable resources {} from the
resource estimator
I0118 04:51:48.240886 25417 process.cpp:3676] Handling HTTP event for process 'slave(672)'
with path: '/slave(672)/monitor/statistics.json'
I0118 04:51:48.241313 25418 http.cpp:874] Authorizing principal 'test-principal' to GET the
'/monitor/statistics.json' endpoint
I0118 04:51:48.242707 25429 slave.cpp:796] Agent terminating
[       OK ] Endpoint/SlaveEndpointTest.AuthorizedRequest/1 (11 ms)
[ RUN      ] Endpoint/SlaveEndpointTest.AuthorizedRequest/2
I0118 04:51:48.247437 25416 containerizer.cpp:220] Using isolation: posix/cpu,posix/mem,filesystem/posix,network/cni
W0118 04:51:48.247723 25416 backend.cpp:76] Failed to create 'aufs' backend: AufsBackend requires
root privileges, but is running as user mesos
W0118 04:51:48.247838 25416 backend.cpp:76] Failed to create 'bind' backend: BindBackend requires
root privileges
I0118 04:51:48.248980 25421 slave.cpp:209] Mesos agent started on (673)@172.17.0.4:35335
I0118 04:51:48.249001 25421 slave.cpp:210] Flags at startup: --acls="" --appc_simple_discovery_uri_prefix="http://"
--appc_store_dir="/tmp/mesos/store/appc" --authenticate_http_readonly="true" --authenticate_http_readwrite="true"
--authenticatee="crammd5" --authentication_backoff_factor="1secs" --authorizer="local" --cgroups_cpu_enable_pids_and_tids_count="false"
--cgroups_enable_cfs="false" --cgroups_hierarchy="/sys/fs/cgroup" --cgroups_limit_swap="false"
--cgroups_root="mesos" --container_disk_watch_interval="15secs" --containerizers="mesos" --credential="/tmp/Endpoint_SlaveEndpointTest_AuthorizedRequest_2_85DPqF/credential"
--default_role="*" --disk_watch_interval="1mins" --docker="docker" --docker_kill_orphans="true"
--docker_registry="https://registry-1.docker.io" --docker_remove_delay="6hrs" --docker_socket="/var/run/docker.sock"
--docker_stop_timeout="0ns" --docker_store_dir="/tmp/mesos/store/docker" --docker_volume_checkpoint_dir="/var/run/mesos/isolators/docker/volume"
--enforce_container_disk_quota="false" --executor_registration_timeout="1mins" --executor_shutdown_grace_period="5secs"
--fetcher_cache_dir="/tmp/Endpoint_SlaveEndpointTest_AuthorizedRequest_2_85DPqF/fetch" --fetcher_cache_size="2GB"
--frameworks_home="" --gc_delay="1weeks" --gc_disk_headroom="0.1" --hadoop_home="" --help="false"
--hostname_lookup="true" --http_authenticators="basic" --http_command_executor="false" --http_credentials="/tmp/Endpoint_SlaveEndpointTest_AuthorizedRequest_2_85DPqF/http_credentials"
--http_heartbeat_interval="30secs" --image_provisioner_backend="copy" --initialize_driver_logging="true"
--isolation="posix/cpu,posix/mem" --launcher="posix" --launcher_dir="/mesos/build/src" --logbufsecs="0"
--logging_level="INFO" --max_completed_executors_per_framework="150" --oversubscribed_resources_interval="15secs"
--perf_duration="10secs" --perf_interval="1mins" --qos_correction_interval_min="0ns" --quiet="false"
--recover="reconnect" --recovery_timeout="15mins" --registration_backoff_factor="10ms" --resources="cpus:2;gpus:0;mem:1024;disk:1024;ports:[31000-32000]"
--revocable_cpu_low_priority="true" --runtime_dir="/tmp/Endpoint_SlaveEndpointTest_AuthorizedRequest_2_85DPqF"
--sandbox_directory="/mnt/mesos/sandbox" --strict="true" --switch_user="true" --systemd_enable_support="true"
--systemd_runtime_directory="/run/systemd/system" --version="false" --work_dir="/tmp/Endpoint_SlaveEndpointTest_AuthorizedRequest_2_4iCfMH"
I0118 04:51:48.249369 25421 credentials.hpp:86] Loading credential for authentication from
'/tmp/Endpoint_SlaveEndpointTest_AuthorizedRequest_2_85DPqF/credential'
I0118 04:51:48.249459 25421 slave.cpp:352] Agent using credential for: test-principal
I0118 04:51:48.249472 25421 credentials.hpp:37] Loading credentials for authentication from
'/tmp/Endpoint_SlaveEndpointTest_AuthorizedRequest_2_85DPqF/http_credentials'
I0118 04:51:48.249570 25421 http.cpp:922] Using default 'basic' HTTP authenticator for realm
'mesos-agent-readonly'
I0118 04:51:48.249614 25421 http.cpp:922] Using default 'basic' HTTP authenticator for realm
'mesos-agent-readwrite'
I0118 04:51:48.250033 25421 slave.cpp:539] Agent resources: cpus(*):2; mem(*):1024; disk(*):1024;
ports(*):[31000-32000]
I0118 04:51:48.250074 25421 slave.cpp:547] Agent attributes: [  ]
I0118 04:51:48.250084 25421 slave.cpp:552] Agent hostname: d930eb0e49cd
I0118 04:51:48.250527 25428 state.cpp:60] Recovering state from '/tmp/Endpoint_SlaveEndpointTest_AuthorizedRequest_2_4iCfMH/meta'
I0118 04:51:48.250666 25417 status_update_manager.cpp:203] Recovering status update manager
I0118 04:51:48.250838 25417 containerizer.cpp:599] Recovering containerizer
I0118 04:51:48.251595 25420 provisioner.cpp:251] Provisioner recovery complete
I0118 04:51:48.251857 25420 slave.cpp:5417] Finished recovery
I0118 04:51:48.252291 25420 slave.cpp:5591] Querying resource estimator for oversubscribable
resources
I0118 04:51:48.252542 25431 slave.cpp:5605] Received oversubscribable resources {} from the
resource estimator
I0118 04:51:48.253294 25423 process.cpp:3676] Handling HTTP event for process 'slave(673)'
with path: '/slave(673)/containers'
I0118 04:51:48.253737 25421 http.cpp:874] Authorizing principal 'test-principal' to GET the
'/containers' endpoint
I0118 04:51:48.255023 25418 slave.cpp:796] Agent terminating
[       OK ] Endpoint/SlaveEndpointTest.AuthorizedRequest/2 (12 ms)
[ RUN      ] Endpoint/SlaveEndpointTest.UnauthorizedRequest/0
I0118 04:51:48.260478 25416 containerizer.cpp:220] Using isolation: posix/cpu,posix/mem,filesystem/posix,network/cni
W0118 04:51:48.260843 25416 backend.cpp:76] Failed to create 'aufs' backend: AufsBackend requires
root privileges, but is running as user mesos
W0118 04:51:48.260964 25416 backend.cpp:76] Failed to create 'bind' backend: BindBackend requires
root privileges
I0118 04:51:48.262161 25425 slave.cpp:209] Mesos agent started on (674)@172.17.0.4:35335
I0118 04:51:48.262179 25425 slave.cpp:210] Flags at startup: --acls="" --appc_simple_discovery_uri_prefix="http://"
--appc_store_dir="/tmp/mesos/store/appc" --authenticate_http_readonly="true" --authenticate_http_readwrite="true"
--authenticatee="crammd5" --authentication_backoff_factor="1secs" --authorizer="local" --cgroups_cpu_enable_pids_and_tids_count="false"
--cgroups_enable_cfs="false" --cgroups_hierarchy="/sys/fs/cgroup" --cgroups_limit_swap="false"
--cgroups_root="mesos" --container_disk_watch_interval="15secs" --containerizers="mesos" --credential="/tmp/Endpoint_SlaveEndpointTest_UnauthorizedRequest_0_caAcaw/credential"
--default_role="*" --disk_watch_interval="1mins" --docker="docker" --docker_kill_orphans="true"
--docker_registry="https://registry-1.docker.io" --docker_remove_delay="6hrs" --docker_socket="/var/run/docker.sock"
--docker_stop_timeout="0ns" --docker_store_dir="/tmp/mesos/store/docker" --docker_volume_checkpoint_dir="/var/run/mesos/isolators/docker/volume"
--enforce_container_disk_quota="false" --executor_registration_timeout="1mins" --executor_shutdown_grace_period="5secs"
--fetcher_cache_dir="/tmp/Endpoint_SlaveEndpointTest_UnauthorizedRequest_0_caAcaw/fetch" --fetcher_cache_size="2GB"
--frameworks_home="" --gc_delay="1weeks" --gc_disk_headroom="0.1" --hadoop_home="" --help="false"
--hostname_lookup="true" --http_authenticators="basic" --http_command_executor="false" --http_credentials="/tmp/Endpoint_SlaveEndpointTest_UnauthorizedRequest_0_caAcaw/http_credentials"
--http_heartbeat_interval="30secs" --image_provisioner_backend="copy" --initialize_driver_logging="true"
--isolation="posix/cpu,posix/mem" --launcher="posix" --launcher_dir="/mesos/build/src" --logbufsecs="0"
--logging_level="INFO" --max_completed_executors_per_framework="150" --oversubscribed_resources_interval="15secs"
--perf_duration="10secs" --perf_interval="1mins" --qos_correction_interval_min="0ns" --quiet="false"
--recover="reconnect" --recovery_timeout="15mins" --registration_backoff_factor="10ms" --resources="cpus:2;gpus:0;mem:1024;disk:1024;ports:[31000-32000]"
--revocable_cpu_low_priority="true" --runtime_dir="/tmp/Endpoint_SlaveEndpointTest_UnauthorizedRequest_0_caAcaw"
--sandbox_directory="/mnt/mesos/sandbox" --strict="true" --switch_user="true" --systemd_enable_support="true"
--systemd_runtime_directory="/run/systemd/system" --version="false" --work_dir="/tmp/Endpoint_SlaveEndpointTest_UnauthorizedRequest_0_I6Xwty"
I0118 04:51:48.262576 25425 credentials.hpp:86] Loading credential for authentication from
'/tmp/Endpoint_SlaveEndpointTest_UnauthorizedRequest_0_caAcaw/credential'
I0118 04:51:48.262686 25425 slave.cpp:352] Agent using credential for: test-principal
I0118 04:51:48.262707 25425 credentials.hpp:37] Loading credentials for authentication from
'/tmp/Endpoint_SlaveEndpointTest_UnauthorizedRequest_0_caAcaw/http_credentials'
I0118 04:51:48.262828 25425 http.cpp:922] Using default 'basic' HTTP authenticator for realm
'mesos-agent-readonly'
I0118 04:51:48.262878 25425 http.cpp:922] Using default 'basic' HTTP authenticator for realm
'mesos-agent-readwrite'
I0118 04:51:48.263290 25425 slave.cpp:539] Agent resources: cpus(*):2; mem(*):1024; disk(*):1024;
ports(*):[31000-32000]
I0118 04:51:48.263334 25425 slave.cpp:547] Agent attributes: [  ]
I0118 04:51:48.263341 25425 slave.cpp:552] Agent hostname: d930eb0e49cd
I0118 04:51:48.263730 25417 state.cpp:60] Recovering state from '/tmp/Endpoint_SlaveEndpointTest_UnauthorizedRequest_0_I6Xwty/meta'
I0118 04:51:48.263919 25432 status_update_manager.cpp:203] Recovering status update manager
I0118 04:51:48.264036 25431 containerizer.cpp:599] Recovering containerizer
I0118 04:51:48.264449 25431 provisioner.cpp:251] Provisioner recovery complete
I0118 04:51:48.264562 25431 slave.cpp:5417] Finished recovery
I0118 04:51:48.264873 25431 slave.cpp:5591] Querying resource estimator for oversubscribable
resources
I0118 04:51:48.265015 25431 slave.cpp:5605] Received oversubscribable resources {} from the
resource estimator
I0118 04:51:48.265766 25428 process.cpp:3676] Handling HTTP event for process 'slave(674)'
with path: '/slave(674)/monitor/statistics'
I0118 04:51:48.266288 25430 http.cpp:874] Authorizing principal 'test-principal' to GET the
'/monitor/statistics' endpoint
I0118 04:51:48.267382 25418 slave.cpp:796] Agent terminating
[       OK ] Endpoint/SlaveEndpointTest.UnauthorizedRequest/0 (12 ms)
[ RUN      ] Endpoint/SlaveEndpointTest.UnauthorizedRequest/1
I0118 04:51:48.272766 25416 containerizer.cpp:220] Using isolation: posix/cpu,posix/mem,filesystem/posix,network/cni
W0118 04:51:48.273092 25416 backend.cpp:76] Failed to create 'aufs' backend: AufsBackend requires
root privileges, but is running as user mesos
W0118 04:51:48.273188 25416 backend.cpp:76] Failed to create 'bind' backend: BindBackend requires
root privileges
I0118 04:51:48.274302 25425 slave.cpp:209] Mesos agent started on (675)@172.17.0.4:35335
I0118 04:51:48.274322 25425 slave.cpp:210] Flags at startup: --acls="" --appc_simple_discovery_uri_prefix="http://"
--appc_store_dir="/tmp/mesos/store/appc" --authenticate_http_readonly="true" --authenticate_http_readwrite="true"
--authenticatee="crammd5" --authentication_backoff_factor="1secs" --authorizer="local" --cgroups_cpu_enable_pids_and_tids_count="false"
--cgroups_enable_cfs="false" --cgroups_hierarchy="/sys/fs/cgroup" --cgroups_limit_swap="false"
--cgroups_root="mesos" --container_disk_watch_interval="15secs" --containerizers="mesos" --credential="/tmp/Endpoint_SlaveEndpointTest_UnauthorizedRequest_1_EWrM1m/credential"
--default_role="*" --disk_watch_interval="1mins" --docker="docker" --docker_kill_orphans="true"
--docker_registry="https://registry-1.docker.io" --docker_remove_delay="6hrs" --docker_socket="/var/run/docker.sock"
--docker_stop_timeout="0ns" --docker_store_dir="/tmp/mesos/store/docker" --docker_volume_checkpoint_dir="/var/run/mesos/isolators/docker/volume"
--enforce_container_disk_quota="false" --executor_registration_timeout="1mins" --executor_shutdown_grace_period="5secs"
--fetcher_cache_dir="/tmp/Endpoint_SlaveEndpointTest_UnauthorizedRequest_1_EWrM1m/fetch" --fetcher_cache_size="2GB"
--frameworks_home="" --gc_delay="1weeks" --gc_disk_headroom="0.1" --hadoop_home="" --help="false"
--hostname_lookup="true" --http_authenticators="basic" --http_command_executor="false" --http_credentials="/tmp/Endpoint_SlaveEndpointTest_UnauthorizedRequest_1_EWrM1m/http_credentials"
--http_heartbeat_interval="30secs" --image_provisioner_backend="copy" --initialize_driver_logging="true"
--isolation="posix/cpu,posix/mem" --launcher="posix" --launcher_dir="/mesos/build/src" --logbufsecs="0"
--logging_level="INFO" --max_completed_executors_per_framework="150" --oversubscribed_resources_interval="15secs"
--perf_duration="10secs" --perf_interval="1mins" --qos_correction_interval_min="0ns" --quiet="false"
--recover="reconnect" --recovery_timeout="15mins" --registration_backoff_factor="10ms" --resources="cpus:2;gpus:0;mem:1024;disk:1024;ports:[31000-32000]"
--revocable_cpu_low_priority="true" --runtime_dir="/tmp/Endpoint_SlaveEndpointTest_UnauthorizedRequest_1_EWrM1m"
--sandbox_directory="/mnt/mesos/sandbox" --strict="true" --switch_user="true" --systemd_enable_support="true"
--systemd_runtime_directory="/run/systemd/system" --version="false" --work_dir="/tmp/Endpoint_SlaveEndpointTest_UnauthorizedRequest_1_0jJ3ip"
I0118 04:51:48.274730 25425 credentials.hpp:86] Loading credential for authentication from
'/tmp/Endpoint_SlaveEndpointTest_UnauthorizedRequest_1_EWrM1m/credential'
I0118 04:51:48.274821 25425 slave.cpp:352] Agent using credential for: test-principal
I0118 04:51:48.274837 25425 credentials.hpp:37] Loading credentials for authentication from
'/tmp/Endpoint_SlaveEndpointTest_UnauthorizedRequest_1_EWrM1m/http_credentials'
I0118 04:51:48.274978 25425 http.cpp:922] Using default 'basic' HTTP authenticator for realm
'mesos-agent-readonly'
I0118 04:51:48.275029 25425 http.cpp:922] Using default 'basic' HTTP authenticator for realm
'mesos-agent-readwrite'
I0118 04:51:48.275486 25425 slave.cpp:539] Agent resources: cpus(*):2; mem(*):1024; disk(*):1024;
ports(*):[31000-32000]
I0118 04:51:48.275529 25425 slave.cpp:547] Agent attributes: [  ]
I0118 04:51:48.275539 25425 slave.cpp:552] Agent hostname: d930eb0e49cd
I0118 04:51:48.275949 25426 state.cpp:60] Recovering state from '/tmp/Endpoint_SlaveEndpointTest_UnauthorizedRequest_1_0jJ3ip/meta'
I0118 04:51:48.276111 25424 status_update_manager.cpp:203] Recovering status update manager
I0118 04:51:48.276242 25428 containerizer.cpp:599] Recovering containerizer
I0118 04:51:48.276804 25432 provisioner.cpp:251] Provisioner recovery complete
I0118 04:51:48.277056 25426 slave.cpp:5417] Finished recovery
I0118 04:51:48.277454 25426 slave.cpp:5591] Querying resource estimator for oversubscribable
resources
I0118 04:51:48.277592 25420 slave.cpp:5605] Received oversubscribable resources {} from the
resource estimator
I0118 04:51:48.278226 25424 process.cpp:3676] Handling HTTP event for process 'slave(675)'
with path: '/slave(675)/monitor/statistics.json'
I0118 04:51:48.278631 25429 http.cpp:874] Authorizing principal 'test-principal' to GET the
'/monitor/statistics.json' endpoint
I0118 04:51:48.279543 25420 slave.cpp:796] Agent terminating
[       OK ] Endpoint/SlaveEndpointTest.UnauthorizedRequest/1 (11 ms)
[ RUN      ] Endpoint/SlaveEndpointTest.UnauthorizedRequest/2
I0118 04:51:48.283572 25416 containerizer.cpp:220] Using isolation: posix/cpu,posix/mem,filesystem/posix,network/cni
W0118 04:51:48.283921 25416 backend.cpp:76] Failed to create 'aufs' backend: AufsBackend requires
root privileges, but is running as user mesos
W0118 04:51:48.284014 25416 backend.cpp:76] Failed to create 'bind' backend: BindBackend requires
root privileges
I0118 04:51:48.285606 25432 slave.cpp:209] Mesos agent started on (676)@172.17.0.4:35335
I0118 04:51:48.285622 25432 slave.cpp:210] Flags at startup: --acls="" --appc_simple_discovery_uri_prefix="http://"
--appc_store_dir="/tmp/mesos/store/appc" --authenticate_http_readonly="true" --authenticate_http_readwrite="true"
--authenticatee="crammd5" --authentication_backoff_factor="1secs" --authorizer="local" --cgroups_cpu_enable_pids_and_tids_count="false"
--cgroups_enable_cfs="false" --cgroups_hierarchy="/sys/fs/cgroup" --cgroups_limit_swap="false"
--cgroups_root="mesos" --container_disk_watch_interval="15secs" --containerizers="mesos" --credential="/tmp/Endpoint_SlaveEndpointTest_UnauthorizedRequest_2_WgxF0d/credential"
--default_role="*" --disk_watch_interval="1mins" --docker="docker" --docker_kill_orphans="true"
--docker_registry="https://registry-1.docker.io" --docker_remove_delay="6hrs" --docker_socket="/var/run/docker.sock"
--docker_stop_timeout="0ns" --docker_store_dir="/tmp/mesos/store/docker" --docker_volume_checkpoint_dir="/var/run/mesos/isolators/docker/volume"
--enforce_container_disk_quota="false" --executor_registration_timeout="1mins" --executor_shutdown_grace_period="5secs"
--fetcher_cache_dir="/tmp/Endpoint_SlaveEndpointTest_UnauthorizedRequest_2_WgxF0d/fetch" --fetcher_cache_size="2GB"
--frameworks_home="" --gc_delay="1weeks" --gc_disk_headroom="0.1" --hadoop_home="" --help="false"
--hostname_lookup="true" --http_authenticators="basic" --http_command_executor="false" --http_credentials="/tmp/Endpoint_SlaveEndpointTest_UnauthorizedRequest_2_WgxF0d/http_credentials"
--http_heartbeat_interval="30secs" --image_provisioner_backend="copy" --initialize_driver_logging="true"
--isolation="posix/cpu,posix/mem" --launcher="posix" --launcher_dir="/mesos/build/src" --logbufsecs="0"
--logging_level="INFO" --max_completed_executors_per_framework="150" --oversubscribed_resources_interval="15secs"
--perf_duration="10secs" --perf_interval="1mins" --qos_correction_interval_min="0ns" --quiet="false"
--recover="reconnect" --recovery_timeout="15mins" --registration_backoff_factor="10ms" --resources="cpus:2;gpus:0;mem:1024;disk:1024;ports:[31000-32000]"
--revocable_cpu_low_priority="true" --runtime_dir="/tmp/Endpoint_SlaveEndpointTest_UnauthorizedRequest_2_WgxF0d"
--sandbox_directory="/mnt/mesos/sandbox" --strict="true" --switch_user="true" --systemd_enable_support="true"
--systemd_runtime_directory="/run/systemd/system" --version="false" --work_dir="/tmp/Endpoint_SlaveEndpointTest_UnauthorizedRequest_2_8uAcgg"
I0118 04:51:48.285948 25432 credentials.hpp:86] Loading credential for authentication from
'/tmp/Endpoint_SlaveEndpointTest_UnauthorizedRequest_2_WgxF0d/credential'
I0118 04:51:48.286068 25432 slave.cpp:352] Agent using credential for: test-principal
I0118 04:51:48.286088 25432 credentials.hpp:37] Loading credentials for authentication from
'/tmp/Endpoint_SlaveEndpointTest_UnauthorizedRequest_2_WgxF0d/http_credentials'
I0118 04:51:48.286216 25432 http.cpp:922] Using default 'basic' HTTP authenticator for realm
'mesos-agent-readonly'
I0118 04:51:48.286267 25432 http.cpp:922] Using default 'basic' HTTP authenticator for realm
'mesos-agent-readwrite'
I0118 04:51:48.286681 25432 slave.cpp:539] Agent resources: cpus(*):2; mem(*):1024; disk(*):1024;
ports(*):[31000-32000]
I0118 04:51:48.286737 25432 slave.cpp:547] Agent attributes: [  ]
I0118 04:51:48.286751 25432 slave.cpp:552] Agent hostname: d930eb0e49cd
I0118 04:51:48.287166 25421 state.cpp:60] Recovering state from '/tmp/Endpoint_SlaveEndpointTest_UnauthorizedRequest_2_8uAcgg/meta'
I0118 04:51:48.287318 25429 status_update_manager.cpp:203] Recovering status update manager
I0118 04:51:48.287425 25429 containerizer.cpp:599] Recovering containerizer
I0118 04:51:48.287928 25426 provisioner.cpp:251] Provisioner recovery complete
I0118 04:51:48.288383 25431 slave.cpp:5417] Finished recovery
I0118 04:51:48.289153 25431 slave.cpp:5591] Querying resource estimator for oversubscribable
resources
I0118 04:51:48.289508 25422 slave.cpp:5605] Received oversubscribable resources {} from the
resource estimator
I0118 04:51:48.290307 25429 process.cpp:3676] Handling HTTP event for process 'slave(676)'
with path: '/slave(676)/containers'
I0118 04:51:48.290752 25425 http.cpp:874] Authorizing principal 'test-principal' to GET the
'/containers' endpoint
I0118 04:51:48.291939 25416 slave.cpp:796] Agent terminating
[       OK ] Endpoint/SlaveEndpointTest.UnauthorizedRequest/2 (13 ms)
[ RUN      ] Endpoint/SlaveEndpointTest.NoAuthorizer/0
I0118 04:51:48.298249 25416 containerizer.cpp:220] Using isolation: posix/cpu,posix/mem,filesystem/posix,network/cni
W0118 04:51:48.298674 25416 backend.cpp:76] Failed to create 'aufs' backend: AufsBackend requires
root privileges, but is running as user mesos
W0118 04:51:48.298810 25416 backend.cpp:76] Failed to create 'bind' backend: BindBackend requires
root privileges
I0118 04:51:48.299527 25416 cluster.cpp:446] Creating default 'local' authorizer
I0118 04:51:48.300137 25418 slave.cpp:209] Mesos agent started on (677)@172.17.0.4:35335
I0118 04:51:48.300160 25418 slave.cpp:210] Flags at startup: --acls="" --appc_simple_discovery_uri_prefix="http://"
--appc_store_dir="/tmp/mesos/store/appc" --authenticate_http_readonly="true" --authenticate_http_readwrite="true"
--authenticatee="crammd5" --authentication_backoff_factor="1secs" --authorizer="local" --cgroups_cpu_enable_pids_and_tids_count="false"
--cgroups_enable_cfs="false" --cgroups_hierarchy="/sys/fs/cgroup" --cgroups_limit_swap="false"
--cgroups_root="mesos" --container_disk_watch_interval="15secs" --containerizers="mesos" --credential="/tmp/Endpoint_SlaveEndpointTest_NoAuthorizer_0_Uvdj84/credential"
--default_role="*" --disk_watch_interval="1mins" --docker="docker" --docker_kill_orphans="true"
--docker_registry="https://registry-1.docker.io" --docker_remove_delay="6hrs" --docker_socket="/var/run/docker.sock"
--docker_stop_timeout="0ns" --docker_store_dir="/tmp/mesos/store/docker" --docker_volume_checkpoint_dir="/var/run/mesos/isolators/docker/volume"
--enforce_container_disk_quota="false" --executor_registration_timeout="1mins" --executor_shutdown_grace_period="5secs"
--fetcher_cache_dir="/tmp/Endpoint_SlaveEndpointTest_NoAuthorizer_0_Uvdj84/fetch" --fetcher_cache_size="2GB"
--frameworks_home="" --gc_delay="1weeks" --gc_disk_headroom="0.1" --hadoop_home="" --help="false"
--hostname_lookup="true" --http_authenticators="basic" --http_command_executor="false" --http_credentials="/tmp/Endpoint_SlaveEndpointTest_NoAuthorizer_0_Uvdj84/http_credentials"
--http_heartbeat_interval="30secs" --image_provisioner_backend="copy" --initialize_driver_logging="true"
--isolation="posix/cpu,posix/mem" --launcher="posix" --launcher_dir="/mesos/build/src" --logbufsecs="0"
--logging_level="INFO" --max_completed_executors_per_framework="150" --oversubscribed_resources_interval="15secs"
--perf_duration="10secs" --perf_interval="1mins" --qos_correction_interval_min="0ns" --quiet="false"
--recover="reconnect" --recovery_timeout="15mins" --registration_backoff_factor="10ms" --resources="cpus:2;gpus:0;mem:1024;disk:1024;ports:[31000-32000]"
--revocable_cpu_low_priority="true" --runtime_dir="/tmp/Endpoint_SlaveEndpointTest_NoAuthorizer_0_Uvdj84"
--sandbox_directory="/mnt/mesos/sandbox" --strict="true" --switch_user="true" --systemd_enable_support="true"
--systemd_runtime_directory="/run/systemd/system" --version="false" --work_dir="/tmp/Endpoint_SlaveEndpointTest_NoAuthorizer_0_KI1wl7"
I0118 04:51:48.300812 25418 credentials.hpp:86] Loading credential for authentication from
'/tmp/Endpoint_SlaveEndpointTest_NoAuthorizer_0_Uvdj84/credential'
I0118 04:51:48.300911 25418 slave.cpp:352] Agent using credential for: test-principal
I0118 04:51:48.300927 25418 credentials.hpp:37] Loading credentials for authentication from
'/tmp/Endpoint_SlaveEndpointTest_NoAuthorizer_0_Uvdj84/http_credentials'
I0118 04:51:48.301041 25418 http.cpp:922] Using default 'basic' HTTP authenticator for realm
'mesos-agent-readonly'
I0118 04:51:48.301096 25418 http.cpp:922] Using default 'basic' HTTP authenticator for realm
'mesos-agent-readwrite'
I0118 04:51:48.301528 25418 slave.cpp:539] Agent resources: cpus(*):2; mem(*):1024; disk(*):1024;
ports(*):[31000-32000]
I0118 04:51:48.301575 25418 slave.cpp:547] Agent attributes: [  ]
I0118 04:51:48.301583 25418 slave.cpp:552] Agent hostname: d930eb0e49cd
I0118 04:51:48.302004 25431 state.cpp:60] Recovering state from '/tmp/Endpoint_SlaveEndpointTest_NoAuthorizer_0_KI1wl7/meta'
I0118 04:51:48.302325 25418 status_update_manager.cpp:203] Recovering status update manager
I0118 04:51:48.302516 25422 containerizer.cpp:599] Recovering containerizer
I0118 04:51:48.303279 25424 provisioner.cpp:251] Provisioner recovery complete
I0118 04:51:48.303503 25424 slave.cpp:5417] Finished recovery
I0118 04:51:48.304020 25424 slave.cpp:5591] Querying resource estimator for oversubscribable
resources
I0118 04:51:48.304224 25431 slave.cpp:5605] Received oversubscribable resources {} from the
resource estimator
I0118 04:51:48.305064 25430 process.cpp:3676] Handling HTTP event for process 'slave(677)'
with path: '/slave(677)/monitor/statistics'
I0118 04:51:48.305462 25430 http.cpp:874] Authorizing principal 'test-principal' to GET the
'/monitor/statistics' endpoint
I0118 04:51:48.307008 25416 slave.cpp:796] Agent terminating
[       OK ] Endpoint/SlaveEndpointTest.NoAuthorizer/0 (14 ms)
[ RUN      ] Endpoint/SlaveEndpointTest.NoAuthorizer/1
I0118 04:51:48.313136 25416 containerizer.cpp:220] Using isolation: posix/cpu,posix/mem,filesystem/posix,network/cni
W0118 04:51:48.313527 25416 backend.cpp:76] Failed to create 'aufs' backend: AufsBackend requires
root privileges, but is running as user mesos
W0118 04:51:48.313650 25416 backend.cpp:76] Failed to create 'bind' backend: BindBackend requires
root privileges
I0118 04:51:48.314489 25416 cluster.cpp:446] Creating default 'local' authorizer
I0118 04:51:48.315086 25423 slave.cpp:209] Mesos agent started on (678)@172.17.0.4:35335
I0118 04:51:48.315114 25423 slave.cpp:210] Flags at startup: --acls="" --appc_simple_discovery_uri_prefix="http://"
--appc_store_dir="/tmp/mesos/store/appc" --authenticate_http_readonly="true" --authenticate_http_readwrite="true"
--authenticatee="crammd5" --authentication_backoff_factor="1secs" --authorizer="local" --cgroups_cpu_enable_pids_and_tids_count="false"
--cgroups_enable_cfs="false" --cgroups_hierarchy="/sys/fs/cgroup" --cgroups_limit_swap="false"
--cgroups_root="mesos" --container_disk_watch_interval="15secs" --containerizers="mesos" --credential="/tmp/Endpoint_SlaveEndpointTest_NoAuthorizer_1_IcQvpW/credential"
--default_role="*" --disk_watch_interval="1mins" --docker="docker" --docker_kill_orphans="true"
--docker_registry="https://registry-1.docker.io" --docker_remove_delay="6hrs" --docker_socket="/var/run/docker.sock"
--docker_stop_timeout="0ns" --docker_store_dir="/tmp/mesos/store/docker" --docker_volume_checkpoint_dir="/var/run/mesos/isolators/docker/volume"
--enforce_container_disk_quota="false" --executor_registration_timeout="1mins" --executor_shutdown_grace_period="5secs"
--fetcher_cache_dir="/tmp/Endpoint_SlaveEndpointTest_NoAuthorizer_1_IcQvpW/fetch" --fetcher_cache_size="2GB"
--frameworks_home="" --gc_delay="1weeks" --gc_disk_headroom="0.1" --hadoop_home="" --help="false"
--hostname_lookup="true" --http_authenticators="basic" --http_command_executor="false" --http_credentials="/tmp/Endpoint_SlaveEndpointTest_NoAuthorizer_1_IcQvpW/http_credentials"
--http_heartbeat_interval="30secs" --image_provisioner_backend="copy" --initialize_driver_logging="true"
--isolation="posix/cpu,posix/mem" --launcher="posix" --launcher_dir="/mesos/build/src" --logbufsecs="0"
--logging_level="INFO" --max_completed_executors_per_framework="150" --oversubscribed_resources_interval="15secs"
--perf_duration="10secs" --perf_interval="1mins" --qos_correction_interval_min="0ns" --quiet="false"
--recover="reconnect" --recovery_timeout="15mins" --registration_backoff_factor="10ms" --resources="cpus:2;gpus:0;mem:1024;disk:1024;ports:[31000-32000]"
--revocable_cpu_low_priority="true" --runtime_dir="/tmp/Endpoint_SlaveEndpointTest_NoAuthorizer_1_IcQvpW"
--sandbox_directory="/mnt/mesos/sandbox" --strict="true" --switch_user="true" --systemd_enable_support="true"
--systemd_runtime_directory="/run/systemd/system" --version="false" --work_dir="/tmp/Endpoint_SlaveEndpointTest_NoAuthorizer_1_g4QlAY"
I0118 04:51:48.315613 25423 credentials.hpp:86] Loading credential for authentication from
'/tmp/Endpoint_SlaveEndpointTest_NoAuthorizer_1_IcQvpW/credential'
I0118 04:51:48.315742 25423 slave.cpp:352] Agent using credential for: test-principal
I0118 04:51:48.315783 25423 credentials.hpp:37] Loading credentials for authentication from
'/tmp/Endpoint_SlaveEndpointTest_NoAuthorizer_1_IcQvpW/http_credentials'
I0118 04:51:48.315924 25423 http.cpp:922] Using default 'basic' HTTP authenticator for realm
'mesos-agent-readonly'
I0118 04:51:48.315985 25423 http.cpp:922] Using default 'basic' HTTP authenticator for realm
'mesos-agent-readwrite'
I0118 04:51:48.316514 25423 slave.cpp:539] Agent resources: cpus(*):2; mem(*):1024; disk(*):1024;
ports(*):[31000-32000]
I0118 04:51:48.316561 25423 slave.cpp:547] Agent attributes: [  ]
I0118 04:51:48.316570 25423 slave.cpp:552] Agent hostname: d930eb0e49cd
I0118 04:51:48.317334 25423 state.cpp:60] Recovering state from '/tmp/Endpoint_SlaveEndpointTest_NoAuthorizer_1_g4QlAY/meta'
I0118 04:51:48.317548 25423 status_update_manager.cpp:203] Recovering status update manager
I0118 04:51:48.317714 25423 containerizer.cpp:599] Recovering containerizer
I0118 04:51:48.318516 25430 provisioner.cpp:251] Provisioner recovery complete
I0118 04:51:48.318779 25430 slave.cpp:5417] Finished recovery
I0118 04:51:48.319250 25430 slave.cpp:5591] Querying resource estimator for oversubscribable
resources
I0118 04:51:48.319386 25424 slave.cpp:5605] Received oversubscribable resources {} from the
resource estimator
I0118 04:51:48.320686 25420 process.cpp:3676] Handling HTTP event for process 'slave(678)'
with path: '/slave(678)/monitor/statistics.json'
I0118 04:51:48.321200 25428 http.cpp:874] Authorizing principal 'test-principal' to GET the
'/monitor/statistics.json' endpoint
I0118 04:51:48.323050 25429 slave.cpp:796] Agent terminating
[       OK ] Endpoint/SlaveEndpointTest.NoAuthorizer/1 (16 ms)
[ RUN      ] Endpoint/SlaveEndpointTest.NoAuthorizer/2
I0118 04:51:48.329802 25416 containerizer.cpp:220] Using isolation: posix/cpu,posix/mem,filesystem/posix,network/cni
W0118 04:51:48.330221 25416 backend.cpp:76] Failed to create 'aufs' backend: AufsBackend requires
root privileges, but is running as user mesos
W0118 04:51:48.330360 25416 backend.cpp:76] Failed to create 'bind' backend: BindBackend requires
root privileges
I0118 04:51:48.331149 25416 cluster.cpp:446] Creating default 'local' authorizer
I0118 04:51:48.331970 25419 slave.cpp:209] Mesos agent started on (679)@172.17.0.4:35335
I0118 04:51:48.331995 25419 slave.cpp:210] Flags at startup: --acls="" --appc_simple_discovery_uri_prefix="http://"
--appc_store_dir="/tmp/mesos/store/appc" --authenticate_http_readonly="true" --authenticate_http_readwrite="true"
--authenticatee="crammd5" --authentication_backoff_factor="1secs" --authorizer="local" --cgroups_cpu_enable_pids_and_tids_count="false"
--cgroups_enable_cfs="false" --cgroups_hierarchy="/sys/fs/cgroup" --cgroups_limit_swap="false"
--cgroups_root="mesos" --container_disk_watch_interval="15secs" --containerizers="mesos" --credential="/tmp/Endpoint_SlaveEndpointTest_NoAuthorizer_2_weMlRN/credential"
--default_role="*" --disk_watch_interval="1mins" --docker="docker" --docker_kill_orphans="true"
--docker_registry="https://registry-1.docker.io" --docker_remove_delay="6hrs" --docker_socket="/var/run/docker.sock"
--docker_stop_timeout="0ns" --docker_store_dir="/tmp/mesos/store/docker" --docker_volume_checkpoint_dir="/var/run/mesos/isolators/docker/volume"
--enforce_container_disk_quota="false" --executor_registration_timeout="1mins" --executor_shutdown_grace_period="5secs"
--fetcher_cache_dir="/tmp/Endpoint_SlaveEndpointTest_NoAuthorizer_2_weMlRN/fetch" --fetcher_cache_size="2GB"
--frameworks_home="" --gc_delay="1weeks" --gc_disk_headroom="0.1" --hadoop_home="" --help="false"
--hostname_lookup="true" --http_authenticators="basic" --http_command_executor="false" --http_credentials="/tmp/Endpoint_SlaveEndpointTest_NoAuthorizer_2_weMlRN/http_credentials"
--http_heartbeat_interval="30secs" --image_provisioner_backend="copy" --initialize_driver_logging="true"
--isolation="posix/cpu,posix/mem" --launcher="posix" --launcher_dir="/mesos/build/src" --logbufsecs="0"
--logging_level="INFO" --max_completed_executors_per_framework="150" --oversubscribed_resources_interval="15secs"
--perf_duration="10secs" --perf_interval="1mins" --qos_correction_interval_min="0ns" --quiet="false"
--recover="reconnect" --recovery_timeout="15mins" --registration_backoff_factor="10ms" --resources="cpus:2;gpus:0;mem:1024;disk:1024;ports:[31000-32000]"
--revocable_cpu_low_priority="true" --runtime_dir="/tmp/Endpoint_SlaveEndpointTest_NoAuthorizer_2_weMlRN"
--sandbox_directory="/mnt/mesos/sandbox" --strict="true" --switch_user="true" --systemd_enable_support="true"
--systemd_runtime_directory="/run/systemd/system" --version="false" --work_dir="/tmp/Endpoint_SlaveEndpointTest_NoAuthorizer_2_qCYsZP"
I0118 04:51:48.332438 25419 credentials.hpp:86] Loading credential for authentication from
'/tmp/Endpoint_SlaveEndpointTest_NoAuthorizer_2_weMlRN/credential'
I0118 04:51:48.332574 25419 slave.cpp:352] Agent using credential for: test-principal
I0118 04:51:48.332592 25419 credentials.hpp:37] Loading credentials for authentication from
'/tmp/Endpoint_SlaveEndpointTest_NoAuthorizer_2_weMlRN/http_credentials'
I0118 04:51:48.332717 25419 http.cpp:922] Using default 'basic' HTTP authenticator for realm
'mesos-agent-readonly'
I0118 04:51:48.332774 25419 http.cpp:922] Using default 'basic' HTTP authenticator for realm
'mesos-agent-readwrite'
I0118 04:51:48.333341 25419 slave.cpp:539] Agent resources: cpus(*):2; mem(*):1024; disk(*):1024;
ports(*):[31000-32000]
I0118 04:51:48.333389 25419 slave.cpp:547] Agent attributes: [  ]
I0118 04:51:48.333395 25419 slave.cpp:552] Agent hostname: d930eb0e49cd
I0118 04:51:48.333916 25426 state.cpp:60] Recovering state from '/tmp/Endpoint_SlaveEndpointTest_NoAuthorizer_2_qCYsZP/meta'
I0118 04:51:48.334097 25428 status_update_manager.cpp:203] Recovering status update manager
I0118 04:51:48.334249 25423 containerizer.cpp:599] Recovering containerizer
I0118 04:51:48.334833 25425 provisioner.cpp:251] Provisioner recovery complete
I0118 04:51:48.335086 25425 slave.cpp:5417] Finished recovery
I0118 04:51:48.335536 25425 slave.cpp:5591] Querying resource estimator for oversubscribable
resources
I0118 04:51:48.335711 25421 slave.cpp:5605] Received oversubscribable resources {} from the
resource estimator
I0118 04:51:48.336530 25426 process.cpp:3676] Handling HTTP event for process 'slave(679)'
with path: '/slave(679)/containers'
I0118 04:51:48.336988 25431 http.cpp:874] Authorizing principal 'test-principal' to GET the
'/containers' endpoint
I0118 04:51:48.338763 25429 slave.cpp:796] Agent terminating
[       OK ] Endpoint/SlaveEndpointTest.NoAuthorizer/2 (16 ms)
[----------] 9 tests from Endpoint/SlaveEndpointTest (121 ms total)

[----------] Global test environment tear-down
[==========] 1397 tests from 156 test cases ran. (172638 ms total)
[  PASSED  ] 1396 tests.
[  FAILED  ] 1 test, listed below:
[  FAILED  ] SlaveRecoveryTest/0.RecoverTerminatedExecutor, where TypeParam = mesos::internal::slave::MesosContainerizer

 1 FAILED TEST
  YOU HAVE 14 DISABLED TESTS

make[3]: *** [CMakeFiles/check] Error 1
make[3]: Leaving directory `/mesos/build'
make[2]: *** [CMakeFiles/check.dir/all] Error 2
make[2]: Leaving directory `/mesos/build'
make[1]: *** [CMakeFiles/check.dir/rule] Error 2
make[1]: Leaving directory `/mesos/build'
make: *** [check] Error 2
+ docker rmi mesos-1484712302-742
Untagged: mesos-1484712302-742:latest
Deleted: sha256:e8df85658642386b8c6fedc1702edc0b17787df1b4b4845639056b36dfb906fb
Deleted: sha256:211121dd8216237a84d9fbbe3031538de464ed2dd80e49de66ef179b9ed05018
Deleted: sha256:8ed82bd555ef241ada6e8599ea965f4ede236932dd5bae5c51bdb5d45b9b4fed
Deleted: sha256:a41f4cb2d03d93db34aef1c700f5ba311a50cfd6b79ad86234bf21db18b2b767
Deleted: sha256:b6fc278481d405eddfb59a1a6124c82b0044913aad744c45918551dd2df78a1b
Deleted: sha256:2dd0f4598f94ac9472c436db11cb3b5f6b863d4401f721e7e8fef1d9bdf87b7e
Deleted: sha256:977501003f6cc47912bd511294bccf2887941f3cf80d66da9c7c3586b423ff5e
Deleted: sha256:c2784f1a9f712d862e53997378938f2ed0347a61621cd7bf61693a1a650bb8b5
Deleted: sha256:be1397fac455f0033479b81a63723256bcc8aa29955e27f3812b1fa92b89ce4f
Deleted: sha256:e572120bf51e0a2842e7d970421f0e42f6d1ecefa97fc7a5b33484df3059443c
Deleted: sha256:12167f920be18f4cfa5c2a2248066b84fd867f7a529e8c7abec0cb2fd091d952
Deleted: sha256:9938ea57f686766b61b60106ce4c07e628c646277ed752bcba70c9a099ea214e
Deleted: sha256:efdc4da8cbe419b4e54f058d6c53bff5bfc388a1aacecb46207d65564d4417f3
Deleted: sha256:d1a5fa94a5a3faada876ebf239868d3c3f31add6bfe022e0c64c6e3e148f0e57
Deleted: sha256:1fcdf6f0167aeb65f9bd9337961ab9f1775c391ebd3a858e33b488dfeda40a1b
Deleted: sha256:1e2d3acbfd4b4d7041036223014dba352a67c636b586835109747260671235db
Deleted: sha256:f649e22ea7cce36627cfffa162b951fa887a86c0ac7932522d07f929545be545
Deleted: sha256:5cc2723bb9ffc487fc98fe3f05672a3e7b9b799c29240fd8e323263c201443ea
Deleted: sha256:63e58d6148f2c9e65ed0f383d323f8cbf6b8f56bc5024ac141a53ebbad4f8a62
Deleted: sha256:17fa4334c011b49f76afaba2f552c882647dd80aee72d53ffc90289f8db8b393
Deleted: sha256:758cfd8ff8ddbe36c45f4fa6cef1127b0d1380dc45b438db1c6ea568de436f08
Deleted: sha256:f7b2041ae2caef7d8e64e24f0e0a99adb0f623561872d99e063ee7f8abc3bf40
Deleted: sha256:5bc7d24a3ecc4b58705b6dca1d30cb82243db0f267c8fd29131e0c155b976f1a
Deleted: sha256:062e13c78c7d9d2fb669bc447d8a7d641191dea842689f5860aa6223b1240361
Deleted: sha256:611a58a79fcfc0115bf7c3a9e6c915b3291b42eddbf0c1f8b81221adbc23febf
Build step 'Execute shell' marked build as failure

Mime
View raw message