mesos-builds mailing list archives

Site index · List index
Message view « Date » · « Thread »
Top « Date » · « Thread »
From Apache Jenkins Server <jenk...@builds.apache.org>
Subject Build failed in Jenkins: Mesos-Reviewbot #16898
Date Sun, 29 Jan 2017 07:48:44 GMT
See <https://builds.apache.org/job/Mesos-Reviewbot/16898/>

------------------------------------------
[...truncated 69793 lines...]
I0129 07:48:38.806277 30197 exec.cpp:391] Executor received framework message
I0129 07:48:38.806390 30197 exec.cpp:400] Executor::frameworkMessage took 81341ns
I0129 07:48:38.806754 30201 slave.cpp:3045] Status update manager successfully handled status
update acknowledgement (UUID: 16f7f817-f013-4dfb-abd4-d0bf802feb32) for task 1 of framework
e500ade6-e322-42b9-8cb7-c27ba56e6a95-0000
I0129 07:48:38.807142 30191 slave.cpp:4264] Sending message for framework e500ade6-e322-42b9-8cb7-c27ba56e6a95-0000
to scheduler-1c3ffe61-b324-4f67-8649-5bbcbca5d933@172.17.0.2:42346
I0129 07:48:38.807421 30192 sched.cpp:1177] Scheduler::frameworkMessage took 77399ns
I0129 07:48:38.807898 30172 sched.cpp:2021] Asked to stop the driver
I0129 07:48:38.808009 30201 sched.cpp:1203] Stopping framework e500ade6-e322-42b9-8cb7-c27ba56e6a95-0000
I0129 07:48:38.808296 30193 master.cpp:7560] Processing TEARDOWN call for framework e500ade6-e322-42b9-8cb7-c27ba56e6a95-0000
(default) at scheduler-1c3ffe61-b324-4f67-8649-5bbcbca5d933@172.17.0.2:42346
I0129 07:48:38.808346 30193 master.cpp:7572] Removing framework e500ade6-e322-42b9-8cb7-c27ba56e6a95-0000
(default) at scheduler-1c3ffe61-b324-4f67-8649-5bbcbca5d933@172.17.0.2:42346
I0129 07:48:38.808385 30193 master.cpp:3080] Deactivating framework e500ade6-e322-42b9-8cb7-c27ba56e6a95-0000
(default) at scheduler-1c3ffe61-b324-4f67-8649-5bbcbca5d933@172.17.0.2:42346
I0129 07:48:38.809010 30199 hierarchical.cpp:386] Deactivated framework e500ade6-e322-42b9-8cb7-c27ba56e6a95-0000
I0129 07:48:38.809098 30192 slave.cpp:2598] Asked to shut down framework e500ade6-e322-42b9-8cb7-c27ba56e6a95-0000
by master@172.17.0.2:42346
I0129 07:48:38.809120 30193 master.cpp:8155] Updating the state of task 1 of framework e500ade6-e322-42b9-8cb7-c27ba56e6a95-0000
(latest state: TASK_KILLED, status update state: TASK_KILLED)
I0129 07:48:38.809151 30192 slave.cpp:2623] Shutting down framework e500ade6-e322-42b9-8cb7-c27ba56e6a95-0000
I0129 07:48:38.809218 30192 slave.cpp:5005] Shutting down executor 'default' of framework
e500ade6-e322-42b9-8cb7-c27ba56e6a95-0000 at executor(74)@172.17.0.2:42346
I0129 07:48:38.809397 30192 exec.cpp:410] Executor asked to shutdown
I0129 07:48:38.809451 30192 exec.cpp:425] Executor::shutdown took 22941ns
I0129 07:48:38.809914 30201 slave.cpp:4328] Got exited event for executor(74)@172.17.0.2:42346
I0129 07:48:38.810520 30193 master.cpp:8249] Removing task 1 with resources cpus(*):2; mem(*):1024;
disk(*):1024; ports(*):[31000-32000] of framework e500ade6-e322-42b9-8cb7-c27ba56e6a95-0000
on agent e500ade6-e322-42b9-8cb7-c27ba56e6a95-S0 at slave(178)@172.17.0.2:42346 (0130dacea2b1)
I0129 07:48:38.810750 30199 slave.cpp:4691] Executor 'default' of framework e500ade6-e322-42b9-8cb7-c27ba56e6a95-0000
exited with status 0
I0129 07:48:38.810854 30199 slave.cpp:4791] Cleaning up executor 'default' of framework e500ade6-e322-42b9-8cb7-c27ba56e6a95-0000
at executor(74)@172.17.0.2:42346
I0129 07:48:38.810870 30196 hierarchical.cpp:1011] Recovered cpus(*):2; mem(*):1024; disk(*):1024;
ports(*):[31000-32000] (total: cpus(*):2; mem(*):1024; disk(*):1024; ports(*):[31000-32000],
allocated: {}) on agent e500ade6-e322-42b9-8cb7-c27ba56e6a95-S0 from framework e500ade6-e322-42b9-8cb7-c27ba56e6a95-0000
I0129 07:48:38.811028 30193 master.cpp:8278] Removing executor 'default' with resources {}
of framework e500ade6-e322-42b9-8cb7-c27ba56e6a95-0000 on agent e500ade6-e322-42b9-8cb7-c27ba56e6a95-S0
at slave(178)@172.17.0.2:42346 (0130dacea2b1)
I0129 07:48:38.811246 30192 gc.cpp:55] Scheduling '/tmp/MasterTest_FrameworkMessage_cEAWz5/slaves/e500ade6-e322-42b9-8cb7-c27ba56e6a95-S0/frameworks/e500ade6-e322-42b9-8cb7-c27ba56e6a95-0000/executors/default/runs/779f138c-2d63-4c5c-a08d-890ceaa44a6b'
for gc 6.99999061254815days in the future
I0129 07:48:38.811679 30199 slave.cpp:4879] Cleaning up framework e500ade6-e322-42b9-8cb7-c27ba56e6a95-0000
I0129 07:48:38.811702 30195 gc.cpp:55] Scheduling '/tmp/MasterTest_FrameworkMessage_cEAWz5/slaves/e500ade6-e322-42b9-8cb7-c27ba56e6a95-S0/frameworks/e500ade6-e322-42b9-8cb7-c27ba56e6a95-0000/executors/default'
for gc 6.99999060984889days in the future
I0129 07:48:38.812021 30195 status_update_manager.cpp:285] Closing status update streams for
framework e500ade6-e322-42b9-8cb7-c27ba56e6a95-0000
W0129 07:48:38.812062 30193 master.cpp:6145] Ignoring unknown exited executor 'default' of
framework e500ade6-e322-42b9-8cb7-c27ba56e6a95-0000 on agent e500ade6-e322-42b9-8cb7-c27ba56e6a95-S0
at slave(178)@172.17.0.2:42346 (0130dacea2b1)
I0129 07:48:38.812111 30195 status_update_manager.cpp:531] Cleaning up status update stream
for task 1 of framework e500ade6-e322-42b9-8cb7-c27ba56e6a95-0000
I0129 07:48:38.812170 30206 hierarchical.cpp:337] Removed framework e500ade6-e322-42b9-8cb7-c27ba56e6a95-0000
I0129 07:48:38.812234 30200 gc.cpp:55] Scheduling '/tmp/MasterTest_FrameworkMessage_cEAWz5/slaves/e500ade6-e322-42b9-8cb7-c27ba56e6a95-S0/frameworks/e500ade6-e322-42b9-8cb7-c27ba56e6a95-0000'
for gc 6.99999060197926days in the future
I0129 07:48:38.812598 30194 slave.cpp:801] Agent terminating
I0129 07:48:38.812832 30201 master.cpp:1263] Agent e500ade6-e322-42b9-8cb7-c27ba56e6a95-S0
at slave(178)@172.17.0.2:42346 (0130dacea2b1) disconnected
I0129 07:48:38.812871 30201 master.cpp:3117] Disconnecting agent e500ade6-e322-42b9-8cb7-c27ba56e6a95-S0
at slave(178)@172.17.0.2:42346 (0130dacea2b1)
I0129 07:48:38.812964 30201 master.cpp:3136] Deactivating agent e500ade6-e322-42b9-8cb7-c27ba56e6a95-S0
at slave(178)@172.17.0.2:42346 (0130dacea2b1)
I0129 07:48:38.813313 30206 hierarchical.cpp:577] Agent e500ade6-e322-42b9-8cb7-c27ba56e6a95-S0
deactivated
I0129 07:48:38.816144 30196 master.cpp:1102] Master terminating
I0129 07:48:38.817026 30201 hierarchical.cpp:510] Removed agent e500ade6-e322-42b9-8cb7-c27ba56e6a95-S0
[       OK ] MasterTest.FrameworkMessage (88 ms)
[ RUN      ] MasterTest.MultipleExecutors
I0129 07:48:38.824786 30172 cluster.cpp:160] Creating default 'local' authorizer
I0129 07:48:38.828819 30192 master.cpp:383] Master ad72d6c3-faf2-487c-85ee-2e05f102693d (0130dacea2b1)
started on 172.17.0.2:42346
I0129 07:48:38.828862 30192 master.cpp:385] Flags at startup: --acls="" --agent_ping_timeout="15secs"
--agent_reregister_timeout="10mins" --allocation_interval="1secs" --allocator="HierarchicalDRF"
--authenticate_agents="true" --authenticate_frameworks="true" --authenticate_http_frameworks="true"
--authenticate_http_readonly="true" --authenticate_http_readwrite="true" --authenticators="crammd5"
--authorizers="local" --credentials="/tmp/Outb1c/credentials" --framework_sorter="drf" --help="false"
--hostname_lookup="true" --http_authenticators="basic" --http_framework_authenticators="basic"
--initialize_driver_logging="true" --log_auto_initialize="true" --logbufsecs="0" --logging_level="INFO"
--max_agent_ping_timeouts="5" --max_completed_frameworks="50" --max_completed_tasks_per_framework="1000"
--max_unreachable_tasks_per_framework="1000" --quiet="false" --recovery_agent_removal_limit="100%"
--registry="in_memory" --registry_fetch_timeout="1mins" --registry_gc_interval="15mins" --registry_max_agent_age="2weeks"
--registry_max_agent_count="102400" --registry_store_timeout="100secs" --registry_strict="false"
--root_submissions="true" --user_sorter="drf" --version="false" --webui_dir="/mesos/mesos-1.2.0/_inst/share/mesos/webui"
--work_dir="/tmp/Outb1c/master" --zk_session_timeout="10secs"
I0129 07:48:38.829530 30192 master.cpp:435] Master only allowing authenticated frameworks
to register
I0129 07:48:38.829553 30192 master.cpp:449] Master only allowing authenticated agents to register
I0129 07:48:38.829574 30192 master.cpp:462] Master only allowing authenticated HTTP frameworks
to register
I0129 07:48:38.829597 30192 credentials.hpp:37] Loading credentials for authentication from
'/tmp/Outb1c/credentials'
I0129 07:48:38.830035 30192 master.cpp:507] Using default 'crammd5' authenticator
I0129 07:48:38.830229 30192 http.cpp:922] Using default 'basic' HTTP authenticator for realm
'mesos-master-readonly'
I0129 07:48:38.830526 30192 http.cpp:922] Using default 'basic' HTTP authenticator for realm
'mesos-master-readwrite'
I0129 07:48:38.830756 30192 http.cpp:922] Using default 'basic' HTTP authenticator for realm
'mesos-master-scheduler'
I0129 07:48:38.830997 30192 master.cpp:587] Authorization enabled
I0129 07:48:38.831244 30201 whitelist_watcher.cpp:77] No whitelist given
I0129 07:48:38.831292 30199 hierarchical.cpp:151] Initialized hierarchical allocator process
I0129 07:48:38.834293 30191 master.cpp:2123] Elected as the leading master!
I0129 07:48:38.834338 30191 master.cpp:1645] Recovering from registrar
I0129 07:48:38.834513 30206 registrar.cpp:329] Recovering registrar
I0129 07:48:38.835485 30206 registrar.cpp:362] Successfully fetched the registry (0B) in 911872ns
I0129 07:48:38.835609 30206 registrar.cpp:461] Applied 1 operations in 26370ns; attempting
to update the registry
I0129 07:48:38.836788 30206 registrar.cpp:506] Successfully updated the registry in 1.105152ms
I0129 07:48:38.836956 30206 registrar.cpp:392] Successfully recovered registrar
I0129 07:48:38.837663 30196 master.cpp:1761] Recovered 0 agents from the registry (129B);
allowing 10mins for agents to re-register
I0129 07:48:38.837710 30205 hierarchical.cpp:178] Skipping recovery of hierarchical allocator:
nothing to recover
I0129 07:48:38.843677 30172 cluster.cpp:446] Creating default 'local' authorizer
I0129 07:48:38.845715 30200 slave.cpp:209] Mesos agent started on (179)@172.17.0.2:42346
I0129 07:48:38.845746 30200 slave.cpp:210] Flags at startup: --acls="" --appc_simple_discovery_uri_prefix="http://"
--appc_store_dir="/tmp/mesos/store/appc" --authenticate_http_readonly="true" --authenticate_http_readwrite="true"
--authenticatee="crammd5" --authentication_backoff_factor="1secs" --authorizer="local" --cgroups_cpu_enable_pids_and_tids_count="false"
--cgroups_enable_cfs="false" --cgroups_hierarchy="/sys/fs/cgroup" --cgroups_limit_swap="false"
--cgroups_root="mesos" --container_disk_watch_interval="15secs" --containerizers="mesos" --credential="/tmp/MasterTest_MultipleExecutors_mg1F3L/credential"
--default_role="*" --disk_watch_interval="1mins" --docker="docker" --docker_kill_orphans="true"
--docker_registry="https://registry-1.docker.io" --docker_remove_delay="6hrs" --docker_socket="/var/run/docker.sock"
--docker_stop_timeout="0ns" --docker_store_dir="/tmp/mesos/store/docker" --docker_volume_checkpoint_dir="/var/run/mesos/isolators/docker/volume"
--enforce_container_disk_quota="false" --executor_registration_timeout="1mins" --executor_shutdown_grace_period="5secs"
--fetcher_cache_dir="/tmp/MasterTest_MultipleExecutors_mg1F3L/fetch" --fetcher_cache_size="2GB"
--frameworks_home="" --gc_delay="1weeks" --gc_disk_headroom="0.1" --hadoop_home="" --help="false"
--hostname_lookup="true" --http_authenticators="basic" --http_command_executor="false" --http_credentials="/tmp/MasterTest_MultipleExecutors_mg1F3L/http_credentials"
--http_heartbeat_interval="30secs" --image_provisioner_backend="copy" --initialize_driver_logging="true"
--isolation="posix/cpu,posix/mem" --launcher="posix" --launcher_dir="/mesos/mesos-1.2.0/_build/src"
--logbufsecs="0" --logging_level="INFO" --max_completed_executors_per_framework="150" --oversubscribed_resources_interval="15secs"
--perf_duration="10secs" --perf_interval="1mins" --qos_correction_interval_min="0ns" --quiet="false"
--recover="reconnect" --recovery_timeout="15mins" --registration_backoff_factor="10ms" --resources="cpus:2;gpus:0;mem:1024;disk:1024;ports:[31000-32000]"
--revocable_cpu_low_priority="true" --runtime_dir="/tmp/MasterTest_MultipleExecutors_mg1F3L"
--sandbox_directory="/mnt/mesos/sandbox" --strict="true" --switch_user="true" --systemd_enable_support="true"
--systemd_runtime_directory="/run/systemd/system" --version="false" --work_dir="/tmp/MasterTest_MultipleExecutors_8w2pxu"
I0129 07:48:38.846561 30200 credentials.hpp:86] Loading credential for authentication from
'/tmp/MasterTest_MultipleExecutors_mg1F3L/credential'
I0129 07:48:38.846786 30200 slave.cpp:352] Agent using credential for: test-principal
I0129 07:48:38.846823 30200 credentials.hpp:37] Loading credentials for authentication from
'/tmp/MasterTest_MultipleExecutors_mg1F3L/http_credentials'
I0129 07:48:38.847262 30200 http.cpp:922] Using default 'basic' HTTP authenticator for realm
'mesos-agent-readonly'
I0129 07:48:38.847340 30172 sched.cpp:232] Version: 1.2.0
I0129 07:48:38.847460 30200 http.cpp:922] Using default 'basic' HTTP authenticator for realm
'mesos-agent-readwrite'
I0129 07:48:38.848289 30192 sched.cpp:336] New master detected at master@172.17.0.2:42346
I0129 07:48:38.848415 30192 sched.cpp:407] Authenticating with master master@172.17.0.2:42346
I0129 07:48:38.848450 30192 sched.cpp:414] Using default CRAM-MD5 authenticatee
I0129 07:48:38.848809 30202 authenticatee.cpp:121] Creating new client SASL connection
I0129 07:48:38.849071 30192 master.cpp:7018] Authenticating scheduler-9ffb63a6-06cf-4a8a-b961-47fbcb5d197d@172.17.0.2:42346
I0129 07:48:38.849234 30204 authenticator.cpp:414] Starting authentication session for crammd5-authenticatee(412)@172.17.0.2:42346
I0129 07:48:38.849424 30200 slave.cpp:539] Agent resources: cpus(*):2; mem(*):1024; disk(*):1024;
ports(*):[31000-32000]
I0129 07:48:38.849511 30196 authenticator.cpp:98] Creating new server SASL connection
I0129 07:48:38.849511 30200 slave.cpp:547] Agent attributes: [  ]
I0129 07:48:38.849576 30200 slave.cpp:552] Agent hostname: 0130dacea2b1
I0129 07:48:38.849733 30205 authenticatee.cpp:213] Received SASL authentication mechanisms:
CRAM-MD5
I0129 07:48:38.849870 30205 authenticatee.cpp:239] Attempting to authenticate with mechanism
'CRAM-MD5'
I0129 07:48:38.849747 30202 status_update_manager.cpp:177] Pausing sending status updates
I0129 07:48:38.850028 30205 authenticator.cpp:204] Received SASL authentication start
I0129 07:48:38.850096 30205 authenticator.cpp:326] Authentication requires more steps
I0129 07:48:38.850190 30205 authenticatee.cpp:259] Received SASL authentication step
I0129 07:48:38.850322 30206 authenticator.cpp:232] Received SASL authentication step
I0129 07:48:38.850399 30206 auxprop.cpp:109] Request to lookup properties for user: 'test-principal'
realm: '0130dacea2b1' server FQDN: '0130dacea2b1' SASL_AUXPROP_VERIFY_AGAINST_HASH: false
SASL_AUXPROP_OVERRIDE: false SASL_AUXPROP_AUTHZID: false 
I0129 07:48:38.850442 30206 auxprop.cpp:181] Looking up auxiliary property '*userPassword'
I0129 07:48:38.850514 30206 auxprop.cpp:181] Looking up auxiliary property '*cmusaslsecretCRAM-MD5'
I0129 07:48:38.850558 30206 auxprop.cpp:109] Request to lookup properties for user: 'test-principal'
realm: '0130dacea2b1' server FQDN: '0130dacea2b1' SASL_AUXPROP_VERIFY_AGAINST_HASH: false
SASL_AUXPROP_OVERRIDE: false SASL_AUXPROP_AUTHZID: true 
I0129 07:48:38.850595 30206 auxprop.cpp:131] Skipping auxiliary property '*userPassword' since
SASL_AUXPROP_AUTHZID == true
I0129 07:48:38.850616 30206 auxprop.cpp:131] Skipping auxiliary property '*cmusaslsecretCRAM-MD5'
since SASL_AUXPROP_AUTHZID == true
I0129 07:48:38.850644 30206 authenticator.cpp:318] Authentication success
I0129 07:48:38.850751 30195 authenticatee.cpp:299] Authentication success
I0129 07:48:38.850828 30199 master.cpp:7048] Successfully authenticated principal 'test-principal'
at scheduler-9ffb63a6-06cf-4a8a-b961-47fbcb5d197d@172.17.0.2:42346
I0129 07:48:38.850937 30191 authenticator.cpp:432] Authentication session cleanup for crammd5-authenticatee(412)@172.17.0.2:42346
I0129 07:48:38.851122 30193 sched.cpp:513] Successfully authenticated with master master@172.17.0.2:42346
I0129 07:48:38.851150 30193 sched.cpp:836] Sending SUBSCRIBE call to master@172.17.0.2:42346
I0129 07:48:38.851343 30193 sched.cpp:869] Will retry registration in 781.899943ms if necessary
I0129 07:48:38.851546 30205 master.cpp:2736] Received SUBSCRIBE call for framework 'default'
at scheduler-9ffb63a6-06cf-4a8a-b961-47fbcb5d197d@172.17.0.2:42346
I0129 07:48:38.851613 30198 state.cpp:60] Recovering state from '/tmp/MasterTest_MultipleExecutors_8w2pxu/meta'
I0129 07:48:38.851672 30205 master.cpp:2159] Authorizing framework principal 'test-principal'
to receive offers for role '*'
I0129 07:48:38.852051 30197 status_update_manager.cpp:203] Recovering status update manager
I0129 07:48:38.852252 30191 master.cpp:2812] Subscribing framework default with checkpointing
disabled and capabilities [  ]
I0129 07:48:38.852962 30191 sched.cpp:759] Framework registered with ad72d6c3-faf2-487c-85ee-2e05f102693d-0000
I0129 07:48:38.853058 30191 sched.cpp:773] Scheduler::registered took 55254ns
I0129 07:48:38.853109 30193 hierarchical.cpp:271] Added framework ad72d6c3-faf2-487c-85ee-2e05f102693d-0000
I0129 07:48:38.853200 30193 hierarchical.cpp:1675] No allocations performed
I0129 07:48:38.853236 30193 hierarchical.cpp:1770] No inverse offers to send out!
I0129 07:48:38.853296 30193 hierarchical.cpp:1279] Performed allocation for 0 agents in 152614ns
I0129 07:48:38.853438 30205 slave.cpp:5422] Finished recovery
I0129 07:48:38.854166 30205 slave.cpp:5596] Querying resource estimator for oversubscribable
resources
I0129 07:48:38.854504 30193 slave.cpp:929] New master detected at master@172.17.0.2:42346
I0129 07:48:38.854683 30193 slave.cpp:964] Detecting new master
I0129 07:48:38.854892 30193 slave.cpp:5610] Received oversubscribable resources {} from the
resource estimator
I0129 07:48:38.854918 30199 status_update_manager.cpp:177] Pausing sending status updates
I0129 07:48:38.864034 30202 slave.cpp:991] Authenticating with master master@172.17.0.2:42346
I0129 07:48:38.864135 30202 slave.cpp:1002] Using default CRAM-MD5 authenticatee
I0129 07:48:38.864508 30195 authenticatee.cpp:121] Creating new client SASL connection
I0129 07:48:38.864974 30200 master.cpp:7018] Authenticating slave(179)@172.17.0.2:42346
I0129 07:48:38.865166 30203 authenticator.cpp:414] Starting authentication session for crammd5-authenticatee(413)@172.17.0.2:42346
I0129 07:48:38.865442 30205 authenticator.cpp:98] Creating new server SASL connection
I0129 07:48:38.865726 30202 authenticatee.cpp:213] Received SASL authentication mechanisms:
CRAM-MD5
I0129 07:48:38.865764 30202 authenticatee.cpp:239] Attempting to authenticate with mechanism
'CRAM-MD5'
I0129 07:48:38.865860 30202 authenticator.cpp:204] Received SASL authentication start
I0129 07:48:38.865926 30202 authenticator.cpp:326] Authentication requires more steps
I0129 07:48:38.866031 30204 authenticatee.cpp:259] Received SASL authentication step
I0129 07:48:38.866128 30204 authenticator.cpp:232] Received SASL authentication step
I0129 07:48:38.866161 30204 auxprop.cpp:109] Request to lookup properties for user: 'test-principal'
realm: '0130dacea2b1' server FQDN: '0130dacea2b1' SASL_AUXPROP_VERIFY_AGAINST_HASH: false
SASL_AUXPROP_OVERRIDE: false SASL_AUXPROP_AUTHZID: false 
I0129 07:48:38.866188 30204 auxprop.cpp:181] Looking up auxiliary property '*userPassword'
I0129 07:48:38.866224 30204 auxprop.cpp:181] Looking up auxiliary property '*cmusaslsecretCRAM-MD5'
I0129 07:48:38.866252 30204 auxprop.cpp:109] Request to lookup properties for user: 'test-principal'
realm: '0130dacea2b1' server FQDN: '0130dacea2b1' SASL_AUXPROP_VERIFY_AGAINST_HASH: false
SASL_AUXPROP_OVERRIDE: false SASL_AUXPROP_AUTHZID: true 
I0129 07:48:38.866269 30204 auxprop.cpp:131] Skipping auxiliary property '*userPassword' since
SASL_AUXPROP_AUTHZID == true
I0129 07:48:38.866279 30204 auxprop.cpp:131] Skipping auxiliary property '*cmusaslsecretCRAM-MD5'
since SASL_AUXPROP_AUTHZID == true
I0129 07:48:38.866297 30204 authenticator.cpp:318] Authentication success
I0129 07:48:38.866415 30202 authenticatee.cpp:299] Authentication success
I0129 07:48:38.866443 30199 master.cpp:7048] Successfully authenticated principal 'test-principal'
at slave(179)@172.17.0.2:42346
I0129 07:48:38.866504 30198 authenticator.cpp:432] Authentication session cleanup for crammd5-authenticatee(413)@172.17.0.2:42346
I0129 07:48:38.866972 30199 slave.cpp:1086] Successfully authenticated with master master@172.17.0.2:42346
I0129 07:48:38.867147 30199 slave.cpp:1508] Will retry registration in 7.708824ms if necessary
I0129 07:48:38.867357 30198 master.cpp:5303] Registering agent at slave(179)@172.17.0.2:42346
(0130dacea2b1) with id ad72d6c3-faf2-487c-85ee-2e05f102693d-S0
I0129 07:48:38.867856 30196 registrar.cpp:461] Applied 1 operations in 66726ns; attempting
to update the registry
I0129 07:48:38.869433 30196 registrar.cpp:506] Successfully updated the registry in 1.501184ms
I0129 07:48:38.870223 30203 slave.cpp:4286] Received ping from slave-observer(178)@172.17.0.2:42346
I0129 07:48:38.870426 30201 slave.cpp:1132] Registered with master master@172.17.0.2:42346;
given agent ID ad72d6c3-faf2-487c-85ee-2e05f102693d-S0
I0129 07:48:38.870362 30205 master.cpp:5377] Registered agent ad72d6c3-faf2-487c-85ee-2e05f102693d-S0
at slave(179)@172.17.0.2:42346 (0130dacea2b1) with cpus(*):2; mem(*):1024; disk(*):1024; ports(*):[31000-32000]
I0129 07:48:38.870455 30201 fetcher.cpp:90] Clearing fetcher cache
I0129 07:48:38.870642 30196 hierarchical.cpp:478] Added agent ad72d6c3-faf2-487c-85ee-2e05f102693d-S0
(0130dacea2b1) with cpus(*):2; mem(*):1024; disk(*):1024; ports(*):[31000-32000] (allocated:
{})
I0129 07:48:38.870695 30191 status_update_manager.cpp:184] Resuming sending status updates
I0129 07:48:38.870929 30201 slave.cpp:1160] Checkpointing SlaveInfo to '/tmp/MasterTest_MultipleExecutors_8w2pxu/meta/slaves/ad72d6c3-faf2-487c-85ee-2e05f102693d-S0/slave.info'
I0129 07:48:38.871268 30201 slave.cpp:1198] Forwarding total oversubscribed resources {}
I0129 07:48:38.871471 30201 master.cpp:5876] Received update of agent ad72d6c3-faf2-487c-85ee-2e05f102693d-S0
at slave(179)@172.17.0.2:42346 (0130dacea2b1) with total oversubscribed resources {}
I0129 07:48:38.871683 30196 hierarchical.cpp:1770] No inverse offers to send out!
I0129 07:48:38.871814 30196 hierarchical.cpp:1302] Performed allocation for agent ad72d6c3-faf2-487c-85ee-2e05f102693d-S0
in 1.130711ms
I0129 07:48:38.871938 30196 hierarchical.cpp:548] Agent ad72d6c3-faf2-487c-85ee-2e05f102693d-S0
(0130dacea2b1) updated with oversubscribed resources {} (total: cpus(*):2; mem(*):1024; disk(*):1024;
ports(*):[31000-32000], allocated: cpus(*):2; mem(*):1024; disk(*):1024; ports(*):[31000-32000])
I0129 07:48:38.872048 30196 hierarchical.cpp:1675] No allocations performed
I0129 07:48:38.872081 30196 hierarchical.cpp:1770] No inverse offers to send out!
I0129 07:48:38.872129 30196 hierarchical.cpp:1302] Performed allocation for agent ad72d6c3-faf2-487c-85ee-2e05f102693d-S0
in 152350ns
I0129 07:48:38.872248 30194 master.cpp:6847] Sending 1 offers to framework ad72d6c3-faf2-487c-85ee-2e05f102693d-0000
(default) at scheduler-9ffb63a6-06cf-4a8a-b961-47fbcb5d197d@172.17.0.2:42346
I0129 07:48:38.872803 30193 sched.cpp:933] Scheduler::resourceOffers took 109974ns
I0129 07:48:38.875000 30192 master.cpp:3730] Processing ACCEPT call for offers: [ ad72d6c3-faf2-487c-85ee-2e05f102693d-O0
] on agent ad72d6c3-faf2-487c-85ee-2e05f102693d-S0 at slave(179)@172.17.0.2:42346 (0130dacea2b1)
for framework ad72d6c3-faf2-487c-85ee-2e05f102693d-0000 (default) at scheduler-9ffb63a6-06cf-4a8a-b961-47fbcb5d197d@172.17.0.2:42346
I0129 07:48:38.875113 30192 master.cpp:3318] Authorizing framework principal 'test-principal'
to launch task 1
I0129 07:48:38.875470 30192 master.cpp:3318] Authorizing framework principal 'test-principal'
to launch task 2
W0129 07:48:38.877426 30199 validation.cpp:1018] Executor 'executor-1' for task '1' uses less
CPUs (None) than the minimum required (0.01). Please update your executor, as this will be
mandatory in future releases.
W0129 07:48:38.877460 30199 validation.cpp:1030] Executor 'executor-1' for task '1' uses less
memory (None) than the minimum required (32MB). Please update your executor, as this will
be mandatory in future releases.
I0129 07:48:38.877810 30199 master.cpp:8900] Adding task 1 with resources cpus(*):1; mem(*):512
on agent ad72d6c3-faf2-487c-85ee-2e05f102693d-S0 at slave(179)@172.17.0.2:42346 (0130dacea2b1)
I0129 07:48:38.877948 30199 master.cpp:4380] Launching task 1 of framework ad72d6c3-faf2-487c-85ee-2e05f102693d-0000
(default) at scheduler-9ffb63a6-06cf-4a8a-b961-47fbcb5d197d@172.17.0.2:42346 with resources
cpus(*):1; mem(*):512 on agent ad72d6c3-faf2-487c-85ee-2e05f102693d-S0 at slave(179)@172.17.0.2:42346
(0130dacea2b1)
I0129 07:48:38.878321 30193 slave.cpp:1576] Got assigned task '1' for framework ad72d6c3-faf2-487c-85ee-2e05f102693d-0000
W0129 07:48:38.879030 30199 validation.cpp:1018] Executor 'executor-2' for task '2' uses less
CPUs (None) than the minimum required (0.01). Please update your executor, as this will be
mandatory in future releases.
W0129 07:48:38.879060 30199 validation.cpp:1030] Executor 'executor-2' for task '2' uses less
memory (None) than the minimum required (32MB). Please update your executor, as this will
be mandatory in future releases.
I0129 07:48:38.879144 30193 slave.cpp:1736] Launching task '1' for framework ad72d6c3-faf2-487c-85ee-2e05f102693d-0000
I0129 07:48:38.879384 30199 master.cpp:8900] Adding task 2 with resources cpus(*):1; mem(*):512
on agent ad72d6c3-faf2-487c-85ee-2e05f102693d-S0 at slave(179)@172.17.0.2:42346 (0130dacea2b1)
I0129 07:48:38.879550 30199 master.cpp:4380] Launching task 2 of framework ad72d6c3-faf2-487c-85ee-2e05f102693d-0000
(default) at scheduler-9ffb63a6-06cf-4a8a-b961-47fbcb5d197d@172.17.0.2:42346 with resources
cpus(*):1; mem(*):512 on agent ad72d6c3-faf2-487c-85ee-2e05f102693d-S0 at slave(179)@172.17.0.2:42346
(0130dacea2b1)
I0129 07:48:38.879982 30193 paths.cpp:547] Trying to chown '/tmp/MasterTest_MultipleExecutors_8w2pxu/slaves/ad72d6c3-faf2-487c-85ee-2e05f102693d-S0/frameworks/ad72d6c3-faf2-487c-85ee-2e05f102693d-0000/executors/executor-1/runs/8e894a29-8fad-42fc-8b69-e6163b6402a2'
to user 'mesos'
I0129 07:48:38.880358 30193 slave.cpp:6331] Launching executor 'executor-1' of framework ad72d6c3-faf2-487c-85ee-2e05f102693d-0000
with resources {} in work directory '/tmp/MasterTest_MultipleExecutors_8w2pxu/slaves/ad72d6c3-faf2-487c-85ee-2e05f102693d-S0/frameworks/ad72d6c3-faf2-487c-85ee-2e05f102693d-0000/executors/executor-1/runs/8e894a29-8fad-42fc-8b69-e6163b6402a2'
I0129 07:48:38.881213 30193 slave.cpp:2058] Queued task '1' for executor 'executor-1' of framework
ad72d6c3-faf2-487c-85ee-2e05f102693d-0000
I0129 07:48:38.881295 30204 hierarchical.cpp:1011] Recovered ports(*):[31000-32000]; disk(*):1024
(total: cpus(*):2; mem(*):1024; disk(*):1024; ports(*):[31000-32000], allocated: cpus(*):2;
mem(*):1024) on agent ad72d6c3-faf2-487c-85ee-2e05f102693d-S0 from framework ad72d6c3-faf2-487c-85ee-2e05f102693d-0000
I0129 07:48:38.881371 30204 hierarchical.cpp:1048] Framework ad72d6c3-faf2-487c-85ee-2e05f102693d-0000
filtered agent ad72d6c3-faf2-487c-85ee-2e05f102693d-S0 for 5secs
I0129 07:48:38.881449 30193 slave.cpp:1576] Got assigned task '2' for framework ad72d6c3-faf2-487c-85ee-2e05f102693d-0000
I0129 07:48:38.882220 30193 slave.cpp:882] Successfully attached file '/tmp/MasterTest_MultipleExecutors_8w2pxu/slaves/ad72d6c3-faf2-487c-85ee-2e05f102693d-S0/frameworks/ad72d6c3-faf2-487c-85ee-2e05f102693d-0000/executors/executor-1/runs/8e894a29-8fad-42fc-8b69-e6163b6402a2'
I0129 07:48:38.882344 30193 slave.cpp:1736] Launching task '2' for framework ad72d6c3-faf2-487c-85ee-2e05f102693d-0000
I0129 07:48:38.882933 30193 paths.cpp:547] Trying to chown '/tmp/MasterTest_MultipleExecutors_8w2pxu/slaves/ad72d6c3-faf2-487c-85ee-2e05f102693d-S0/frameworks/ad72d6c3-faf2-487c-85ee-2e05f102693d-0000/executors/executor-2/runs/5c389aa4-c8dc-4031-a43c-7f6533700673'
to user 'mesos'
I0129 07:48:38.883283 30193 slave.cpp:6331] Launching executor 'executor-2' of framework ad72d6c3-faf2-487c-85ee-2e05f102693d-0000
with resources {} in work directory '/tmp/MasterTest_MultipleExecutors_8w2pxu/slaves/ad72d6c3-faf2-487c-85ee-2e05f102693d-S0/frameworks/ad72d6c3-faf2-487c-85ee-2e05f102693d-0000/executors/executor-2/runs/5c389aa4-c8dc-4031-a43c-7f6533700673'
*** Aborted at 1485676118 (unix time) try "date -d @1485676118" if you are using GNU date
***
PC: @     0x2b329eff182d (unknown)
I0129 07:48:38.884317 30203 exec.cpp:162] Version: 1.2.0
*** SIGSEGV (@0xd0) received by PID 30172 (TID 0x2b32a761b700) from PID 208; stack trace:
***
I0129 07:48:38.884732 30204 exec.cpp:212] Executor started at: executor(75)@172.17.0.2:42346
with pid 30172
    @     0x2b32f47d9197 (unknown)
    @     0x2b32f47dd479 (unknown)
    @     0x2b329eda8330 (unknown)
    @     0x2b329eff182d (unknown)
    @     0x2b3294ebe116 os::getenv()
    @     0x2b329bdbaf87 mesos::internal::slave::executorEnvironment()
    @     0x2b329bdb5b88 mesos::internal::slave::Framework::launchExecutor()
    @     0x2b329bd9080b mesos::internal::slave::Slave::_run()
    @     0x2b329bde8f07 _ZZN7process8dispatchIN5mesos8internal5slave5SlaveERKNS_6FutureIbEERKNS1_13FrameworkInfoERKNS1_12ExecutorInfoERK6OptionINS1_8TaskInfoEERKSF_INS1_13TaskGroupInfoEES6_S9_SC_SH_SL_EEvRKNS_3PIDIT_EEMSP_FvT0_T1_T2_T3_T4_ET5_T6_T7_T8_T9_ENKUlPNS_11ProcessBaseEE_clES16_
    @     0x2b329be1da71 _ZNSt17_Function_handlerIFvPN7process11ProcessBaseEEZNS0_8dispatchIN5mesos8internal5slave5SlaveERKNS0_6FutureIbEERKNS5_13FrameworkInfoERKNS5_12ExecutorInfoERK6OptionINS5_8TaskInfoEERKSJ_INS5_13TaskGroupInfoEESA_SD_SG_SL_SP_EEvRKNS0_3PIDIT_EEMST_FvT0_T1_T2_T3_T4_ET5_T6_T7_T8_T9_EUlS2_E_E9_M_invokeERKSt9_Any_dataS2_
    @     0x2b329cb220df std::function<>::operator()()
    @     0x2b329cb07ee1 process::ProcessBase::visit()
    @     0x2b329cb12760 process::DispatchEvent::visit()
    @     0x2b3294e9245c process::ProcessBase::serve()
    @     0x2b329cb041ce process::ProcessManager::resume()
    @     0x2b329cb00a12 _ZZN7process14ProcessManager12init_threadsEvENKUt_clEv
    @     0x2b329cb11e9a _ZNSt12_Bind_simpleIFZN7process14ProcessManager12init_threadsEvEUt_vEE9_M_invokeIIEEEvSt12_Index_tupleIIXspT_EEE
    @     0x2b329cb11df1 _ZNSt12_Bind_simpleIFZN7process14ProcessManager12init_threadsEvEUt_vEEclEv
    @     0x2b329cb11d8a _ZNSt6thread5_ImplISt12_Bind_simpleIFZN7process14ProcessManager12init_threadsEvEUt_vEEE6_M_runEv
    @     0x2b329e629a60 (unknown)
    @     0x2b329eda0184 start_thread
    @     0x2b329f0b037d (unknown)
make[4]: *** [check-local] Segmentation fault
make[4]: Leaving directory `/mesos/mesos-1.2.0/_build/src'
make[3]: *** [check-am] Error 2
make[3]: Leaving directory `/mesos/mesos-1.2.0/_build/src'
make[2]: *** [check] Error 2
make[2]: Leaving directory `/mesos/mesos-1.2.0/_build/src'
make[1]: *** [check-recursive] Error 1
make[1]: Leaving directory `/mesos/mesos-1.2.0/_build'
make: *** [distcheck] Error 1
+ docker rmi mesos-1485673296-24689
Untagged: mesos-1485673296-24689:latest
Deleted: sha256:f5883668671aa43fb41b0d6b003985f18cc299d91bba0358e115d50d084c3ec4
Deleted: sha256:a4c5dcedb62d444b8249c1933fa816da66e408e97f554e03b02786119c5bdb6c
Deleted: sha256:b35f9722f7546a070ae201764372a7edf82aed072d700371d086502214c69a7d
Deleted: sha256:d7ba8ba5a7c807afe32063aede224170b4839a0b1ca2b127454dc32ff897d64f
Deleted: sha256:b70d5f0f879b93c0dc081100017e995519d9d54753f529d537d0753a9c314090
Deleted: sha256:e714554432e60f94b6f7a016d7d824a2c602fe243ab632e57c414efe8d8c6d4f
Deleted: sha256:fb05fc157e4d647078b7af16862cbb75a1548f88078037591185d5f218476bea
Deleted: sha256:bf035e6c9c88798bb1f6d66ff7c555e288e5916fe2596230b3d5d6ec3ba87acd
Deleted: sha256:cfc11e8477f9ee31c34a6374d5d19ba7a8cc6bd857e471f8f4d30783c670c9e9
Deleted: sha256:3d5647de797a815e18a79b123fe293d54b72bc62cf2654cb652be4f90719e0c1
Deleted: sha256:c99651f3525855875a0d4670605fa5bb12d99247492a2f041a83cd016be89319
Deleted: sha256:a0562f8f49594db93f8a06443a9fe1a3757bc67d0cabe433f5d9943f8b04ae9a
Deleted: sha256:b7d29d1b1a9de4a0b6a7e3b51a3d02e113b9e78acb68008504a3701363e8c4b3
Deleted: sha256:21679bb1429bac4bcdd490e2967f3ad0c984fff9ba4739d949bd761edd87dc88
Deleted: sha256:452de86649a4f6250058cb7f1ade62980670c171f6bbc6ffdb1c55dd04a64211
Deleted: sha256:54fa55e6351e24981eecbf31e48ac6ccda9a38f7ea0cba3123d8b0f139b9b67c
Deleted: sha256:21d9a143fc7b97eaacb374d2371fd89f8a9812119c4396385079b12fb3cf4eb4
Deleted: sha256:309b17bc3f0ef3a4c25002eea31bc1b818e72e08ffb6c6c528a28302cc9cb952
Deleted: sha256:d9dd9a37516e54926493d5da09bba75673a44bf2b706b85df05749fd3be4055c
Deleted: sha256:10a74c8e5bb42a10fd76b360f10a8fe98869260fce631a5ceba37508c3cdbeb0
Deleted: sha256:b8aa892f3b5e84a986ac7a06e61078bcbdc8d9279ad96cf1a7be8fa87a77baa5
Deleted: sha256:8a33c11029097782b3635e470b7082b8ee0f286864652bf2a71c23a2cb2250f6
Deleted: sha256:a0997731f631f2f4f1a2f37b735712134d19f1691638932189be7ef55804e82c
Deleted: sha256:1f18fb86454b6604da8a1f06806a024041072c6dfd1b08d4f928d4e29a66fd26
Build step 'Execute shell' marked build as failure

Mime
View raw message