mesos-builds mailing list archives

Site index · List index
Message view « Date » · « Thread »
Top « Date » · « Thread »
From Apache Jenkins Server <jenk...@builds.apache.org>
Subject Build failed in Jenkins: Mesos-Buildbot » autotools,gcc,--verbose --enable-libevent --enable-ssl,GLOG_v=1 MESOS_VERBOSE=1,ubuntu:14.04,(docker||Hadoop)&&(!ubuntu-us1)&&(!ubuntu-eu2) #3188
Date Wed, 25 Jan 2017 18:44:38 GMT
See <https://builds.apache.org/job/Mesos-Buildbot/BUILDTOOL=autotools,COMPILER=gcc,CONFIGURATION=--verbose%20--enable-libevent%20--enable-ssl,ENVIRONMENT=GLOG_v=1%20MESOS_VERBOSE=1,OS=ubuntu%3A14.04,label_exp=(docker%7C%7CHadoop)&&(!ubuntu-us1)&&(!ubuntu-eu2)/3188/changes>

Changes:

[haosdent] Reworked clipboard functionality in WebUI.

------------------------------------------
[...truncated 14007 lines...]
I0125 18:44:28.753634 27135 openssl.cpp:424] CA directory path unspecified! NOTE: Set CA directory
path with LIBPROCESS_SSL_CA_DIR=<dirpath>
I0125 18:44:28.753639 27135 openssl.cpp:429] Will not verify peer certificate!
NOTE: Set LIBPROCESS_SSL_VERIFY_CERT=1 to enable peer certificate verification
I0125 18:44:28.753646 27135 openssl.cpp:449] LIBPROCESS_SSL_REQUIRE_CERT implies peer certificate
verification.
LIBPROCESS_SSL_VERIFY_CERT set to true
I0125 18:44:28.753720 27135 openssl.cpp:511] Using default CA file '/usr/lib/ssl/cert.pem'
and/or directory '/usr/lib/ssl/certs'
I0125 18:44:28.764133 27152 libevent_ssl_socket.cpp:1164] Socket error: error:140760FC:SSL
routines:SSL23_GET_CLIENT_HELLO:unknown protocol
[       OK ] SSLTest.NoValidDowngrade (402 ms)
[ RUN      ] SSLTest.ValidDowngradeEachProtocol
I0125 18:44:29.027489 27135 ssl_tests.cpp:586] Testing server protocol 'LIBPROCESS_SSL_ENABLE_SSL_V3'
W0125 18:44:29.027931 27135 openssl.cpp:402] Failed SSL connections will be downgraded to
a non-SSL socket
I0125 18:44:29.027945 27135 openssl.cpp:419] CA file path is unspecified! NOTE: Set CA file
path with LIBPROCESS_SSL_CA_FILE=<filepath>
I0125 18:44:29.027951 27135 openssl.cpp:424] CA directory path unspecified! NOTE: Set CA directory
path with LIBPROCESS_SSL_CA_DIR=<dirpath>
I0125 18:44:29.027953 27135 openssl.cpp:429] Will not verify peer certificate!
NOTE: Set LIBPROCESS_SSL_VERIFY_CERT=1 to enable peer certificate verification
I0125 18:44:29.027979 27135 openssl.cpp:435] Will only verify peer certificate if presented!
NOTE: Set LIBPROCESS_SSL_REQUIRE_CERT=1 to require peer certificate verification
I0125 18:44:29.046079 27135 ssl_tests.cpp:586] Testing server protocol 'LIBPROCESS_SSL_ENABLE_TLS_V1_0'
W0125 18:44:29.046546 27135 openssl.cpp:402] Failed SSL connections will be downgraded to
a non-SSL socket
I0125 18:44:29.046561 27135 openssl.cpp:419] CA file path is unspecified! NOTE: Set CA file
path with LIBPROCESS_SSL_CA_FILE=<filepath>
I0125 18:44:29.046568 27135 openssl.cpp:424] CA directory path unspecified! NOTE: Set CA directory
path with LIBPROCESS_SSL_CA_DIR=<dirpath>
I0125 18:44:29.046576 27135 openssl.cpp:429] Will not verify peer certificate!
NOTE: Set LIBPROCESS_SSL_VERIFY_CERT=1 to enable peer certificate verification
I0125 18:44:29.046584 27135 openssl.cpp:435] Will only verify peer certificate if presented!
NOTE: Set LIBPROCESS_SSL_REQUIRE_CERT=1 to require peer certificate verification
I0125 18:44:29.146893 27135 ssl_tests.cpp:586] Testing server protocol 'LIBPROCESS_SSL_ENABLE_TLS_V1_1'
W0125 18:44:29.147364 27135 openssl.cpp:402] Failed SSL connections will be downgraded to
a non-SSL socket
I0125 18:44:29.147378 27135 openssl.cpp:419] CA file path is unspecified! NOTE: Set CA file
path with LIBPROCESS_SSL_CA_FILE=<filepath>
I0125 18:44:29.147382 27135 openssl.cpp:424] CA directory path unspecified! NOTE: Set CA directory
path with LIBPROCESS_SSL_CA_DIR=<dirpath>
I0125 18:44:29.147387 27135 openssl.cpp:429] Will not verify peer certificate!
NOTE: Set LIBPROCESS_SSL_VERIFY_CERT=1 to enable peer certificate verification
I0125 18:44:29.147390 27135 openssl.cpp:435] Will only verify peer certificate if presented!
NOTE: Set LIBPROCESS_SSL_REQUIRE_CERT=1 to require peer certificate verification
I0125 18:44:29.248363 27135 ssl_tests.cpp:586] Testing server protocol 'LIBPROCESS_SSL_ENABLE_TLS_V1_2'
W0125 18:44:29.249096 27135 openssl.cpp:402] Failed SSL connections will be downgraded to
a non-SSL socket
I0125 18:44:29.249114 27135 openssl.cpp:419] CA file path is unspecified! NOTE: Set CA file
path with LIBPROCESS_SSL_CA_FILE=<filepath>
I0125 18:44:29.249125 27135 openssl.cpp:424] CA directory path unspecified! NOTE: Set CA directory
path with LIBPROCESS_SSL_CA_DIR=<dirpath>
I0125 18:44:29.249135 27135 openssl.cpp:429] Will not verify peer certificate!
NOTE: Set LIBPROCESS_SSL_VERIFY_CERT=1 to enable peer certificate verification
I0125 18:44:29.249141 27135 openssl.cpp:435] Will only verify peer certificate if presented!
NOTE: Set LIBPROCESS_SSL_REQUIRE_CERT=1 to require peer certificate verification
[       OK ] SSLTest.ValidDowngradeEachProtocol (504 ms)
[ RUN      ] SSLTest.NoValidDowngradeEachProtocol
I0125 18:44:30.081190 27135 ssl_tests.cpp:633] Testing server protocol 'LIBPROCESS_SSL_ENABLE_SSL_V3'
I0125 18:44:30.081653 27135 openssl.cpp:419] CA file path is unspecified! NOTE: Set CA file
path with LIBPROCESS_SSL_CA_FILE=<filepath>
I0125 18:44:30.081666 27135 openssl.cpp:424] CA directory path unspecified! NOTE: Set CA directory
path with LIBPROCESS_SSL_CA_DIR=<dirpath>
I0125 18:44:30.081670 27135 openssl.cpp:429] Will not verify peer certificate!
NOTE: Set LIBPROCESS_SSL_VERIFY_CERT=1 to enable peer certificate verification
I0125 18:44:30.081674 27135 openssl.cpp:435] Will only verify peer certificate if presented!
NOTE: Set LIBPROCESS_SSL_REQUIRE_CERT=1 to require peer certificate verification
I0125 18:44:30.090873 27152 libevent_ssl_socket.cpp:1164] Socket error: error:140760FC:SSL
routines:SSL23_GET_CLIENT_HELLO:unknown protocol
I0125 18:44:30.152719 27135 ssl_tests.cpp:633] Testing server protocol 'LIBPROCESS_SSL_ENABLE_TLS_V1_0'
I0125 18:44:30.153201 27135 openssl.cpp:419] CA file path is unspecified! NOTE: Set CA file
path with LIBPROCESS_SSL_CA_FILE=<filepath>
I0125 18:44:30.153215 27135 openssl.cpp:424] CA directory path unspecified! NOTE: Set CA directory
path with LIBPROCESS_SSL_CA_DIR=<dirpath>
I0125 18:44:30.153219 27135 openssl.cpp:429] Will not verify peer certificate!
NOTE: Set LIBPROCESS_SSL_VERIFY_CERT=1 to enable peer certificate verification
I0125 18:44:30.153223 27135 openssl.cpp:435] Will only verify peer certificate if presented!
NOTE: Set LIBPROCESS_SSL_REQUIRE_CERT=1 to require peer certificate verification
I0125 18:44:30.159785 27152 libevent_ssl_socket.cpp:1164] Socket error: error:140760FC:SSL
routines:SSL23_GET_CLIENT_HELLO:unknown protocol
I0125 18:44:30.253741 27135 ssl_tests.cpp:633] Testing server protocol 'LIBPROCESS_SSL_ENABLE_TLS_V1_1'
I0125 18:44:30.254468 27135 openssl.cpp:419] CA file path is unspecified! NOTE: Set CA file
path with LIBPROCESS_SSL_CA_FILE=<filepath>
I0125 18:44:30.254487 27135 openssl.cpp:424] CA directory path unspecified! NOTE: Set CA directory
path with LIBPROCESS_SSL_CA_DIR=<dirpath>
I0125 18:44:30.254494 27135 openssl.cpp:429] Will not verify peer certificate!
NOTE: Set LIBPROCESS_SSL_VERIFY_CERT=1 to enable peer certificate verification
I0125 18:44:30.254503 27135 openssl.cpp:435] Will only verify peer certificate if presented!
NOTE: Set LIBPROCESS_SSL_REQUIRE_CERT=1 to require peer certificate verification
I0125 18:44:30.261371 27152 libevent_ssl_socket.cpp:1164] Socket error: error:140760FC:SSL
routines:SSL23_GET_CLIENT_HELLO:unknown protocol
I0125 18:44:30.354467 27135 ssl_tests.cpp:633] Testing server protocol 'LIBPROCESS_SSL_ENABLE_TLS_V1_2'
I0125 18:44:30.355113 27135 openssl.cpp:419] CA file path is unspecified! NOTE: Set CA file
path with LIBPROCESS_SSL_CA_FILE=<filepath>
I0125 18:44:30.355128 27135 openssl.cpp:424] CA directory path unspecified! NOTE: Set CA directory
path with LIBPROCESS_SSL_CA_DIR=<dirpath>
I0125 18:44:30.355134 27135 openssl.cpp:429] Will not verify peer certificate!
NOTE: Set LIBPROCESS_SSL_VERIFY_CERT=1 to enable peer certificate verification
I0125 18:44:30.355162 27135 openssl.cpp:435] Will only verify peer certificate if presented!
NOTE: Set LIBPROCESS_SSL_REQUIRE_CERT=1 to require peer certificate verification
I0125 18:44:30.362969 27152 libevent_ssl_socket.cpp:1164] Socket error: error:140760FC:SSL
routines:SSL23_GET_CLIENT_HELLO:unknown protocol
[       OK ] SSLTest.NoValidDowngradeEachProtocol (1106 ms)
[ RUN      ] SSLTest.PeerAddress
I0125 18:44:30.603224 27135 openssl.cpp:419] CA file path is unspecified! NOTE: Set CA file
path with LIBPROCESS_SSL_CA_FILE=<filepath>
I0125 18:44:30.603247 27135 openssl.cpp:424] CA directory path unspecified! NOTE: Set CA directory
path with LIBPROCESS_SSL_CA_DIR=<dirpath>
I0125 18:44:30.603255 27135 openssl.cpp:429] Will not verify peer certificate!
NOTE: Set LIBPROCESS_SSL_VERIFY_CERT=1 to enable peer certificate verification
I0125 18:44:30.603261 27135 openssl.cpp:435] Will only verify peer certificate if presented!
NOTE: Set LIBPROCESS_SSL_REQUIRE_CERT=1 to require peer certificate verification
[       OK ] SSLTest.PeerAddress (156 ms)
[ RUN      ] SSLTest.HTTPSGet
I0125 18:44:31.131249 27135 openssl.cpp:419] CA file path is unspecified! NOTE: Set CA file
path with LIBPROCESS_SSL_CA_FILE=<filepath>
I0125 18:44:31.131273 27135 openssl.cpp:424] CA directory path unspecified! NOTE: Set CA directory
path with LIBPROCESS_SSL_CA_DIR=<dirpath>
I0125 18:44:31.131278 27135 openssl.cpp:429] Will not verify peer certificate!
NOTE: Set LIBPROCESS_SSL_VERIFY_CERT=1 to enable peer certificate verification
I0125 18:44:31.131284 27135 openssl.cpp:435] Will only verify peer certificate if presented!
NOTE: Set LIBPROCESS_SSL_REQUIRE_CERT=1 to require peer certificate verification
[       OK ] SSLTest.HTTPSGet (528 ms)
[ RUN      ] SSLTest.HTTPSPost
I0125 18:44:31.760957 27135 openssl.cpp:419] CA file path is unspecified! NOTE: Set CA file
path with LIBPROCESS_SSL_CA_FILE=<filepath>
I0125 18:44:31.760979 27135 openssl.cpp:424] CA directory path unspecified! NOTE: Set CA directory
path with LIBPROCESS_SSL_CA_DIR=<dirpath>
I0125 18:44:31.760983 27135 openssl.cpp:429] Will not verify peer certificate!
NOTE: Set LIBPROCESS_SSL_VERIFY_CERT=1 to enable peer certificate verification
I0125 18:44:31.760987 27135 openssl.cpp:435] Will only verify peer certificate if presented!
NOTE: Set LIBPROCESS_SSL_REQUIRE_CERT=1 to require peer certificate verification
[       OK ] SSLTest.HTTPSPost (628 ms)
[ RUN      ] SSLTest.SilentSocket
I0125 18:44:32.156119 27135 openssl.cpp:419] CA file path is unspecified! NOTE: Set CA file
path with LIBPROCESS_SSL_CA_FILE=<filepath>
I0125 18:44:32.156142 27135 openssl.cpp:424] CA directory path unspecified! NOTE: Set CA directory
path with LIBPROCESS_SSL_CA_DIR=<dirpath>
I0125 18:44:32.156147 27135 openssl.cpp:429] Will not verify peer certificate!
NOTE: Set LIBPROCESS_SSL_VERIFY_CERT=1 to enable peer certificate verification
I0125 18:44:32.156152 27135 openssl.cpp:435] Will only verify peer certificate if presented!
NOTE: Set LIBPROCESS_SSL_REQUIRE_CERT=1 to require peer certificate verification
I0125 18:44:32.162669 27152 libevent_ssl_socket.cpp:1164] Socket error: error:00000000:lib(0):func(0):reason(0)
[       OK ] SSLTest.SilentSocket (395 ms)
[----------] 15 tests from SSLTest (8752 ms total)

[----------] 38 tests from Scheme/HTTPTest
[ RUN      ] Scheme/HTTPTest.Endpoints/0
I0125 18:44:32.481413 27135 openssl.cpp:419] CA file path is unspecified! NOTE: Set CA file
path with LIBPROCESS_SSL_CA_FILE=<filepath>
I0125 18:44:32.481434 27135 openssl.cpp:424] CA directory path unspecified! NOTE: Set CA directory
path with LIBPROCESS_SSL_CA_DIR=<dirpath>
I0125 18:44:32.481439 27135 openssl.cpp:429] Will not verify peer certificate!
NOTE: Set LIBPROCESS_SSL_VERIFY_CERT=1 to enable peer certificate verification
I0125 18:44:32.481443 27135 openssl.cpp:435] Will only verify peer certificate if presented!
NOTE: Set LIBPROCESS_SSL_REQUIRE_CERT=1 to require peer certificate verification
I0125 18:44:32.489307 27135 process.cpp:1246] libprocess is initialized on 172.17.0.2:60928
with 16 worker threads
I0125 18:44:32.494637 27897 process.cpp:3697] Handling HTTP event for process '(75)' with
path: '/(75)/body'
I0125 18:44:32.499991 27904 process.cpp:3697] Handling HTTP event for process '(75)' with
path: '/(75)/pipe'
I0125 18:44:32.505507 27898 process.cpp:3697] Handling HTTP event for process '(75)' with
path: '/(75)/body'
I0125 18:44:32.505911 27900 process.cpp:3754] Failed to process request for '/(75)/body':
failure
I0125 18:44:32.505935 27893 process.cpp:1456] Returning '500 Internal Server Error' for '/(75)/body'
(failure)
[       OK ] Scheme/HTTPTest.Endpoints/0 (344 ms)
[ RUN      ] Scheme/HTTPTest.Endpoints/1
I0125 18:44:32.517102 27135 process.cpp:1246] libprocess is initialized on 172.17.0.2:57366
with 16 worker threads
I0125 18:44:32.518316 27924 process.cpp:3697] Handling HTTP event for process '(76)' with
path: '/(76)/body'
I0125 18:44:32.519950 27919 process.cpp:3697] Handling HTTP event for process '(76)' with
path: '/(76)/pipe'
I0125 18:44:32.521930 27923 process.cpp:3697] Handling HTTP event for process '(76)' with
path: '/(76)/body'
I0125 18:44:32.522424 27911 process.cpp:3754] Failed to process request for '/(76)/body':
failure
I0125 18:44:32.522446 27918 process.cpp:1456] Returning '500 Internal Server Error' for '/(76)/body'
(failure)
I0125 18:44:32.523211 27925 process.cpp:827] Decode failure: Connection reset by peer
E0125 18:44:32.523239 27925 process.cpp:2419] Failed to shutdown socket with fd 9: Transport
endpoint is not connected
[       OK ] Scheme/HTTPTest.Endpoints/1 (16 ms)
[ RUN      ] Scheme/HTTPTest.EndpointsHelp/0
I0125 18:44:32.646235 27135 openssl.cpp:419] CA file path is unspecified! NOTE: Set CA file
path with LIBPROCESS_SSL_CA_FILE=<filepath>
I0125 18:44:32.646258 27135 openssl.cpp:424] CA directory path unspecified! NOTE: Set CA directory
path with LIBPROCESS_SSL_CA_DIR=<dirpath>
I0125 18:44:32.646262 27135 openssl.cpp:429] Will not verify peer certificate!
NOTE: Set LIBPROCESS_SSL_VERIFY_CERT=1 to enable peer certificate verification
I0125 18:44:32.646266 27135 openssl.cpp:435] Will only verify peer certificate if presented!
NOTE: Set LIBPROCESS_SSL_REQUIRE_CERT=1 to require peer certificate verification
I0125 18:44:32.649327 27135 process.cpp:1246] libprocess is initialized on 172.17.0.2:38696
with 16 worker threads
I0125 18:44:32.654942 27936 process.cpp:3697] Handling HTTP event for process 'help' with
path: '/help'
I0125 18:44:32.660714 27932 process.cpp:3697] Handling HTTP event for process 'help' with
path: '/help'
I0125 18:44:32.666947 27939 process.cpp:3697] Handling HTTP event for process 'help' with
path: '/help/(77)/body'
I0125 18:44:32.672478 27941 process.cpp:3697] Handling HTTP event for process 'help' with
path: '/help/(77)/a/b/c'
[       OK ] Scheme/HTTPTest.EndpointsHelp/0 (151 ms)
[ RUN      ] Scheme/HTTPTest.EndpointsHelp/1
I0125 18:44:32.676344 27135 process.cpp:1246] libprocess is initialized on 172.17.0.2:34219
with 16 worker threads
I0125 18:44:32.677356 27948 process.cpp:3697] Handling HTTP event for process 'help' with
path: '/help'
I0125 18:44:32.679324 27944 process.cpp:3697] Handling HTTP event for process 'help' with
path: '/help'
I0125 18:44:32.682170 27950 process.cpp:3697] Handling HTTP event for process 'help' with
path: '/help/(78)/body'
I0125 18:44:32.684088 27953 process.cpp:3697] Handling HTTP event for process 'help' with
path: '/help/(78)/a/b/c'
[       OK ] Scheme/HTTPTest.EndpointsHelp/1 (14 ms)
[ RUN      ] Scheme/HTTPTest.EndpointsHelpRemoval/0
I0125 18:44:33.884783 27135 openssl.cpp:419] CA file path is unspecified! NOTE: Set CA file
path with LIBPROCESS_SSL_CA_FILE=<filepath>
I0125 18:44:33.884805 27135 openssl.cpp:424] CA directory path unspecified! NOTE: Set CA directory
path with LIBPROCESS_SSL_CA_DIR=<dirpath>
I0125 18:44:33.884810 27135 openssl.cpp:429] Will not verify peer certificate!
NOTE: Set LIBPROCESS_SSL_VERIFY_CERT=1 to enable peer certificate verification
I0125 18:44:33.884814 27135 openssl.cpp:435] Will only verify peer certificate if presented!
NOTE: Set LIBPROCESS_SSL_REQUIRE_CERT=1 to require peer certificate verification
I0125 18:44:33.887404 27135 process.cpp:1246] libprocess is initialized on 172.17.0.2:36680
with 16 worker threads
I0125 18:44:33.893205 27971 process.cpp:3697] Handling HTTP event for process 'help' with
path: '/help/(79)/body'
I0125 18:44:33.899201 27975 process.cpp:3697] Handling HTTP event for process 'help' with
path: '/help/(79)/bogus'
[       OK ] Scheme/HTTPTest.EndpointsHelpRemoval/0 (1212 ms)
[ RUN      ] Scheme/HTTPTest.EndpointsHelpRemoval/1
I0125 18:44:33.905764 27135 process.cpp:1246] libprocess is initialized on 172.17.0.2:45866
with 16 worker threads
I0125 18:44:33.907148 27979 process.cpp:3697] Handling HTTP event for process 'help' with
path: '/help/(80)/body'
I0125 18:44:33.909371 27978 process.cpp:3697] Handling HTTP event for process 'help' with
path: '/help/(80)/bogus'
[       OK ] Scheme/HTTPTest.EndpointsHelpRemoval/1 (10 ms)
[ RUN      ] Scheme/HTTPTest.PipeEOF/0
I0125 18:44:34.178439 27135 openssl.cpp:419] CA file path is unspecified! NOTE: Set CA file
path with LIBPROCESS_SSL_CA_FILE=<filepath>
I0125 18:44:34.178462 27135 openssl.cpp:424] CA directory path unspecified! NOTE: Set CA directory
path with LIBPROCESS_SSL_CA_DIR=<dirpath>
I0125 18:44:34.178467 27135 openssl.cpp:429] Will not verify peer certificate!
NOTE: Set LIBPROCESS_SSL_VERIFY_CERT=1 to enable peer certificate verification
I0125 18:44:34.178472 27135 openssl.cpp:435] Will only verify peer certificate if presented!
NOTE: Set LIBPROCESS_SSL_REQUIRE_CERT=1 to require peer certificate verification
I0125 18:44:34.181059 27135 process.cpp:1246] libprocess is initialized on 172.17.0.2:57504
with 16 worker threads
[       OK ] Scheme/HTTPTest.PipeEOF/0 (278 ms)
[ RUN      ] Scheme/HTTPTest.PipeEOF/1
*** Aborted at 1485369874 (unix time) try "date -d @1485369874" if you are using GNU date
***
PC: @     0x2ab9df887eee (unknown)
I0125 18:44:34.190691 27135 process.cpp:1246] libprocess is initialized on 172.17.0.2:52766
with 16 worker threads
*** SIGSEGV (@0x2e78d98) received by PID 27135 (TID 0x2ab9e1ff1700) from PID 48729496; stack
trace: ***
    @     0x2ab9ddd19330 (unknown)
    @     0x2ab9df887eee (unknown)
[       OK ] Scheme/HTTPTest.PipeEOF/1 (3 ms)
[ RUN      ] Scheme/HTTPTest.PipeFailure/0
    @     0x2ab9df08ae30 (unknown)
    @     0x2ab9df08b48c (unknown)
    @           0x422381 process::UPID::UPID()
    @           0x86ece8 process::DispatchEvent::DispatchEvent()
    @           0x867bc0 process::internal::dispatch()
    @           0x87fff4 process::dispatch<>()
    @           0x866bb6 process::ProcessBase::route()
    @           0x93ed8b process::ProcessBase::route<>()
    @           0x93b2eb process::Help::initialize()
    @           0x860507 process::ProcessManager::resume()
    @           0x85cfec _ZZN7process14ProcessManager12init_threadsEvENKUt_clEv
    @           0x86e474 _ZNSt12_Bind_simpleIFZN7process14ProcessManager12init_threadsEvEUt_vEE9_M_invokeIIEEEvSt12_Index_tupleIIXspT_EEE
    @           0x86e3cb _ZNSt12_Bind_simpleIFZN7process14ProcessManager12init_threadsEvEUt_vEEclEv
    @           0x86e364 _ZNSt6thread5_ImplISt12_Bind_simpleIFZN7process14ProcessManager12init_threadsEvEUt_vEEE6_M_runEv
    @     0x2ab9df081a60 (unknown)
    @     0x2ab9ddd11184 start_thread
    @     0x2ab9df8ea37d (unknown)
make[7]: *** [check-local] Segmentation fault
make[7]: Leaving directory `/mesos/mesos-1.2.0/_build/3rdparty/libprocess'
make[6]: *** [check-am] Error 2
make[6]: Leaving directory `/mesos/mesos-1.2.0/_build/3rdparty/libprocess'
make[5]: *** [check-recursive] Error 1
make[5]: Leaving directory `/mesos/mesos-1.2.0/_build/3rdparty/libprocess'
make[4]: *** [check] Error 2
make[4]: Leaving directory `/mesos/mesos-1.2.0/_build/3rdparty/libprocess'
make[3]: *** [check-recursive] Error 1
make[3]: Leaving directory `/mesos/mesos-1.2.0/_build/3rdparty'
make[2]: *** [check] Error 2
make[2]: Leaving directory `/mesos/mesos-1.2.0/_build/3rdparty'
make[1]: *** [check-recursive] Error 1
make[1]: Leaving directory `/mesos/mesos-1.2.0/_build'
make: *** [distcheck] Error 1
+ docker rmi mesos-1485368337-8709
Untagged: mesos-1485368337-8709:latest
Deleted: sha256:7d5a78858668e87d5977369a5620568dbbaf03aa07ea50e7ab4e8de642da683d
Deleted: sha256:1687ab2c845e948e14ca94b40f91965d7c030304f2ddea088086eb48e23034b5
Deleted: sha256:379857be54008aa4eaaf99cc69db8c49188fe81195df8f5fb3fdf550a361f04d
Deleted: sha256:4184e7ce2786c2cdc182d4d0a1da072358a80f988ebf18fde9cb161ffd0b3b5c
Deleted: sha256:3f23588d9e9169e9ab9a85be29b45b2eff98cebcba1898d8b767b301d39cc43b
Deleted: sha256:3228e73b949ccbc3626e97bcbe4ceb335c27056030eaf35a55d0845c7b1d080e
Deleted: sha256:4b1f34ce44c6a727b47d1ec819ecc657167557d46dd6034d65c1d8de1b9b4d2c
Deleted: sha256:abcc3b78fe9d7d3c967c652d0c50efbe53a454562e1acc54aefeb0291fb4c855
Deleted: sha256:cb2833ad1f3738151b47b3f6dfa93ea05aa9069157ee2bd5d1198058b59ff7e2
Deleted: sha256:5aa49e9b95455acdcd251fdf994bdca05ebabfe5039c0f817c869ec37f08fb18
Deleted: sha256:b1bbf6e1bb410718f8dcd6bc3329c3a6d6eb511540c073d630a41d2e446fd749
Deleted: sha256:8f330bff9a11a681a459b2f7cee0f1598496df6f6e38a467672c2ab8ba63ef24
Deleted: sha256:b6638e4dcaa792b178b31435ff32d8031da95aae302a11f1317c8509acde4dc9
Deleted: sha256:9f65e94d834267918ccfa5e16180a321f9f88413aea6681050320cc463bb2f17
Deleted: sha256:18ba8c315c7b77ef5c7800000a43e1e7fc38a712cfbc2018755c76d2bdd96a79
Deleted: sha256:460ade891368003a53eb2ac0e48ecf9b8f3e7df9c4df51d29847353f580899e5
Deleted: sha256:c80f9f2224b7bc5c6945692128d2887b54439a56d8b98b1d0882b9a6f2e0aea7
Deleted: sha256:5b2d07f5f15e88c9085d47eebddf3a8ec9b577fd2f92fb6af331505324e051f7
Deleted: sha256:a6f3bf70f5df459e4c2c305102b0eab7447da7fb41338e615a0d7064eb70510d
Deleted: sha256:5bc0e5246cd263476e2f6d768a3289e368fb8908654cca923f3454a6cd07ddaf
Deleted: sha256:74d2df920a539421023d5839cbf61ee67c0dad2b3326d37def0551662809c724
Deleted: sha256:7e874ddc9d67516b3503e973d1e3f3111e65693eb8a5e84d3c14a36ca1b4d772
Deleted: sha256:86f48aa5305a6b3b2e7a83aaba46cc1cf17ceaae079fadd5afc410306287c886
Deleted: sha256:dcbfdc63b701a9261f1727ff75be7849a19fa47be85683699893d98dda9c10e9
Build step 'Execute shell' marked build as failure

Mime
View raw message