mesos-builds mailing list archives

Site index · List index
Message view « Date » · « Thread »
Top « Date » · « Thread »
From Apache Jenkins Server <jenk...@builds.apache.org>
Subject Build failed in Jenkins: Mesos-Buildbot » cmake,clang,--verbose --enable-libevent --enable-ssl,GLOG_v=1 MESOS_VERBOSE=1,ubuntu:14.04,(docker||Hadoop)&&(!ubuntu-us1)&&(!ubuntu-6)&&(!ubuntu-eu2) #3118
Date Tue, 17 Jan 2017 14:32:00 GMT
See <https://builds.apache.org/job/Mesos-Buildbot/BUILDTOOL=cmake,COMPILER=clang,CONFIGURATION=--verbose%20--enable-libevent%20--enable-ssl,ENVIRONMENT=GLOG_v=1%20MESOS_VERBOSE=1,OS=ubuntu%3A14.04,label_exp=(docker%7C%7CHadoop)&&(!ubuntu-us1)&&(!ubuntu-6)&&(!ubuntu-eu2)/3118/changes>

Changes:

[yujie.jay] Fixed a few compiler warnings in libprocess.

------------------------------------------
[...truncated 171576 lines...]
[       OK ] Endpoint/SlaveEndpointTest.AuthorizedRequest/0 (12 ms)
[ RUN      ] Endpoint/SlaveEndpointTest.AuthorizedRequest/1
I0117 14:31:11.922327 25298 containerizer.cpp:220] Using isolation: posix/cpu,posix/mem,filesystem/posix,network/cni
W0117 14:31:11.922971 25298 backend.cpp:76] Failed to create 'aufs' backend: AufsBackend requires
root privileges, but is running as user mesos
W0117 14:31:11.923069 25298 backend.cpp:76] Failed to create 'bind' backend: BindBackend requires
root privileges
I0117 14:31:11.924780 25309 slave.cpp:209] Mesos agent started on (675)@172.17.0.3:53944
I0117 14:31:11.924810 25309 slave.cpp:210] Flags at startup: --acls="" --appc_simple_discovery_uri_prefix="http://"
--appc_store_dir="/tmp/mesos/store/appc" --authenticate_http_readonly="true" --authenticate_http_readwrite="true"
--authenticatee="crammd5" --authentication_backoff_factor="1secs" --authorizer="local" --cgroups_cpu_enable_pids_and_tids_count="false"
--cgroups_enable_cfs="false" --cgroups_hierarchy="/sys/fs/cgroup" --cgroups_limit_swap="false"
--cgroups_root="mesos" --container_disk_watch_interval="15secs" --containerizers="mesos" --credential="/tmp/Endpoint_SlaveEndpointTest_AuthorizedRequest_1_HX5Z6E/credential"
--default_role="*" --disk_watch_interval="1mins" --docker="docker" --docker_kill_orphans="true"
--docker_registry="https://registry-1.docker.io" --docker_remove_delay="6hrs" --docker_socket="/var/run/docker.sock"
--docker_stop_timeout="0ns" --docker_store_dir="/tmp/mesos/store/docker" --docker_volume_checkpoint_dir="/var/run/mesos/isolators/docker/volume"
--enforce_container_disk_quota="false" --executor_registration_timeout="1mins" --executor_shutdown_grace_period="5secs"
--fetcher_cache_dir="/tmp/Endpoint_SlaveEndpointTest_AuthorizedRequest_1_HX5Z6E/fetch" --fetcher_cache_size="2GB"
--frameworks_home="" --gc_delay="1weeks" --gc_disk_headroom="0.1" --hadoop_home="" --help="false"
--hostname_lookup="true" --http_authenticators="basic" --http_command_executor="false" --http_credentials="/tmp/Endpoint_SlaveEndpointTest_AuthorizedRequest_1_HX5Z6E/http_credentials"
--http_heartbeat_interval="30secs" --image_provisioner_backend="copy" --initialize_driver_logging="true"
--isolation="posix/cpu,posix/mem" --launcher="posix" --launcher_dir="/mesos/build/src" --logbufsecs="0"
--logging_level="INFO" --max_completed_executors_per_framework="150" --oversubscribed_resources_interval="15secs"
--perf_duration="10secs" --perf_interval="1mins" --qos_correction_interval_min="0ns" --quiet="false"
--recover="reconnect" --recovery_timeout="15mins" --registration_backoff_factor="10ms" --resources="cpus:2;gpus:0;mem:1024;disk:1024;ports:[31000-32000]"
--revocable_cpu_low_priority="true" --runtime_dir="/tmp/Endpoint_SlaveEndpointTest_AuthorizedRequest_1_HX5Z6E"
--sandbox_directory="/mnt/mesos/sandbox" --strict="true" --switch_user="true" --systemd_enable_support="true"
--systemd_runtime_directory="/run/systemd/system" --version="false" --work_dir="/tmp/Endpoint_SlaveEndpointTest_AuthorizedRequest_1_BLLoAW"
I0117 14:31:11.925120 25309 credentials.hpp:86] Loading credential for authentication from
'/tmp/Endpoint_SlaveEndpointTest_AuthorizedRequest_1_HX5Z6E/credential'
I0117 14:31:11.925240 25309 slave.cpp:352] Agent using credential for: test-principal
I0117 14:31:11.925257 25309 credentials.hpp:37] Loading credentials for authentication from
'/tmp/Endpoint_SlaveEndpointTest_AuthorizedRequest_1_HX5Z6E/http_credentials'
I0117 14:31:11.925381 25309 http.cpp:922] Using default 'basic' HTTP authenticator for realm
'mesos-agent-readonly'
I0117 14:31:11.925458 25309 http.cpp:922] Using default 'basic' HTTP authenticator for realm
'mesos-agent-readwrite'
I0117 14:31:11.925837 25309 slave.cpp:539] Agent resources: cpus(*):2; mem(*):1024; disk(*):1024;
ports(*):[31000-32000]
I0117 14:31:11.925870 25309 slave.cpp:547] Agent attributes: [  ]
I0117 14:31:11.925875 25309 slave.cpp:552] Agent hostname: ec8266568c6d
I0117 14:31:11.926281 25313 state.cpp:60] Recovering state from '/tmp/Endpoint_SlaveEndpointTest_AuthorizedRequest_1_BLLoAW/meta'
I0117 14:31:11.926520 25308 status_update_manager.cpp:203] Recovering status update manager
I0117 14:31:11.926597 25308 containerizer.cpp:599] Recovering containerizer
I0117 14:31:11.927103 25308 provisioner.cpp:251] Provisioner recovery complete
I0117 14:31:11.927258 25308 slave.cpp:5417] Finished recovery
I0117 14:31:11.927708 25308 slave.cpp:5591] Querying resource estimator for oversubscribable
resources
I0117 14:31:11.927881 25308 slave.cpp:5605] Received oversubscribable resources {} from the
resource estimator
I0117 14:31:11.929191 25299 process.cpp:3676] Handling HTTP event for process 'slave(675)'
with path: '/slave(675)/monitor/statistics.json'
I0117 14:31:11.930227 25311 http.cpp:874] Authorizing principal 'test-principal' to GET the
'/monitor/statistics.json' endpoint
I0117 14:31:11.932023 25303 slave.cpp:796] Agent terminating
[       OK ] Endpoint/SlaveEndpointTest.AuthorizedRequest/1 (20 ms)
[ RUN      ] Endpoint/SlaveEndpointTest.AuthorizedRequest/2
I0117 14:31:11.942113 25298 containerizer.cpp:220] Using isolation: posix/cpu,posix/mem,filesystem/posix,network/cni
W0117 14:31:11.942534 25298 backend.cpp:76] Failed to create 'aufs' backend: AufsBackend requires
root privileges, but is running as user mesos
W0117 14:31:11.942674 25298 backend.cpp:76] Failed to create 'bind' backend: BindBackend requires
root privileges
I0117 14:31:11.944188 25312 slave.cpp:209] Mesos agent started on (676)@172.17.0.3:53944
I0117 14:31:11.944212 25312 slave.cpp:210] Flags at startup: --acls="" --appc_simple_discovery_uri_prefix="http://"
--appc_store_dir="/tmp/mesos/store/appc" --authenticate_http_readonly="true" --authenticate_http_readwrite="true"
--authenticatee="crammd5" --authentication_backoff_factor="1secs" --authorizer="local" --cgroups_cpu_enable_pids_and_tids_count="false"
--cgroups_enable_cfs="false" --cgroups_hierarchy="/sys/fs/cgroup" --cgroups_limit_swap="false"
--cgroups_root="mesos" --container_disk_watch_interval="15secs" --containerizers="mesos" --credential="/tmp/Endpoint_SlaveEndpointTest_AuthorizedRequest_2_141jox/credential"
--default_role="*" --disk_watch_interval="1mins" --docker="docker" --docker_kill_orphans="true"
--docker_registry="https://registry-1.docker.io" --docker_remove_delay="6hrs" --docker_socket="/var/run/docker.sock"
--docker_stop_timeout="0ns" --docker_store_dir="/tmp/mesos/store/docker" --docker_volume_checkpoint_dir="/var/run/mesos/isolators/docker/volume"
--enforce_container_disk_quota="false" --executor_registration_timeout="1mins" --executor_shutdown_grace_period="5secs"
--fetcher_cache_dir="/tmp/Endpoint_SlaveEndpointTest_AuthorizedRequest_2_141jox/fetch" --fetcher_cache_size="2GB"
--frameworks_home="" --gc_delay="1weeks" --gc_disk_headroom="0.1" --hadoop_home="" --help="false"
--hostname_lookup="true" --http_authenticators="basic" --http_command_executor="false" --http_credentials="/tmp/Endpoint_SlaveEndpointTest_AuthorizedRequest_2_141jox/http_credentials"
--http_heartbeat_interval="30secs" --image_provisioner_backend="copy" --initialize_driver_logging="true"
--isolation="posix/cpu,posix/mem" --launcher="posix" --launcher_dir="/mesos/build/src" --logbufsecs="0"
--logging_level="INFO" --max_completed_executors_per_framework="150" --oversubscribed_resources_interval="15secs"
--perf_duration="10secs" --perf_interval="1mins" --qos_correction_interval_min="0ns" --quiet="false"
--recover="reconnect" --recovery_timeout="15mins" --registration_backoff_factor="10ms" --resources="cpus:2;gpus:0;mem:1024;disk:1024;ports:[31000-32000]"
--revocable_cpu_low_priority="true" --runtime_dir="/tmp/Endpoint_SlaveEndpointTest_AuthorizedRequest_2_141jox"
--sandbox_directory="/mnt/mesos/sandbox" --strict="true" --switch_user="true" --systemd_enable_support="true"
--systemd_runtime_directory="/run/systemd/system" --version="false" --work_dir="/tmp/Endpoint_SlaveEndpointTest_AuthorizedRequest_2_H28oOO"
I0117 14:31:11.944563 25312 credentials.hpp:86] Loading credential for authentication from
'/tmp/Endpoint_SlaveEndpointTest_AuthorizedRequest_2_141jox/credential'
I0117 14:31:11.944738 25312 slave.cpp:352] Agent using credential for: test-principal
I0117 14:31:11.944767 25312 credentials.hpp:37] Loading credentials for authentication from
'/tmp/Endpoint_SlaveEndpointTest_AuthorizedRequest_2_141jox/http_credentials'
I0117 14:31:11.944903 25312 http.cpp:922] Using default 'basic' HTTP authenticator for realm
'mesos-agent-readonly'
I0117 14:31:11.944988 25312 http.cpp:922] Using default 'basic' HTTP authenticator for realm
'mesos-agent-readwrite'
I0117 14:31:11.945436 25312 slave.cpp:539] Agent resources: cpus(*):2; mem(*):1024; disk(*):1024;
ports(*):[31000-32000]
I0117 14:31:11.945471 25312 slave.cpp:547] Agent attributes: [  ]
I0117 14:31:11.945478 25312 slave.cpp:552] Agent hostname: ec8266568c6d
I0117 14:31:11.946009 25300 state.cpp:60] Recovering state from '/tmp/Endpoint_SlaveEndpointTest_AuthorizedRequest_2_H28oOO/meta'
I0117 14:31:11.946231 25300 status_update_manager.cpp:203] Recovering status update manager
I0117 14:31:11.946378 25311 containerizer.cpp:599] Recovering containerizer
I0117 14:31:11.946913 25301 provisioner.cpp:251] Provisioner recovery complete
I0117 14:31:11.947054 25301 slave.cpp:5417] Finished recovery
I0117 14:31:11.947432 25301 slave.cpp:5591] Querying resource estimator for oversubscribable
resources
I0117 14:31:11.947592 25301 slave.cpp:5605] Received oversubscribable resources {} from the
resource estimator
I0117 14:31:11.948503 25301 process.cpp:3676] Handling HTTP event for process 'slave(676)'
with path: '/slave(676)/containers'
I0117 14:31:11.948848 25301 http.cpp:874] Authorizing principal 'test-principal' to GET the
'/containers' endpoint
I0117 14:31:11.950233 25298 slave.cpp:796] Agent terminating
[       OK ] Endpoint/SlaveEndpointTest.AuthorizedRequest/2 (13 ms)
[ RUN      ] Endpoint/SlaveEndpointTest.UnauthorizedRequest/0
I0117 14:31:11.955672 25298 containerizer.cpp:220] Using isolation: posix/cpu,posix/mem,filesystem/posix,network/cni
W0117 14:31:11.956212 25298 backend.cpp:76] Failed to create 'aufs' backend: AufsBackend requires
root privileges, but is running as user mesos
W0117 14:31:11.956305 25298 backend.cpp:76] Failed to create 'bind' backend: BindBackend requires
root privileges
I0117 14:31:11.957547 25305 slave.cpp:209] Mesos agent started on (677)@172.17.0.3:53944
I0117 14:31:11.957722 25305 slave.cpp:210] Flags at startup: --acls="" --appc_simple_discovery_uri_prefix="http://"
--appc_store_dir="/tmp/mesos/store/appc" --authenticate_http_readonly="true" --authenticate_http_readwrite="true"
--authenticatee="crammd5" --authentication_backoff_factor="1secs" --authorizer="local" --cgroups_cpu_enable_pids_and_tids_count="false"
--cgroups_enable_cfs="false" --cgroups_hierarchy="/sys/fs/cgroup" --cgroups_limit_swap="false"
--cgroups_root="mesos" --container_disk_watch_interval="15secs" --containerizers="mesos" --credential="/tmp/Endpoint_SlaveEndpointTest_UnauthorizedRequest_0_PavwPp/credential"
--default_role="*" --disk_watch_interval="1mins" --docker="docker" --docker_kill_orphans="true"
--docker_registry="https://registry-1.docker.io" --docker_remove_delay="6hrs" --docker_socket="/var/run/docker.sock"
--docker_stop_timeout="0ns" --docker_store_dir="/tmp/mesos/store/docker" --docker_volume_checkpoint_dir="/var/run/mesos/isolators/docker/volume"
--enforce_container_disk_quota="false" --executor_registration_timeout="1mins" --executor_shutdown_grace_period="5secs"
--fetcher_cache_dir="/tmp/Endpoint_SlaveEndpointTest_UnauthorizedRequest_0_PavwPp/fetch" --fetcher_cache_size="2GB"
--frameworks_home="" --gc_delay="1weeks" --gc_disk_headroom="0.1" --hadoop_home="" --help="false"
--hostname_lookup="true" --http_authenticators="basic" --http_command_executor="false" --http_credentials="/tmp/Endpoint_SlaveEndpointTest_UnauthorizedRequest_0_PavwPp/http_credentials"
--http_heartbeat_interval="30secs" --image_provisioner_backend="copy" --initialize_driver_logging="true"
--isolation="posix/cpu,posix/mem" --launcher="posix" --launcher_dir="/mesos/build/src" --logbufsecs="0"
--logging_level="INFO" --max_completed_executors_per_framework="150" --oversubscribed_resources_interval="15secs"
--perf_duration="10secs" --perf_interval="1mins" --qos_correction_interval_min="0ns" --quiet="false"
--recover="reconnect" --recovery_timeout="15mins" --registration_backoff_factor="10ms" --resources="cpus:2;gpus:0;mem:1024;disk:1024;ports:[31000-32000]"
--revocable_cpu_low_priority="true" --runtime_dir="/tmp/Endpoint_SlaveEndpointTest_UnauthorizedRequest_0_PavwPp"
--sandbox_directory="/mnt/mesos/sandbox" --strict="true" --switch_user="true" --systemd_enable_support="true"
--systemd_runtime_directory="/run/systemd/system" --version="false" --work_dir="/tmp/Endpoint_SlaveEndpointTest_UnauthorizedRequest_0_njhndH"
I0117 14:31:11.958106 25305 credentials.hpp:86] Loading credential for authentication from
'/tmp/Endpoint_SlaveEndpointTest_UnauthorizedRequest_0_PavwPp/credential'
I0117 14:31:11.958235 25305 slave.cpp:352] Agent using credential for: test-principal
I0117 14:31:11.958252 25305 credentials.hpp:37] Loading credentials for authentication from
'/tmp/Endpoint_SlaveEndpointTest_UnauthorizedRequest_0_PavwPp/http_credentials'
I0117 14:31:11.958349 25305 http.cpp:922] Using default 'basic' HTTP authenticator for realm
'mesos-agent-readonly'
I0117 14:31:11.958396 25305 http.cpp:922] Using default 'basic' HTTP authenticator for realm
'mesos-agent-readwrite'
I0117 14:31:11.958695 25305 slave.cpp:539] Agent resources: cpus(*):2; mem(*):1024; disk(*):1024;
ports(*):[31000-32000]
I0117 14:31:11.958726 25305 slave.cpp:547] Agent attributes: [  ]
I0117 14:31:11.958731 25305 slave.cpp:552] Agent hostname: ec8266568c6d
I0117 14:31:11.959134 25305 state.cpp:60] Recovering state from '/tmp/Endpoint_SlaveEndpointTest_UnauthorizedRequest_0_njhndH/meta'
I0117 14:31:11.959429 25302 status_update_manager.cpp:203] Recovering status update manager
I0117 14:31:11.959499 25302 containerizer.cpp:599] Recovering containerizer
I0117 14:31:11.959911 25302 provisioner.cpp:251] Provisioner recovery complete
I0117 14:31:11.960045 25302 slave.cpp:5417] Finished recovery
I0117 14:31:11.960469 25302 slave.cpp:5591] Querying resource estimator for oversubscribable
resources
I0117 14:31:11.960577 25305 slave.cpp:5605] Received oversubscribable resources {} from the
resource estimator
I0117 14:31:11.961535 25308 process.cpp:3676] Handling HTTP event for process 'slave(677)'
with path: '/slave(677)/monitor/statistics'
I0117 14:31:11.962002 25302 http.cpp:874] Authorizing principal 'test-principal' to GET the
'/monitor/statistics' endpoint
I0117 14:31:11.963125 25307 slave.cpp:796] Agent terminating
[       OK ] Endpoint/SlaveEndpointTest.UnauthorizedRequest/0 (12 ms)
[ RUN      ] Endpoint/SlaveEndpointTest.UnauthorizedRequest/1
I0117 14:31:11.969558 25298 containerizer.cpp:220] Using isolation: posix/cpu,posix/mem,filesystem/posix,network/cni
W0117 14:31:11.969996 25298 backend.cpp:76] Failed to create 'aufs' backend: AufsBackend requires
root privileges, but is running as user mesos
W0117 14:31:11.970113 25298 backend.cpp:76] Failed to create 'bind' backend: BindBackend requires
root privileges
I0117 14:31:11.971855 25311 slave.cpp:209] Mesos agent started on (678)@172.17.0.3:53944
I0117 14:31:11.971992 25311 slave.cpp:210] Flags at startup: --acls="" --appc_simple_discovery_uri_prefix="http://"
--appc_store_dir="/tmp/mesos/store/appc" --authenticate_http_readonly="true" --authenticate_http_readwrite="true"
--authenticatee="crammd5" --authentication_backoff_factor="1secs" --authorizer="local" --cgroups_cpu_enable_pids_and_tids_count="false"
--cgroups_enable_cfs="false" --cgroups_hierarchy="/sys/fs/cgroup" --cgroups_limit_swap="false"
--cgroups_root="mesos" --container_disk_watch_interval="15secs" --containerizers="mesos" --credential="/tmp/Endpoint_SlaveEndpointTest_UnauthorizedRequest_1_Yiqcpi/credential"
--default_role="*" --disk_watch_interval="1mins" --docker="docker" --docker_kill_orphans="true"
--docker_registry="https://registry-1.docker.io" --docker_remove_delay="6hrs" --docker_socket="/var/run/docker.sock"
--docker_stop_timeout="0ns" --docker_store_dir="/tmp/mesos/store/docker" --docker_volume_checkpoint_dir="/var/run/mesos/isolators/docker/volume"
--enforce_container_disk_quota="false" --executor_registration_timeout="1mins" --executor_shutdown_grace_period="5secs"
--fetcher_cache_dir="/tmp/Endpoint_SlaveEndpointTest_UnauthorizedRequest_1_Yiqcpi/fetch" --fetcher_cache_size="2GB"
--frameworks_home="" --gc_delay="1weeks" --gc_disk_headroom="0.1" --hadoop_home="" --help="false"
--hostname_lookup="true" --http_authenticators="basic" --http_command_executor="false" --http_credentials="/tmp/Endpoint_SlaveEndpointTest_UnauthorizedRequest_1_Yiqcpi/http_credentials"
--http_heartbeat_interval="30secs" --image_provisioner_backend="copy" --initialize_driver_logging="true"
--isolation="posix/cpu,posix/mem" --launcher="posix" --launcher_dir="/mesos/build/src" --logbufsecs="0"
--logging_level="INFO" --max_completed_executors_per_framework="150" --oversubscribed_resources_interval="15secs"
--perf_duration="10secs" --perf_interval="1mins" --qos_correction_interval_min="0ns" --quiet="false"
--recover="reconnect" --recovery_timeout="15mins" --registration_backoff_factor="10ms" --resources="cpus:2;gpus:0;mem:1024;disk:1024;ports:[31000-32000]"
--revocable_cpu_low_priority="true" --runtime_dir="/tmp/Endpoint_SlaveEndpointTest_UnauthorizedRequest_1_Yiqcpi"
--sandbox_directory="/mnt/mesos/sandbox" --strict="true" --switch_user="true" --systemd_enable_support="true"
--systemd_runtime_directory="/run/systemd/system" --version="false" --work_dir="/tmp/Endpoint_SlaveEndpointTest_UnauthorizedRequest_1_pVMUKz"
I0117 14:31:11.972350 25311 credentials.hpp:86] Loading credential for authentication from
'/tmp/Endpoint_SlaveEndpointTest_UnauthorizedRequest_1_Yiqcpi/credential'
I0117 14:31:11.972568 25311 slave.cpp:352] Agent using credential for: test-principal
I0117 14:31:11.972584 25311 credentials.hpp:37] Loading credentials for authentication from
'/tmp/Endpoint_SlaveEndpointTest_UnauthorizedRequest_1_Yiqcpi/http_credentials'
I0117 14:31:11.972707 25311 http.cpp:922] Using default 'basic' HTTP authenticator for realm
'mesos-agent-readonly'
I0117 14:31:11.972769 25311 http.cpp:922] Using default 'basic' HTTP authenticator for realm
'mesos-agent-readwrite'
I0117 14:31:11.973220 25311 slave.cpp:539] Agent resources: cpus(*):2; mem(*):1024; disk(*):1024;
ports(*):[31000-32000]
I0117 14:31:11.973268 25311 slave.cpp:547] Agent attributes: [  ]
I0117 14:31:11.973276 25311 slave.cpp:552] Agent hostname: ec8266568c6d
I0117 14:31:11.973829 25303 state.cpp:60] Recovering state from '/tmp/Endpoint_SlaveEndpointTest_UnauthorizedRequest_1_pVMUKz/meta'
I0117 14:31:11.973985 25313 status_update_manager.cpp:203] Recovering status update manager
I0117 14:31:11.974128 25300 containerizer.cpp:599] Recovering containerizer
I0117 14:31:11.974581 25304 provisioner.cpp:251] Provisioner recovery complete
I0117 14:31:11.974814 25304 slave.cpp:5417] Finished recovery
I0117 14:31:11.975265 25304 slave.cpp:5591] Querying resource estimator for oversubscribable
resources
I0117 14:31:11.975455 25304 slave.cpp:5605] Received oversubscribable resources {} from the
resource estimator
I0117 14:31:11.976416 25299 process.cpp:3676] Handling HTTP event for process 'slave(678)'
with path: '/slave(678)/monitor/statistics.json'
I0117 14:31:11.976826 25306 http.cpp:874] Authorizing principal 'test-principal' to GET the
'/monitor/statistics.json' endpoint
I0117 14:31:11.977799 25298 slave.cpp:796] Agent terminating
[       OK ] Endpoint/SlaveEndpointTest.UnauthorizedRequest/1 (24 ms)
[ RUN      ] Endpoint/SlaveEndpointTest.UnauthorizedRequest/2
I0117 14:31:11.993018 25298 containerizer.cpp:220] Using isolation: posix/cpu,posix/mem,filesystem/posix,network/cni
W0117 14:31:11.993396 25298 backend.cpp:76] Failed to create 'aufs' backend: AufsBackend requires
root privileges, but is running as user mesos
W0117 14:31:11.993487 25298 backend.cpp:76] Failed to create 'bind' backend: BindBackend requires
root privileges
I0117 14:31:11.995205 25304 slave.cpp:209] Mesos agent started on (679)@172.17.0.3:53944
I0117 14:31:11.995234 25304 slave.cpp:210] Flags at startup: --acls="" --appc_simple_discovery_uri_prefix="http://"
--appc_store_dir="/tmp/mesos/store/appc" --authenticate_http_readonly="true" --authenticate_http_readwrite="true"
--authenticatee="crammd5" --authentication_backoff_factor="1secs" --authorizer="local" --cgroups_cpu_enable_pids_and_tids_count="false"
--cgroups_enable_cfs="false" --cgroups_hierarchy="/sys/fs/cgroup" --cgroups_limit_swap="false"
--cgroups_root="mesos" --container_disk_watch_interval="15secs" --containerizers="mesos" --credential="/tmp/Endpoint_SlaveEndpointTest_UnauthorizedRequest_2_7ge3cb/credential"
--default_role="*" --disk_watch_interval="1mins" --docker="docker" --docker_kill_orphans="true"
--docker_registry="https://registry-1.docker.io" --docker_remove_delay="6hrs" --docker_socket="/var/run/docker.sock"
--docker_stop_timeout="0ns" --docker_store_dir="/tmp/mesos/store/docker" --docker_volume_checkpoint_dir="/var/run/mesos/isolators/docker/volume"
--enforce_container_disk_quota="false" --executor_registration_timeout="1mins" --executor_shutdown_grace_period="5secs"
--fetcher_cache_dir="/tmp/Endpoint_SlaveEndpointTest_UnauthorizedRequest_2_7ge3cb/fetch" --fetcher_cache_size="2GB"
--frameworks_home="" --gc_delay="1weeks" --gc_disk_headroom="0.1" --hadoop_home="" --help="false"
--hostname_lookup="true" --http_authenticators="basic" --http_command_executor="false" --http_credentials="/tmp/Endpoint_SlaveEndpointTest_UnauthorizedRequest_2_7ge3cb/http_credentials"
--http_heartbeat_interval="30secs" --image_provisioner_backend="copy" --initialize_driver_logging="true"
--isolation="posix/cpu,posix/mem" --launcher="posix" --launcher_dir="/mesos/build/src" --logbufsecs="0"
--logging_level="INFO" --max_completed_executors_per_framework="150" --oversubscribed_resources_interval="15secs"
--perf_duration="10secs" --perf_interval="1mins" --qos_correction_interval_min="0ns" --quiet="false"
--recover="reconnect" --recovery_timeout="15mins" --registration_backoff_factor="10ms" --resources="cpus:2;gpus:0;mem:1024;disk:1024;ports:[31000-32000]"
--revocable_cpu_low_priority="true" --runtime_dir="/tmp/Endpoint_SlaveEndpointTest_UnauthorizedRequest_2_7ge3cb"
--sandbox_directory="/mnt/mesos/sandbox" --strict="true" --switch_user="true" --systemd_enable_support="true"
--systemd_runtime_directory="/run/systemd/system" --version="false" --work_dir="/tmp/Endpoint_SlaveEndpointTest_UnauthorizedRequest_2_pGIRus"
I0117 14:31:11.995579 25304 credentials.hpp:86] Loading credential for authentication from
'/tmp/Endpoint_SlaveEndpointTest_UnauthorizedRequest_2_7ge3cb/credential'
I0117 14:31:11.995697 25304 slave.cpp:352] Agent using credential for: test-principal
I0117 14:31:11.995714 25304 credentials.hpp:37] Loading credentials for authentication from
'/tmp/Endpoint_SlaveEndpointTest_UnauthorizedRequest_2_7ge3cb/http_credentials'
I0117 14:31:11.995838 25304 http.cpp:922] Using default 'basic' HTTP authenticator for realm
'mesos-agent-readonly'
I0117 14:31:11.995900 25304 http.cpp:922] Using default 'basic' HTTP authenticator for realm
'mesos-agent-readwrite'
I0117 14:31:11.996239 25304 slave.cpp:539] Agent resources: cpus(*):2; mem(*):1024; disk(*):1024;
ports(*):[31000-32000]
I0117 14:31:11.996273 25304 slave.cpp:547] Agent attributes: [  ]
I0117 14:31:11.996281 25304 slave.cpp:552] Agent hostname: ec8266568c6d
I0117 14:31:11.996732 25303 state.cpp:60] Recovering state from '/tmp/Endpoint_SlaveEndpointTest_UnauthorizedRequest_2_pGIRus/meta'
I0117 14:31:11.996906 25303 status_update_manager.cpp:203] Recovering status update manager
I0117 14:31:11.997143 25304 containerizer.cpp:599] Recovering containerizer
I0117 14:31:11.997714 25313 provisioner.cpp:251] Provisioner recovery complete
I0117 14:31:11.998060 25301 slave.cpp:5417] Finished recovery
I0117 14:31:11.998505 25301 slave.cpp:5591] Querying resource estimator for oversubscribable
resources
I0117 14:31:11.998728 25301 slave.cpp:5605] Received oversubscribable resources {} from the
resource estimator
I0117 14:31:11.999764 25313 process.cpp:3676] Handling HTTP event for process 'slave(679)'
with path: '/slave(679)/containers'
I0117 14:31:12.000113 25313 http.cpp:874] Authorizing principal 'test-principal' to GET the
'/containers' endpoint
I0117 14:31:12.001273 25307 slave.cpp:796] Agent terminating
[       OK ] Endpoint/SlaveEndpointTest.UnauthorizedRequest/2 (14 ms)
[ RUN      ] Endpoint/SlaveEndpointTest.NoAuthorizer/0
I0117 14:31:12.007298 25298 containerizer.cpp:220] Using isolation: posix/cpu,posix/mem,filesystem/posix,network/cni
W0117 14:31:12.007680 25298 backend.cpp:76] Failed to create 'aufs' backend: AufsBackend requires
root privileges, but is running as user mesos
W0117 14:31:12.007772 25298 backend.cpp:76] Failed to create 'bind' backend: BindBackend requires
root privileges
I0117 14:31:12.008455 25298 cluster.cpp:446] Creating default 'local' authorizer
I0117 14:31:12.009368 25299 slave.cpp:209] Mesos agent started on (680)@172.17.0.3:53944
I0117 14:31:12.009402 25299 slave.cpp:210] Flags at startup: --acls="" --appc_simple_discovery_uri_prefix="http://"
--appc_store_dir="/tmp/mesos/store/appc" --authenticate_http_readonly="true" --authenticate_http_readwrite="true"
--authenticatee="crammd5" --authentication_backoff_factor="1secs" --authorizer="local" --cgroups_cpu_enable_pids_and_tids_count="false"
--cgroups_enable_cfs="false" --cgroups_hierarchy="/sys/fs/cgroup" --cgroups_limit_swap="false"
--cgroups_root="mesos" --container_disk_watch_interval="15secs" --containerizers="mesos" --credential="/tmp/Endpoint_SlaveEndpointTest_NoAuthorizer_0_Suxyb4/credential"
--default_role="*" --disk_watch_interval="1mins" --docker="docker" --docker_kill_orphans="true"
--docker_registry="https://registry-1.docker.io" --docker_remove_delay="6hrs" --docker_socket="/var/run/docker.sock"
--docker_stop_timeout="0ns" --docker_store_dir="/tmp/mesos/store/docker" --docker_volume_checkpoint_dir="/var/run/mesos/isolators/docker/volume"
--enforce_container_disk_quota="false" --executor_registration_timeout="1mins" --executor_shutdown_grace_period="5secs"
--fetcher_cache_dir="/tmp/Endpoint_SlaveEndpointTest_NoAuthorizer_0_Suxyb4/fetch" --fetcher_cache_size="2GB"
--frameworks_home="" --gc_delay="1weeks" --gc_disk_headroom="0.1" --hadoop_home="" --help="false"
--hostname_lookup="true" --http_authenticators="basic" --http_command_executor="false" --http_credentials="/tmp/Endpoint_SlaveEndpointTest_NoAuthorizer_0_Suxyb4/http_credentials"
--http_heartbeat_interval="30secs" --image_provisioner_backend="copy" --initialize_driver_logging="true"
--isolation="posix/cpu,posix/mem" --launcher="posix" --launcher_dir="/mesos/build/src" --logbufsecs="0"
--logging_level="INFO" --max_completed_executors_per_framework="150" --oversubscribed_resources_interval="15secs"
--perf_duration="10secs" --perf_interval="1mins" --qos_correction_interval_min="0ns" --quiet="false"
--recover="reconnect" --recovery_timeout="15mins" --registration_backoff_factor="10ms" --resources="cpus:2;gpus:0;mem:1024;disk:1024;ports:[31000-32000]"
--revocable_cpu_low_priority="true" --runtime_dir="/tmp/Endpoint_SlaveEndpointTest_NoAuthorizer_0_Suxyb4"
--sandbox_directory="/mnt/mesos/sandbox" --strict="true" --switch_user="true" --systemd_enable_support="true"
--systemd_runtime_directory="/run/systemd/system" --version="false" --work_dir="/tmp/Endpoint_SlaveEndpointTest_NoAuthorizer_0_XTQ4ql"
I0117 14:31:12.009820 25299 credentials.hpp:86] Loading credential for authentication from
'/tmp/Endpoint_SlaveEndpointTest_NoAuthorizer_0_Suxyb4/credential'
I0117 14:31:12.009943 25299 slave.cpp:352] Agent using credential for: test-principal
I0117 14:31:12.009959 25299 credentials.hpp:37] Loading credentials for authentication from
'/tmp/Endpoint_SlaveEndpointTest_NoAuthorizer_0_Suxyb4/http_credentials'
I0117 14:31:12.010088 25299 http.cpp:922] Using default 'basic' HTTP authenticator for realm
'mesos-agent-readonly'
I0117 14:31:12.010151 25299 http.cpp:922] Using default 'basic' HTTP authenticator for realm
'mesos-agent-readwrite'
I0117 14:31:12.010594 25299 slave.cpp:539] Agent resources: cpus(*):2; mem(*):1024; disk(*):1024;
ports(*):[31000-32000]
I0117 14:31:12.010643 25299 slave.cpp:547] Agent attributes: [  ]
I0117 14:31:12.010655 25299 slave.cpp:552] Agent hostname: ec8266568c6d
I0117 14:31:12.011232 25311 state.cpp:60] Recovering state from '/tmp/Endpoint_SlaveEndpointTest_NoAuthorizer_0_XTQ4ql/meta'
I0117 14:31:12.011499 25303 status_update_manager.cpp:203] Recovering status update manager
I0117 14:31:12.011710 25303 containerizer.cpp:599] Recovering containerizer
I0117 14:31:12.012400 25304 provisioner.cpp:251] Provisioner recovery complete
I0117 14:31:12.012570 25304 slave.cpp:5417] Finished recovery
I0117 14:31:12.013128 25304 slave.cpp:5591] Querying resource estimator for oversubscribable
resources
I0117 14:31:12.013315 25301 slave.cpp:5605] Received oversubscribable resources {} from the
resource estimator
I0117 14:31:12.014175 25304 process.cpp:3676] Handling HTTP event for process 'slave(680)'
with path: '/slave(680)/monitor/statistics'
I0117 14:31:12.014618 25304 http.cpp:874] Authorizing principal 'test-principal' to GET the
'/monitor/statistics' endpoint
I0117 14:31:12.016297 25298 slave.cpp:796] Agent terminating
[       OK ] Endpoint/SlaveEndpointTest.NoAuthorizer/0 (18 ms)
[ RUN      ] Endpoint/SlaveEndpointTest.NoAuthorizer/1
I0117 14:31:12.026960 25298 containerizer.cpp:220] Using isolation: posix/cpu,posix/mem,filesystem/posix,network/cni
W0117 14:31:12.027407 25298 backend.cpp:76] Failed to create 'aufs' backend: AufsBackend requires
root privileges, but is running as user mesos
W0117 14:31:12.027505 25298 backend.cpp:76] Failed to create 'bind' backend: BindBackend requires
root privileges
I0117 14:31:12.028281 25298 cluster.cpp:446] Creating default 'local' authorizer
I0117 14:31:12.028899 25314 slave.cpp:209] Mesos agent started on (681)@172.17.0.3:53944
I0117 14:31:12.029079 25314 slave.cpp:210] Flags at startup: --acls="" --appc_simple_discovery_uri_prefix="http://"
--appc_store_dir="/tmp/mesos/store/appc" --authenticate_http_readonly="true" --authenticate_http_readwrite="true"
--authenticatee="crammd5" --authentication_backoff_factor="1secs" --authorizer="local" --cgroups_cpu_enable_pids_and_tids_count="false"
--cgroups_enable_cfs="false" --cgroups_hierarchy="/sys/fs/cgroup" --cgroups_limit_swap="false"
--cgroups_root="mesos" --container_disk_watch_interval="15secs" --containerizers="mesos" --credential="/tmp/Endpoint_SlaveEndpointTest_NoAuthorizer_1_imMFlX/credential"
--default_role="*" --disk_watch_interval="1mins" --docker="docker" --docker_kill_orphans="true"
--docker_registry="https://registry-1.docker.io" --docker_remove_delay="6hrs" --docker_socket="/var/run/docker.sock"
--docker_stop_timeout="0ns" --docker_store_dir="/tmp/mesos/store/docker" --docker_volume_checkpoint_dir="/var/run/mesos/isolators/docker/volume"
--enforce_container_disk_quota="false" --executor_registration_timeout="1mins" --executor_shutdown_grace_period="5secs"
--fetcher_cache_dir="/tmp/Endpoint_SlaveEndpointTest_NoAuthorizer_1_imMFlX/fetch" --fetcher_cache_size="2GB"
--frameworks_home="" --gc_delay="1weeks" --gc_disk_headroom="0.1" --hadoop_home="" --help="false"
--hostname_lookup="true" --http_authenticators="basic" --http_command_executor="false" --http_credentials="/tmp/Endpoint_SlaveEndpointTest_NoAuthorizer_1_imMFlX/http_credentials"
--http_heartbeat_interval="30secs" --image_provisioner_backend="copy" --initialize_driver_logging="true"
--isolation="posix/cpu,posix/mem" --launcher="posix" --launcher_dir="/mesos/build/src" --logbufsecs="0"
--logging_level="INFO" --max_completed_executors_per_framework="150" --oversubscribed_resources_interval="15secs"
--perf_duration="10secs" --perf_interval="1mins" --qos_correction_interval_min="0ns" --quiet="false"
--recover="reconnect" --recovery_timeout="15mins" --registration_backoff_factor="10ms" --resources="cpus:2;gpus:0;mem:1024;disk:1024;ports:[31000-32000]"
--revocable_cpu_low_priority="true" --runtime_dir="/tmp/Endpoint_SlaveEndpointTest_NoAuthorizer_1_imMFlX"
--sandbox_directory="/mnt/mesos/sandbox" --strict="true" --switch_user="true" --systemd_enable_support="true"
--systemd_runtime_directory="/run/systemd/system" --version="false" --work_dir="/tmp/Endpoint_SlaveEndpointTest_NoAuthorizer_1_Abj5xe"
I0117 14:31:12.029503 25314 credentials.hpp:86] Loading credential for authentication from
'/tmp/Endpoint_SlaveEndpointTest_NoAuthorizer_1_imMFlX/credential'
I0117 14:31:12.029638 25314 slave.cpp:352] Agent using credential for: test-principal
I0117 14:31:12.029706 25314 credentials.hpp:37] Loading credentials for authentication from
'/tmp/Endpoint_SlaveEndpointTest_NoAuthorizer_1_imMFlX/http_credentials'
I0117 14:31:12.029848 25314 http.cpp:922] Using default 'basic' HTTP authenticator for realm
'mesos-agent-readonly'
I0117 14:31:12.029911 25314 http.cpp:922] Using default 'basic' HTTP authenticator for realm
'mesos-agent-readwrite'
I0117 14:31:12.030277 25314 slave.cpp:539] Agent resources: cpus(*):2; mem(*):1024; disk(*):1024;
ports(*):[31000-32000]
I0117 14:31:12.030311 25314 slave.cpp:547] Agent attributes: [  ]
I0117 14:31:12.030323 25314 slave.cpp:552] Agent hostname: ec8266568c6d
I0117 14:31:12.030899 25310 state.cpp:60] Recovering state from '/tmp/Endpoint_SlaveEndpointTest_NoAuthorizer_1_Abj5xe/meta'
I0117 14:31:12.031085 25305 status_update_manager.cpp:203] Recovering status update manager
I0117 14:31:12.031239 25310 containerizer.cpp:599] Recovering containerizer
I0117 14:31:12.031708 25305 provisioner.cpp:251] Provisioner recovery complete
I0117 14:31:12.031934 25305 slave.cpp:5417] Finished recovery
I0117 14:31:12.032380 25305 slave.cpp:5591] Querying resource estimator for oversubscribable
resources
I0117 14:31:12.032506 25305 slave.cpp:5605] Received oversubscribable resources {} from the
resource estimator
I0117 14:31:12.033377 25306 process.cpp:3676] Handling HTTP event for process 'slave(681)'
with path: '/slave(681)/monitor/statistics.json'
I0117 14:31:12.033802 25305 http.cpp:874] Authorizing principal 'test-principal' to GET the
'/monitor/statistics.json' endpoint
I0117 14:31:12.035646 25298 slave.cpp:796] Agent terminating
[       OK ] Endpoint/SlaveEndpointTest.NoAuthorizer/1 (26 ms)
[ RUN      ] Endpoint/SlaveEndpointTest.NoAuthorizer/2
I0117 14:31:12.053874 25298 containerizer.cpp:220] Using isolation: posix/cpu,posix/mem,filesystem/posix,network/cni
W0117 14:31:12.054339 25298 backend.cpp:76] Failed to create 'aufs' backend: AufsBackend requires
root privileges, but is running as user mesos
W0117 14:31:12.054488 25298 backend.cpp:76] Failed to create 'bind' backend: BindBackend requires
root privileges
I0117 14:31:12.055274 25298 cluster.cpp:446] Creating default 'local' authorizer
I0117 14:31:12.056115 25313 slave.cpp:209] Mesos agent started on (682)@172.17.0.3:53944
I0117 14:31:12.056152 25313 slave.cpp:210] Flags at startup: --acls="" --appc_simple_discovery_uri_prefix="http://"
--appc_store_dir="/tmp/mesos/store/appc" --authenticate_http_readonly="true" --authenticate_http_readwrite="true"
--authenticatee="crammd5" --authentication_backoff_factor="1secs" --authorizer="local" --cgroups_cpu_enable_pids_and_tids_count="false"
--cgroups_enable_cfs="false" --cgroups_hierarchy="/sys/fs/cgroup" --cgroups_limit_swap="false"
--cgroups_root="mesos" --container_disk_watch_interval="15secs" --containerizers="mesos" --credential="/tmp/Endpoint_SlaveEndpointTest_NoAuthorizer_2_0cO0LQ/credential"
--default_role="*" --disk_watch_interval="1mins" --docker="docker" --docker_kill_orphans="true"
--docker_registry="https://registry-1.docker.io" --docker_remove_delay="6hrs" --docker_socket="/var/run/docker.sock"
--docker_stop_timeout="0ns" --docker_store_dir="/tmp/mesos/store/docker" --docker_volume_checkpoint_dir="/var/run/mesos/isolators/docker/volume"
--enforce_container_disk_quota="false" --executor_registration_timeout="1mins" --executor_shutdown_grace_period="5secs"
--fetcher_cache_dir="/tmp/Endpoint_SlaveEndpointTest_NoAuthorizer_2_0cO0LQ/fetch" --fetcher_cache_size="2GB"
--frameworks_home="" --gc_delay="1weeks" --gc_disk_headroom="0.1" --hadoop_home="" --help="false"
--hostname_lookup="true" --http_authenticators="basic" --http_command_executor="false" --http_credentials="/tmp/Endpoint_SlaveEndpointTest_NoAuthorizer_2_0cO0LQ/http_credentials"
--http_heartbeat_interval="30secs" --image_provisioner_backend="copy" --initialize_driver_logging="true"
--isolation="posix/cpu,posix/mem" --launcher="posix" --launcher_dir="/mesos/build/src" --logbufsecs="0"
--logging_level="INFO" --max_completed_executors_per_framework="150" --oversubscribed_resources_interval="15secs"
--perf_duration="10secs" --perf_interval="1mins" --qos_correction_interval_min="0ns" --quiet="false"
--recover="reconnect" --recovery_timeout="15mins" --registration_backoff_factor="10ms" --resources="cpus:2;gpus:0;mem:1024;disk:1024;ports:[31000-32000]"
--revocable_cpu_low_priority="true" --runtime_dir="/tmp/Endpoint_SlaveEndpointTest_NoAuthorizer_2_0cO0LQ"
--sandbox_directory="/mnt/mesos/sandbox" --strict="true" --switch_user="true" --systemd_enable_support="true"
--systemd_runtime_directory="/run/systemd/system" --version="false" --work_dir="/tmp/Endpoint_SlaveEndpointTest_NoAuthorizer_2_vV13T7"
I0117 14:31:12.056550 25313 credentials.hpp:86] Loading credential for authentication from
'/tmp/Endpoint_SlaveEndpointTest_NoAuthorizer_2_0cO0LQ/credential'
I0117 14:31:12.056674 25313 slave.cpp:352] Agent using credential for: test-principal
I0117 14:31:12.056690 25313 credentials.hpp:37] Loading credentials for authentication from
'/tmp/Endpoint_SlaveEndpointTest_NoAuthorizer_2_0cO0LQ/http_credentials'
I0117 14:31:12.056813 25313 http.cpp:922] Using default 'basic' HTTP authenticator for realm
'mesos-agent-readonly'
I0117 14:31:12.056880 25313 http.cpp:922] Using default 'basic' HTTP authenticator for realm
'mesos-agent-readwrite'
I0117 14:31:12.057320 25313 slave.cpp:539] Agent resources: cpus(*):2; mem(*):1024; disk(*):1024;
ports(*):[31000-32000]
I0117 14:31:12.057369 25313 slave.cpp:547] Agent attributes: [  ]
I0117 14:31:12.057381 25313 slave.cpp:552] Agent hostname: ec8266568c6d
I0117 14:31:12.058138 25313 state.cpp:60] Recovering state from '/tmp/Endpoint_SlaveEndpointTest_NoAuthorizer_2_vV13T7/meta'
I0117 14:31:12.058313 25313 status_update_manager.cpp:203] Recovering status update manager
I0117 14:31:12.058387 25313 containerizer.cpp:599] Recovering containerizer
I0117 14:31:12.058972 25313 provisioner.cpp:251] Provisioner recovery complete
I0117 14:31:12.059139 25313 slave.cpp:5417] Finished recovery
I0117 14:31:12.059628 25313 slave.cpp:5591] Querying resource estimator for oversubscribable
resources
I0117 14:31:12.059818 25313 slave.cpp:5605] Received oversubscribable resources {} from the
resource estimator
I0117 14:31:12.060729 25299 process.cpp:3676] Handling HTTP event for process 'slave(682)'
with path: '/slave(682)/containers'
I0117 14:31:12.061300 25308 http.cpp:874] Authorizing principal 'test-principal' to GET the
'/containers' endpoint
I0117 14:31:12.062721 25303 slave.cpp:796] Agent terminating
[       OK ] Endpoint/SlaveEndpointTest.NoAuthorizer/2 (28 ms)
[----------] 9 tests from Endpoint/SlaveEndpointTest (172 ms total)

[----------] Global test environment tear-down
[==========] 1401 tests from 157 test cases ran. (180391 ms total)
[  PASSED  ] 1400 tests.
[  FAILED  ] 1 test, listed below:
[  FAILED  ] SlaveRecoveryTest/0.RegisterDisconnectedSlave, where TypeParam = mesos::internal::slave::MesosContainerizer

 1 FAILED TEST
  YOU HAVE 14 DISABLED TESTS

make[3]: Leaving directory `/mesos/build'
make[3]: *** [CMakeFiles/check] Error 1
make[2]: *** [CMakeFiles/check.dir/all] Error 2
make[2]: Leaving directory `/mesos/build'
make[1]: Leaving directory `/mesos/build'
make[1]: *** [CMakeFiles/check.dir/rule] Error 2
make: *** [check] Error 2
+ docker rmi mesos-1484661107-19857
Untagged: mesos-1484661107-19857:latest
Deleted: sha256:31c390c21a09183969d23cb605dcafc59c8b0879d5bc16e94ccb5c9c92d0e006
Deleted: sha256:ca0e9bf99a9ba292d6410c2f7e04cd854da3683707f712e5c2460610701ef6dd
Deleted: sha256:415f277972bf0d63e1ccf67b102a0c890be4dd5545cfc5f92cdecd74936bfcdc
Deleted: sha256:3121976c798a7dbd476b89a0409ed7cd73b6e76e8e97bdfb8d98024269946906
Deleted: sha256:f337546913d37619bd61a770a1481b42be9ea75e8c3d10651a5141ef7b3056ce
Deleted: sha256:d73cc08b9992698991d5758619e6af42a2eefbce2b0ec371a8b37253fbfe2f89
Deleted: sha256:4cdd9feef510ef2ea131338b0bfe766318bbebfd5a1d4b0d1efcbd0064142edc
Deleted: sha256:4b9ee713500cb302bcd79674beb2920806c40c2992ad7eff0811b04db17f940a
Deleted: sha256:01140cc91ff784524e976c6df2cfe97a6ce1e2e642300700518e308d174c0301
Deleted: sha256:532a0465eafb810c5f9e7cc82c9f6caf9e2612347b926b7aacce535148951cf7
Deleted: sha256:047ba9b1a517cc56497fe4d66b7b06d60662c8e942c0f80ff0154d3ff7b11678
Deleted: sha256:a0d364a5f630bd7890a25ccef63100567c4d85e099454b7e217d8a9cc7cb9650
Deleted: sha256:ed49b9fa391b9a95b1be93abbe524ed973de7c8b41039d57122b8448f4f4c18a
Deleted: sha256:73e0719c6437bb1e10ba0423dd5f6d900c97f3b6644c1530eca360d0532edce0
Deleted: sha256:6bbaca127ed771e1ef6ef1959027b9ca61185f5e87d895357cb40d822e9d2668
Deleted: sha256:8d037316700bc42f77f63e3f1b89b96aeef088c63d67e9a3c7b109bc73f7d3e1
Deleted: sha256:f82cd331fd2bab0da505f86fa68df49b3652ada380d7ce5e037a00eb2449f11e
Deleted: sha256:7978218d25e49502a5224838d1e773a3ae5261eb2ad7cfd1f16f4a8d419d4896
Deleted: sha256:36191c77b0768a8c40479ccbe569af10284d93923931300dd25ce3b58966b68e
Deleted: sha256:f35e2baf667fd6e16dfaa1c58c1ac39b93a92f60d15b8dbde4b14e2851270e20
Deleted: sha256:b04a58421558f68e41363ea09b9fb49c9921996f9e56702abd7efdeba2760b2c
Deleted: sha256:dbbd766b2835b667704a91a2492a18c38adc8433052cd969f48e1ddffa9ce0e6
Deleted: sha256:0cabf753de6a678f2c7950e507c71bf97167f4d9f88f36c90359f940f4ffb640
Deleted: sha256:cd7f9dd9467bd644b4a036094816aca3261edf3491ee4791d09e6c5bc65dfb90
Build step 'Execute shell' marked build as failure

Mime
View raw message