mesos-builds mailing list archives

Site index · List index
Message view « Date » · « Thread »
Top « Date » · « Thread »
From Apache Jenkins Server <jenk...@builds.apache.org>
Subject Build failed in Jenkins: Mesos-Buildbot » autotools,clang,--verbose,GLOG_v=1 MESOS_VERBOSE=1,ubuntu:14.04,(docker||Hadoop)&&(!ubuntu-us1)&&(!ubuntu-6)&&(!ubuntu-eu2) #3110
Date Sat, 14 Jan 2017 01:48:00 GMT
See <https://builds.apache.org/job/Mesos-Buildbot/BUILDTOOL=autotools,COMPILER=clang,CONFIGURATION=--verbose,ENVIRONMENT=GLOG_v=1%20MESOS_VERBOSE=1,OS=ubuntu%3A14.04,label_exp=(docker%7C%7CHadoop)&&(!ubuntu-us1)&&(!ubuntu-6)&&(!ubuntu-eu2)/3110/changes>

Changes:

[josephwu] Windows: Fixed build script to properly report exit code.

[josephwu] Added new libprocess socket tests.

[josephwu] Fixed SSL socket 'shutdown()'.

------------------------------------------
[...truncated 171265 lines...]
I0114 01:47:38.358204 28440 containerizer.cpp:220] Using isolation: posix/cpu,posix/mem,filesystem/posix,network/cni
W0114 01:47:38.358723 28440 backend.cpp:76] Failed to create 'aufs' backend: AufsBackend requires
root privileges, but is running as user mesos
W0114 01:47:38.358882 28440 backend.cpp:76] Failed to create 'bind' backend: BindBackend requires
root privileges
I0114 01:47:38.361663 28465 slave.cpp:209] Mesos agent started on (678)@172.17.0.2:53716
I0114 01:47:38.361707 28465 slave.cpp:210] Flags at startup: --acls="" --appc_simple_discovery_uri_prefix="http://"
--appc_store_dir="/tmp/mesos/store/appc" --authenticate_http_readonly="true" --authenticate_http_readwrite="true"
--authenticatee="crammd5" --authentication_backoff_factor="1secs" --authorizer="local" --cgroups_cpu_enable_pids_and_tids_count="false"
--cgroups_enable_cfs="false" --cgroups_hierarchy="/sys/fs/cgroup" --cgroups_limit_swap="false"
--cgroups_root="mesos" --container_disk_watch_interval="15secs" --containerizers="mesos" --credential="/tmp/Endpoint_SlaveEndpointTest_AuthorizedRequest_1_uTjn6O/credential"
--default_role="*" --disk_watch_interval="1mins" --docker="docker" --docker_kill_orphans="true"
--docker_registry="https://registry-1.docker.io" --docker_remove_delay="6hrs" --docker_socket="/var/run/docker.sock"
--docker_stop_timeout="0ns" --docker_store_dir="/tmp/mesos/store/docker" --docker_volume_checkpoint_dir="/var/run/mesos/isolators/docker/volume"
--enforce_container_disk_quota="false" --executor_registration_timeout="1mins" --executor_shutdown_grace_period="5secs"
--fetcher_cache_dir="/tmp/Endpoint_SlaveEndpointTest_AuthorizedRequest_1_uTjn6O/fetch" --fetcher_cache_size="2GB"
--frameworks_home="" --gc_delay="1weeks" --gc_disk_headroom="0.1" --hadoop_home="" --help="false"
--hostname_lookup="true" --http_authenticators="basic" --http_command_executor="false" --http_credentials="/tmp/Endpoint_SlaveEndpointTest_AuthorizedRequest_1_uTjn6O/http_credentials"
--http_heartbeat_interval="30secs" --image_provisioner_backend="copy" --initialize_driver_logging="true"
--isolation="posix/cpu,posix/mem" --launcher="posix" --launcher_dir="/mesos/mesos-1.2.0/_build/src"
--logbufsecs="0" --logging_level="INFO" --max_completed_executors_per_framework="150" --oversubscribed_resources_interval="15secs"
--perf_duration="10secs" --perf_interval="1mins" --qos_correction_interval_min="0ns" --quiet="false"
--recover="reconnect" --recovery_timeout="15mins" --registration_backoff_factor="10ms" --resources="cpus:2;gpus:0;mem:1024;disk:1024;ports:[31000-32000]"
--revocable_cpu_low_priority="true" --runtime_dir="/tmp/Endpoint_SlaveEndpointTest_AuthorizedRequest_1_uTjn6O"
--sandbox_directory="/mnt/mesos/sandbox" --strict="true" --switch_user="true" --systemd_enable_support="true"
--systemd_runtime_directory="/run/systemd/system" --version="false" --work_dir="/tmp/Endpoint_SlaveEndpointTest_AuthorizedRequest_1_KRumkk"
I0114 01:47:38.362462 28465 credentials.hpp:86] Loading credential for authentication from
'/tmp/Endpoint_SlaveEndpointTest_AuthorizedRequest_1_uTjn6O/credential'
I0114 01:47:38.362663 28465 slave.cpp:352] Agent using credential for: test-principal
I0114 01:47:38.362710 28465 credentials.hpp:37] Loading credentials for authentication from
'/tmp/Endpoint_SlaveEndpointTest_AuthorizedRequest_1_uTjn6O/http_credentials'
I0114 01:47:38.362962 28465 http.cpp:922] Using default 'basic' HTTP authenticator for realm
'mesos-agent-readonly'
I0114 01:47:38.363106 28465 http.cpp:922] Using default 'basic' HTTP authenticator for realm
'mesos-agent-readwrite'
I0114 01:47:38.364048 28465 slave.cpp:539] Agent resources: cpus(*):2; mem(*):1024; disk(*):1024;
ports(*):[31000-32000]
I0114 01:47:38.364120 28465 slave.cpp:547] Agent attributes: [  ]
I0114 01:47:38.364133 28465 slave.cpp:552] Agent hostname: de85c123cdea
I0114 01:47:38.365485 28473 state.cpp:60] Recovering state from '/tmp/Endpoint_SlaveEndpointTest_AuthorizedRequest_1_KRumkk/meta'
I0114 01:47:38.365813 28462 status_update_manager.cpp:203] Recovering status update manager
I0114 01:47:38.366052 28458 containerizer.cpp:599] Recovering containerizer
I0114 01:47:38.367254 28458 provisioner.cpp:251] Provisioner recovery complete
I0114 01:47:38.367625 28473 slave.cpp:5417] Finished recovery
I0114 01:47:38.368191 28473 slave.cpp:5591] Querying resource estimator for oversubscribable
resources
I0114 01:47:38.368422 28458 slave.cpp:5605] Received oversubscribable resources {} from the
resource estimator
I0114 01:47:38.370703 28469 process.cpp:3676] Handling HTTP event for process 'slave(678)'
with path: '/slave(678)/monitor/statistics.json'
I0114 01:47:38.371940 28473 http.cpp:874] Authorizing principal 'test-principal' to GET the
'/monitor/statistics.json' endpoint
I0114 01:47:38.375180 28459 slave.cpp:796] Agent terminating
[       OK ] Endpoint/SlaveEndpointTest.AuthorizedRequest/1 (26 ms)
[ RUN      ] Endpoint/SlaveEndpointTest.AuthorizedRequest/2
I0114 01:47:38.384685 28440 containerizer.cpp:220] Using isolation: posix/cpu,posix/mem,filesystem/posix,network/cni
W0114 01:47:38.385205 28440 backend.cpp:76] Failed to create 'aufs' backend: AufsBackend requires
root privileges, but is running as user mesos
W0114 01:47:38.385347 28440 backend.cpp:76] Failed to create 'bind' backend: BindBackend requires
root privileges
I0114 01:47:38.388178 28473 slave.cpp:209] Mesos agent started on (679)@172.17.0.2:53716
I0114 01:47:38.388219 28473 slave.cpp:210] Flags at startup: --acls="" --appc_simple_discovery_uri_prefix="http://"
--appc_store_dir="/tmp/mesos/store/appc" --authenticate_http_readonly="true" --authenticate_http_readwrite="true"
--authenticatee="crammd5" --authentication_backoff_factor="1secs" --authorizer="local" --cgroups_cpu_enable_pids_and_tids_count="false"
--cgroups_enable_cfs="false" --cgroups_hierarchy="/sys/fs/cgroup" --cgroups_limit_swap="false"
--cgroups_root="mesos" --container_disk_watch_interval="15secs" --containerizers="mesos" --credential="/tmp/Endpoint_SlaveEndpointTest_AuthorizedRequest_2_dyHRqO/credential"
--default_role="*" --disk_watch_interval="1mins" --docker="docker" --docker_kill_orphans="true"
--docker_registry="https://registry-1.docker.io" --docker_remove_delay="6hrs" --docker_socket="/var/run/docker.sock"
--docker_stop_timeout="0ns" --docker_store_dir="/tmp/mesos/store/docker" --docker_volume_checkpoint_dir="/var/run/mesos/isolators/docker/volume"
--enforce_container_disk_quota="false" --executor_registration_timeout="1mins" --executor_shutdown_grace_period="5secs"
--fetcher_cache_dir="/tmp/Endpoint_SlaveEndpointTest_AuthorizedRequest_2_dyHRqO/fetch" --fetcher_cache_size="2GB"
--frameworks_home="" --gc_delay="1weeks" --gc_disk_headroom="0.1" --hadoop_home="" --help="false"
--hostname_lookup="true" --http_authenticators="basic" --http_command_executor="false" --http_credentials="/tmp/Endpoint_SlaveEndpointTest_AuthorizedRequest_2_dyHRqO/http_credentials"
--http_heartbeat_interval="30secs" --image_provisioner_backend="copy" --initialize_driver_logging="true"
--isolation="posix/cpu,posix/mem" --launcher="posix" --launcher_dir="/mesos/mesos-1.2.0/_build/src"
--logbufsecs="0" --logging_level="INFO" --max_completed_executors_per_framework="150" --oversubscribed_resources_interval="15secs"
--perf_duration="10secs" --perf_interval="1mins" --qos_correction_interval_min="0ns" --quiet="false"
--recover="reconnect" --recovery_timeout="15mins" --registration_backoff_factor="10ms" --resources="cpus:2;gpus:0;mem:1024;disk:1024;ports:[31000-32000]"
--revocable_cpu_low_priority="true" --runtime_dir="/tmp/Endpoint_SlaveEndpointTest_AuthorizedRequest_2_dyHRqO"
--sandbox_directory="/mnt/mesos/sandbox" --strict="true" --switch_user="true" --systemd_enable_support="true"
--systemd_runtime_directory="/run/systemd/system" --version="false" --work_dir="/tmp/Endpoint_SlaveEndpointTest_AuthorizedRequest_2_BuxzAj"
I0114 01:47:38.389024 28473 credentials.hpp:86] Loading credential for authentication from
'/tmp/Endpoint_SlaveEndpointTest_AuthorizedRequest_2_dyHRqO/credential'
I0114 01:47:38.389237 28473 slave.cpp:352] Agent using credential for: test-principal
I0114 01:47:38.389263 28473 credentials.hpp:37] Loading credentials for authentication from
'/tmp/Endpoint_SlaveEndpointTest_AuthorizedRequest_2_dyHRqO/http_credentials'
I0114 01:47:38.389533 28473 http.cpp:922] Using default 'basic' HTTP authenticator for realm
'mesos-agent-readonly'
I0114 01:47:38.389680 28473 http.cpp:922] Using default 'basic' HTTP authenticator for realm
'mesos-agent-readwrite'
I0114 01:47:38.390715 28473 slave.cpp:539] Agent resources: cpus(*):2; mem(*):1024; disk(*):1024;
ports(*):[31000-32000]
I0114 01:47:38.390787 28473 slave.cpp:547] Agent attributes: [  ]
I0114 01:47:38.390807 28473 slave.cpp:552] Agent hostname: de85c123cdea
I0114 01:47:38.392395 28461 state.cpp:60] Recovering state from '/tmp/Endpoint_SlaveEndpointTest_AuthorizedRequest_2_BuxzAj/meta'
I0114 01:47:38.392643 28469 status_update_manager.cpp:203] Recovering status update manager
I0114 01:47:38.392850 28464 containerizer.cpp:599] Recovering containerizer
I0114 01:47:38.394301 28460 provisioner.cpp:251] Provisioner recovery complete
I0114 01:47:38.394639 28468 slave.cpp:5417] Finished recovery
I0114 01:47:38.395175 28468 slave.cpp:5591] Querying resource estimator for oversubscribable
resources
I0114 01:47:38.395570 28470 slave.cpp:5605] Received oversubscribable resources {} from the
resource estimator
I0114 01:47:38.397887 28462 process.cpp:3676] Handling HTTP event for process 'slave(679)'
with path: '/slave(679)/containers'
I0114 01:47:38.399046 28466 http.cpp:874] Authorizing principal 'test-principal' to GET the
'/containers' endpoint
I0114 01:47:38.401875 28440 slave.cpp:796] Agent terminating
[       OK ] Endpoint/SlaveEndpointTest.AuthorizedRequest/2 (25 ms)
[ RUN      ] Endpoint/SlaveEndpointTest.UnauthorizedRequest/0
I0114 01:47:38.410306 28440 containerizer.cpp:220] Using isolation: posix/cpu,posix/mem,filesystem/posix,network/cni
W0114 01:47:38.410827 28440 backend.cpp:76] Failed to create 'aufs' backend: AufsBackend requires
root privileges, but is running as user mesos
W0114 01:47:38.410977 28440 backend.cpp:76] Failed to create 'bind' backend: BindBackend requires
root privileges
I0114 01:47:38.413766 28464 slave.cpp:209] Mesos agent started on (680)@172.17.0.2:53716
I0114 01:47:38.413810 28464 slave.cpp:210] Flags at startup: --acls="" --appc_simple_discovery_uri_prefix="http://"
--appc_store_dir="/tmp/mesos/store/appc" --authenticate_http_readonly="true" --authenticate_http_readwrite="true"
--authenticatee="crammd5" --authentication_backoff_factor="1secs" --authorizer="local" --cgroups_cpu_enable_pids_and_tids_count="false"
--cgroups_enable_cfs="false" --cgroups_hierarchy="/sys/fs/cgroup" --cgroups_limit_swap="false"
--cgroups_root="mesos" --container_disk_watch_interval="15secs" --containerizers="mesos" --credential="/tmp/Endpoint_SlaveEndpointTest_UnauthorizedRequest_0_JHHd2N/credential"
--default_role="*" --disk_watch_interval="1mins" --docker="docker" --docker_kill_orphans="true"
--docker_registry="https://registry-1.docker.io" --docker_remove_delay="6hrs" --docker_socket="/var/run/docker.sock"
--docker_stop_timeout="0ns" --docker_store_dir="/tmp/mesos/store/docker" --docker_volume_checkpoint_dir="/var/run/mesos/isolators/docker/volume"
--enforce_container_disk_quota="false" --executor_registration_timeout="1mins" --executor_shutdown_grace_period="5secs"
--fetcher_cache_dir="/tmp/Endpoint_SlaveEndpointTest_UnauthorizedRequest_0_JHHd2N/fetch" --fetcher_cache_size="2GB"
--frameworks_home="" --gc_delay="1weeks" --gc_disk_headroom="0.1" --hadoop_home="" --help="false"
--hostname_lookup="true" --http_authenticators="basic" --http_command_executor="false" --http_credentials="/tmp/Endpoint_SlaveEndpointTest_UnauthorizedRequest_0_JHHd2N/http_credentials"
--http_heartbeat_interval="30secs" --image_provisioner_backend="copy" --initialize_driver_logging="true"
--isolation="posix/cpu,posix/mem" --launcher="posix" --launcher_dir="/mesos/mesos-1.2.0/_build/src"
--logbufsecs="0" --logging_level="INFO" --max_completed_executors_per_framework="150" --oversubscribed_resources_interval="15secs"
--perf_duration="10secs" --perf_interval="1mins" --qos_correction_interval_min="0ns" --quiet="false"
--recover="reconnect" --recovery_timeout="15mins" --registration_backoff_factor="10ms" --resources="cpus:2;gpus:0;mem:1024;disk:1024;ports:[31000-32000]"
--revocable_cpu_low_priority="true" --runtime_dir="/tmp/Endpoint_SlaveEndpointTest_UnauthorizedRequest_0_JHHd2N"
--sandbox_directory="/mnt/mesos/sandbox" --strict="true" --switch_user="true" --systemd_enable_support="true"
--systemd_runtime_directory="/run/systemd/system" --version="false" --work_dir="/tmp/Endpoint_SlaveEndpointTest_UnauthorizedRequest_0_8xiL7i"
I0114 01:47:38.414530 28464 credentials.hpp:86] Loading credential for authentication from
'/tmp/Endpoint_SlaveEndpointTest_UnauthorizedRequest_0_JHHd2N/credential'
I0114 01:47:38.414731 28464 slave.cpp:352] Agent using credential for: test-principal
I0114 01:47:38.414758 28464 credentials.hpp:37] Loading credentials for authentication from
'/tmp/Endpoint_SlaveEndpointTest_UnauthorizedRequest_0_JHHd2N/http_credentials'
I0114 01:47:38.415036 28464 http.cpp:922] Using default 'basic' HTTP authenticator for realm
'mesos-agent-readonly'
I0114 01:47:38.415204 28464 http.cpp:922] Using default 'basic' HTTP authenticator for realm
'mesos-agent-readwrite'
I0114 01:47:38.416738 28464 slave.cpp:539] Agent resources: cpus(*):2; mem(*):1024; disk(*):1024;
ports(*):[31000-32000]
I0114 01:47:38.416859 28464 slave.cpp:547] Agent attributes: [  ]
I0114 01:47:38.417055 28464 slave.cpp:552] Agent hostname: de85c123cdea
I0114 01:47:38.418954 28468 state.cpp:60] Recovering state from '/tmp/Endpoint_SlaveEndpointTest_UnauthorizedRequest_0_8xiL7i/meta'
I0114 01:47:38.419209 28472 status_update_manager.cpp:203] Recovering status update manager
I0114 01:47:38.419432 28463 containerizer.cpp:599] Recovering containerizer
I0114 01:47:38.420680 28468 provisioner.cpp:251] Provisioner recovery complete
I0114 01:47:38.421016 28463 slave.cpp:5417] Finished recovery
I0114 01:47:38.421597 28463 slave.cpp:5591] Querying resource estimator for oversubscribable
resources
I0114 01:47:38.421840 28459 slave.cpp:5605] Received oversubscribable resources {} from the
resource estimator
I0114 01:47:38.424183 28468 process.cpp:3676] Handling HTTP event for process 'slave(680)'
with path: '/slave(680)/monitor/statistics'
I0114 01:47:38.425354 28461 http.cpp:874] Authorizing principal 'test-principal' to GET the
'/monitor/statistics' endpoint
I0114 01:47:38.427459 28471 slave.cpp:796] Agent terminating
[       OK ] Endpoint/SlaveEndpointTest.UnauthorizedRequest/0 (25 ms)
[ RUN      ] Endpoint/SlaveEndpointTest.UnauthorizedRequest/1
I0114 01:47:38.436399 28440 containerizer.cpp:220] Using isolation: posix/cpu,posix/mem,filesystem/posix,network/cni
W0114 01:47:38.436929 28440 backend.cpp:76] Failed to create 'aufs' backend: AufsBackend requires
root privileges, but is running as user mesos
W0114 01:47:38.437089 28440 backend.cpp:76] Failed to create 'bind' backend: BindBackend requires
root privileges
I0114 01:47:38.439872 28459 slave.cpp:209] Mesos agent started on (681)@172.17.0.2:53716
I0114 01:47:38.439956 28459 slave.cpp:210] Flags at startup: --acls="" --appc_simple_discovery_uri_prefix="http://"
--appc_store_dir="/tmp/mesos/store/appc" --authenticate_http_readonly="true" --authenticate_http_readwrite="true"
--authenticatee="crammd5" --authentication_backoff_factor="1secs" --authorizer="local" --cgroups_cpu_enable_pids_and_tids_count="false"
--cgroups_enable_cfs="false" --cgroups_hierarchy="/sys/fs/cgroup" --cgroups_limit_swap="false"
--cgroups_root="mesos" --container_disk_watch_interval="15secs" --containerizers="mesos" --credential="/tmp/Endpoint_SlaveEndpointTest_UnauthorizedRequest_1_9F6EUN/credential"
--default_role="*" --disk_watch_interval="1mins" --docker="docker" --docker_kill_orphans="true"
--docker_registry="https://registry-1.docker.io" --docker_remove_delay="6hrs" --docker_socket="/var/run/docker.sock"
--docker_stop_timeout="0ns" --docker_store_dir="/tmp/mesos/store/docker" --docker_volume_checkpoint_dir="/var/run/mesos/isolators/docker/volume"
--enforce_container_disk_quota="false" --executor_registration_timeout="1mins" --executor_shutdown_grace_period="5secs"
--fetcher_cache_dir="/tmp/Endpoint_SlaveEndpointTest_UnauthorizedRequest_1_9F6EUN/fetch" --fetcher_cache_size="2GB"
--frameworks_home="" --gc_delay="1weeks" --gc_disk_headroom="0.1" --hadoop_home="" --help="false"
--hostname_lookup="true" --http_authenticators="basic" --http_command_executor="false" --http_credentials="/tmp/Endpoint_SlaveEndpointTest_UnauthorizedRequest_1_9F6EUN/http_credentials"
--http_heartbeat_interval="30secs" --image_provisioner_backend="copy" --initialize_driver_logging="true"
--isolation="posix/cpu,posix/mem" --launcher="posix" --launcher_dir="/mesos/mesos-1.2.0/_build/src"
--logbufsecs="0" --logging_level="INFO" --max_completed_executors_per_framework="150" --oversubscribed_resources_interval="15secs"
--perf_duration="10secs" --perf_interval="1mins" --qos_correction_interval_min="0ns" --quiet="false"
--recover="reconnect" --recovery_timeout="15mins" --registration_backoff_factor="10ms" --resources="cpus:2;gpus:0;mem:1024;disk:1024;ports:[31000-32000]"
--revocable_cpu_low_priority="true" --runtime_dir="/tmp/Endpoint_SlaveEndpointTest_UnauthorizedRequest_1_9F6EUN"
--sandbox_directory="/mnt/mesos/sandbox" --strict="true" --switch_user="true" --systemd_enable_support="true"
--systemd_runtime_directory="/run/systemd/system" --version="false" --work_dir="/tmp/Endpoint_SlaveEndpointTest_UnauthorizedRequest_1_xuXVVi"
I0114 01:47:38.440852 28459 credentials.hpp:86] Loading credential for authentication from
'/tmp/Endpoint_SlaveEndpointTest_UnauthorizedRequest_1_9F6EUN/credential'
I0114 01:47:38.441325 28459 slave.cpp:352] Agent using credential for: test-principal
I0114 01:47:38.441504 28459 credentials.hpp:37] Loading credentials for authentication from
'/tmp/Endpoint_SlaveEndpointTest_UnauthorizedRequest_1_9F6EUN/http_credentials'
I0114 01:47:38.441939 28459 http.cpp:922] Using default 'basic' HTTP authenticator for realm
'mesos-agent-readonly'
I0114 01:47:38.442319 28459 http.cpp:922] Using default 'basic' HTTP authenticator for realm
'mesos-agent-readwrite'
I0114 01:47:38.444154 28459 slave.cpp:539] Agent resources: cpus(*):2; mem(*):1024; disk(*):1024;
ports(*):[31000-32000]
I0114 01:47:38.444425 28459 slave.cpp:547] Agent attributes: [  ]
I0114 01:47:38.444582 28459 slave.cpp:552] Agent hostname: de85c123cdea
I0114 01:47:38.446848 28467 state.cpp:60] Recovering state from '/tmp/Endpoint_SlaveEndpointTest_UnauthorizedRequest_1_xuXVVi/meta'
I0114 01:47:38.447247 28469 status_update_manager.cpp:203] Recovering status update manager
I0114 01:47:38.447463 28458 containerizer.cpp:599] Recovering containerizer
I0114 01:47:38.448994 28463 provisioner.cpp:251] Provisioner recovery complete
I0114 01:47:38.449389 28458 slave.cpp:5417] Finished recovery
I0114 01:47:38.449903 28458 slave.cpp:5591] Querying resource estimator for oversubscribable
resources
I0114 01:47:38.450261 28467 slave.cpp:5605] Received oversubscribable resources {} from the
resource estimator
I0114 01:47:38.452812 28466 process.cpp:3676] Handling HTTP event for process 'slave(681)'
with path: '/slave(681)/monitor/statistics.json'
I0114 01:47:38.454126 28465 http.cpp:874] Authorizing principal 'test-principal' to GET the
'/monitor/statistics.json' endpoint
I0114 01:47:38.456202 28462 slave.cpp:796] Agent terminating
[       OK ] Endpoint/SlaveEndpointTest.UnauthorizedRequest/1 (29 ms)
[ RUN      ] Endpoint/SlaveEndpointTest.UnauthorizedRequest/2
I0114 01:47:38.465849 28440 containerizer.cpp:220] Using isolation: posix/cpu,posix/mem,filesystem/posix,network/cni
W0114 01:47:38.466351 28440 backend.cpp:76] Failed to create 'aufs' backend: AufsBackend requires
root privileges, but is running as user mesos
W0114 01:47:38.466511 28440 backend.cpp:76] Failed to create 'bind' backend: BindBackend requires
root privileges
I0114 01:47:38.469415 28467 slave.cpp:209] Mesos agent started on (682)@172.17.0.2:53716
I0114 01:47:38.469480 28467 slave.cpp:210] Flags at startup: --acls="" --appc_simple_discovery_uri_prefix="http://"
--appc_store_dir="/tmp/mesos/store/appc" --authenticate_http_readonly="true" --authenticate_http_readwrite="true"
--authenticatee="crammd5" --authentication_backoff_factor="1secs" --authorizer="local" --cgroups_cpu_enable_pids_and_tids_count="false"
--cgroups_enable_cfs="false" --cgroups_hierarchy="/sys/fs/cgroup" --cgroups_limit_swap="false"
--cgroups_root="mesos" --container_disk_watch_interval="15secs" --containerizers="mesos" --credential="/tmp/Endpoint_SlaveEndpointTest_UnauthorizedRequest_2_vaM15N/credential"
--default_role="*" --disk_watch_interval="1mins" --docker="docker" --docker_kill_orphans="true"
--docker_registry="https://registry-1.docker.io" --docker_remove_delay="6hrs" --docker_socket="/var/run/docker.sock"
--docker_stop_timeout="0ns" --docker_store_dir="/tmp/mesos/store/docker" --docker_volume_checkpoint_dir="/var/run/mesos/isolators/docker/volume"
--enforce_container_disk_quota="false" --executor_registration_timeout="1mins" --executor_shutdown_grace_period="5secs"
--fetcher_cache_dir="/tmp/Endpoint_SlaveEndpointTest_UnauthorizedRequest_2_vaM15N/fetch" --fetcher_cache_size="2GB"
--frameworks_home="" --gc_delay="1weeks" --gc_disk_headroom="0.1" --hadoop_home="" --help="false"
--hostname_lookup="true" --http_authenticators="basic" --http_command_executor="false" --http_credentials="/tmp/Endpoint_SlaveEndpointTest_UnauthorizedRequest_2_vaM15N/http_credentials"
--http_heartbeat_interval="30secs" --image_provisioner_backend="copy" --initialize_driver_logging="true"
--isolation="posix/cpu,posix/mem" --launcher="posix" --launcher_dir="/mesos/mesos-1.2.0/_build/src"
--logbufsecs="0" --logging_level="INFO" --max_completed_executors_per_framework="150" --oversubscribed_resources_interval="15secs"
--perf_duration="10secs" --perf_interval="1mins" --qos_correction_interval_min="0ns" --quiet="false"
--recover="reconnect" --recovery_timeout="15mins" --registration_backoff_factor="10ms" --resources="cpus:2;gpus:0;mem:1024;disk:1024;ports:[31000-32000]"
--revocable_cpu_low_priority="true" --runtime_dir="/tmp/Endpoint_SlaveEndpointTest_UnauthorizedRequest_2_vaM15N"
--sandbox_directory="/mnt/mesos/sandbox" --strict="true" --switch_user="true" --systemd_enable_support="true"
--systemd_runtime_directory="/run/systemd/system" --version="false" --work_dir="/tmp/Endpoint_SlaveEndpointTest_UnauthorizedRequest_2_Bh8w2i"
I0114 01:47:38.470235 28467 credentials.hpp:86] Loading credential for authentication from
'/tmp/Endpoint_SlaveEndpointTest_UnauthorizedRequest_2_vaM15N/credential'
I0114 01:47:38.470453 28467 slave.cpp:352] Agent using credential for: test-principal
I0114 01:47:38.470479 28467 credentials.hpp:37] Loading credentials for authentication from
'/tmp/Endpoint_SlaveEndpointTest_UnauthorizedRequest_2_vaM15N/http_credentials'
I0114 01:47:38.470710 28467 http.cpp:922] Using default 'basic' HTTP authenticator for realm
'mesos-agent-readonly'
I0114 01:47:38.470847 28467 http.cpp:922] Using default 'basic' HTTP authenticator for realm
'mesos-agent-readwrite'
I0114 01:47:38.471813 28467 slave.cpp:539] Agent resources: cpus(*):2; mem(*):1024; disk(*):1024;
ports(*):[31000-32000]
I0114 01:47:38.471885 28467 slave.cpp:547] Agent attributes: [  ]
I0114 01:47:38.471899 28467 slave.cpp:552] Agent hostname: de85c123cdea
I0114 01:47:38.473394 28472 state.cpp:60] Recovering state from '/tmp/Endpoint_SlaveEndpointTest_UnauthorizedRequest_2_Bh8w2i/meta'
I0114 01:47:38.473646 28465 status_update_manager.cpp:203] Recovering status update manager
I0114 01:47:38.473918 28464 containerizer.cpp:599] Recovering containerizer
I0114 01:47:38.475409 28464 provisioner.cpp:251] Provisioner recovery complete
I0114 01:47:38.475826 28462 slave.cpp:5417] Finished recovery
I0114 01:47:38.476397 28462 slave.cpp:5591] Querying resource estimator for oversubscribable
resources
I0114 01:47:38.476655 28468 slave.cpp:5605] Received oversubscribable resources {} from the
resource estimator
I0114 01:47:38.479084 28470 process.cpp:3676] Handling HTTP event for process 'slave(682)'
with path: '/slave(682)/containers'
I0114 01:47:38.480309 28468 http.cpp:874] Authorizing principal 'test-principal' to GET the
'/containers' endpoint
I0114 01:47:38.482398 28468 slave.cpp:796] Agent terminating
[       OK ] Endpoint/SlaveEndpointTest.UnauthorizedRequest/2 (26 ms)
[ RUN      ] Endpoint/SlaveEndpointTest.NoAuthorizer/0
I0114 01:47:38.494607 28440 containerizer.cpp:220] Using isolation: posix/cpu,posix/mem,filesystem/posix,network/cni
W0114 01:47:38.495311 28440 backend.cpp:76] Failed to create 'aufs' backend: AufsBackend requires
root privileges, but is running as user mesos
W0114 01:47:38.495486 28440 backend.cpp:76] Failed to create 'bind' backend: BindBackend requires
root privileges
I0114 01:47:38.497433 28440 cluster.cpp:446] Creating default 'local' authorizer
I0114 01:47:38.499579 28458 slave.cpp:209] Mesos agent started on (683)@172.17.0.2:53716
I0114 01:47:38.499621 28458 slave.cpp:210] Flags at startup: --acls="" --appc_simple_discovery_uri_prefix="http://"
--appc_store_dir="/tmp/mesos/store/appc" --authenticate_http_readonly="true" --authenticate_http_readwrite="true"
--authenticatee="crammd5" --authentication_backoff_factor="1secs" --authorizer="local" --cgroups_cpu_enable_pids_and_tids_count="false"
--cgroups_enable_cfs="false" --cgroups_hierarchy="/sys/fs/cgroup" --cgroups_limit_swap="false"
--cgroups_root="mesos" --container_disk_watch_interval="15secs" --containerizers="mesos" --credential="/tmp/Endpoint_SlaveEndpointTest_NoAuthorizer_0_lkBTyO/credential"
--default_role="*" --disk_watch_interval="1mins" --docker="docker" --docker_kill_orphans="true"
--docker_registry="https://registry-1.docker.io" --docker_remove_delay="6hrs" --docker_socket="/var/run/docker.sock"
--docker_stop_timeout="0ns" --docker_store_dir="/tmp/mesos/store/docker" --docker_volume_checkpoint_dir="/var/run/mesos/isolators/docker/volume"
--enforce_container_disk_quota="false" --executor_registration_timeout="1mins" --executor_shutdown_grace_period="5secs"
--fetcher_cache_dir="/tmp/Endpoint_SlaveEndpointTest_NoAuthorizer_0_lkBTyO/fetch" --fetcher_cache_size="2GB"
--frameworks_home="" --gc_delay="1weeks" --gc_disk_headroom="0.1" --hadoop_home="" --help="false"
--hostname_lookup="true" --http_authenticators="basic" --http_command_executor="false" --http_credentials="/tmp/Endpoint_SlaveEndpointTest_NoAuthorizer_0_lkBTyO/http_credentials"
--http_heartbeat_interval="30secs" --image_provisioner_backend="copy" --initialize_driver_logging="true"
--isolation="posix/cpu,posix/mem" --launcher="posix" --launcher_dir="/mesos/mesos-1.2.0/_build/src"
--logbufsecs="0" --logging_level="INFO" --max_completed_executors_per_framework="150" --oversubscribed_resources_interval="15secs"
--perf_duration="10secs" --perf_interval="1mins" --qos_correction_interval_min="0ns" --quiet="false"
--recover="reconnect" --recovery_timeout="15mins" --registration_backoff_factor="10ms" --resources="cpus:2;gpus:0;mem:1024;disk:1024;ports:[31000-32000]"
--revocable_cpu_low_priority="true" --runtime_dir="/tmp/Endpoint_SlaveEndpointTest_NoAuthorizer_0_lkBTyO"
--sandbox_directory="/mnt/mesos/sandbox" --strict="true" --switch_user="true" --systemd_enable_support="true"
--systemd_runtime_directory="/run/systemd/system" --version="false" --work_dir="/tmp/Endpoint_SlaveEndpointTest_NoAuthorizer_0_P6kXqj"
I0114 01:47:38.500172 28458 credentials.hpp:86] Loading credential for authentication from
'/tmp/Endpoint_SlaveEndpointTest_NoAuthorizer_0_lkBTyO/credential'
I0114 01:47:38.500349 28458 slave.cpp:352] Agent using credential for: test-principal
I0114 01:47:38.500370 28458 credentials.hpp:37] Loading credentials for authentication from
'/tmp/Endpoint_SlaveEndpointTest_NoAuthorizer_0_lkBTyO/http_credentials'
I0114 01:47:38.500588 28458 http.cpp:922] Using default 'basic' HTTP authenticator for realm
'mesos-agent-readonly'
I0114 01:47:38.500831 28458 http.cpp:922] Using default 'basic' HTTP authenticator for realm
'mesos-agent-readwrite'
I0114 01:47:38.501940 28458 slave.cpp:539] Agent resources: cpus(*):2; mem(*):1024; disk(*):1024;
ports(*):[31000-32000]
I0114 01:47:38.502014 28458 slave.cpp:547] Agent attributes: [  ]
I0114 01:47:38.502065 28458 slave.cpp:552] Agent hostname: de85c123cdea
I0114 01:47:38.503468 28463 state.cpp:60] Recovering state from '/tmp/Endpoint_SlaveEndpointTest_NoAuthorizer_0_P6kXqj/meta'
I0114 01:47:38.503769 28459 status_update_manager.cpp:203] Recovering status update manager
I0114 01:47:38.504137 28464 containerizer.cpp:599] Recovering containerizer
I0114 01:47:38.505581 28472 provisioner.cpp:251] Provisioner recovery complete
I0114 01:47:38.506103 28465 slave.cpp:5417] Finished recovery
I0114 01:47:38.507129 28465 slave.cpp:5591] Querying resource estimator for oversubscribable
resources
I0114 01:47:38.507539 28464 slave.cpp:5605] Received oversubscribable resources {} from the
resource estimator
I0114 01:47:38.509837 28463 process.cpp:3676] Handling HTTP event for process 'slave(683)'
with path: '/slave(683)/monitor/statistics'
I0114 01:47:38.511212 28467 http.cpp:874] Authorizing principal 'test-principal' to GET the
'/monitor/statistics' endpoint
I0114 01:47:38.514603 28469 slave.cpp:796] Agent terminating
[       OK ] Endpoint/SlaveEndpointTest.NoAuthorizer/0 (31 ms)
[ RUN      ] Endpoint/SlaveEndpointTest.NoAuthorizer/1
I0114 01:47:38.528430 28440 containerizer.cpp:220] Using isolation: posix/cpu,posix/mem,filesystem/posix,network/cni
W0114 01:47:38.529444 28440 backend.cpp:76] Failed to create 'aufs' backend: AufsBackend requires
root privileges, but is running as user mesos
W0114 01:47:38.529804 28440 backend.cpp:76] Failed to create 'bind' backend: BindBackend requires
root privileges
I0114 01:47:38.531477 28440 cluster.cpp:446] Creating default 'local' authorizer
I0114 01:47:38.533401 28461 slave.cpp:209] Mesos agent started on (684)@172.17.0.2:53716
I0114 01:47:38.533442 28461 slave.cpp:210] Flags at startup: --acls="" --appc_simple_discovery_uri_prefix="http://"
--appc_store_dir="/tmp/mesos/store/appc" --authenticate_http_readonly="true" --authenticate_http_readwrite="true"
--authenticatee="crammd5" --authentication_backoff_factor="1secs" --authorizer="local" --cgroups_cpu_enable_pids_and_tids_count="false"
--cgroups_enable_cfs="false" --cgroups_hierarchy="/sys/fs/cgroup" --cgroups_limit_swap="false"
--cgroups_root="mesos" --container_disk_watch_interval="15secs" --containerizers="mesos" --credential="/tmp/Endpoint_SlaveEndpointTest_NoAuthorizer_1_FXrTmP/credential"
--default_role="*" --disk_watch_interval="1mins" --docker="docker" --docker_kill_orphans="true"
--docker_registry="https://registry-1.docker.io" --docker_remove_delay="6hrs" --docker_socket="/var/run/docker.sock"
--docker_stop_timeout="0ns" --docker_store_dir="/tmp/mesos/store/docker" --docker_volume_checkpoint_dir="/var/run/mesos/isolators/docker/volume"
--enforce_container_disk_quota="false" --executor_registration_timeout="1mins" --executor_shutdown_grace_period="5secs"
--fetcher_cache_dir="/tmp/Endpoint_SlaveEndpointTest_NoAuthorizer_1_FXrTmP/fetch" --fetcher_cache_size="2GB"
--frameworks_home="" --gc_delay="1weeks" --gc_disk_headroom="0.1" --hadoop_home="" --help="false"
--hostname_lookup="true" --http_authenticators="basic" --http_command_executor="false" --http_credentials="/tmp/Endpoint_SlaveEndpointTest_NoAuthorizer_1_FXrTmP/http_credentials"
--http_heartbeat_interval="30secs" --image_provisioner_backend="copy" --initialize_driver_logging="true"
--isolation="posix/cpu,posix/mem" --launcher="posix" --launcher_dir="/mesos/mesos-1.2.0/_build/src"
--logbufsecs="0" --logging_level="INFO" --max_completed_executors_per_framework="150" --oversubscribed_resources_interval="15secs"
--perf_duration="10secs" --perf_interval="1mins" --qos_correction_interval_min="0ns" --quiet="false"
--recover="reconnect" --recovery_timeout="15mins" --registration_backoff_factor="10ms" --resources="cpus:2;gpus:0;mem:1024;disk:1024;ports:[31000-32000]"
--revocable_cpu_low_priority="true" --runtime_dir="/tmp/Endpoint_SlaveEndpointTest_NoAuthorizer_1_FXrTmP"
--sandbox_directory="/mnt/mesos/sandbox" --strict="true" --switch_user="true" --systemd_enable_support="true"
--systemd_runtime_directory="/run/systemd/system" --version="false" --work_dir="/tmp/Endpoint_SlaveEndpointTest_NoAuthorizer_1_LUJx9j"
I0114 01:47:38.534129 28461 credentials.hpp:86] Loading credential for authentication from
'/tmp/Endpoint_SlaveEndpointTest_NoAuthorizer_1_FXrTmP/credential'
I0114 01:47:38.534327 28461 slave.cpp:352] Agent using credential for: test-principal
I0114 01:47:38.534358 28461 credentials.hpp:37] Loading credentials for authentication from
'/tmp/Endpoint_SlaveEndpointTest_NoAuthorizer_1_FXrTmP/http_credentials'
I0114 01:47:38.534600 28461 http.cpp:922] Using default 'basic' HTTP authenticator for realm
'mesos-agent-readonly'
I0114 01:47:38.534811 28461 http.cpp:922] Using default 'basic' HTTP authenticator for realm
'mesos-agent-readwrite'
I0114 01:47:38.535854 28461 slave.cpp:539] Agent resources: cpus(*):2; mem(*):1024; disk(*):1024;
ports(*):[31000-32000]
I0114 01:47:38.535924 28461 slave.cpp:547] Agent attributes: [  ]
I0114 01:47:38.535938 28461 slave.cpp:552] Agent hostname: de85c123cdea
I0114 01:47:38.537513 28467 state.cpp:60] Recovering state from '/tmp/Endpoint_SlaveEndpointTest_NoAuthorizer_1_LUJx9j/meta'
I0114 01:47:38.537784 28465 status_update_manager.cpp:203] Recovering status update manager
I0114 01:47:38.538017 28467 containerizer.cpp:599] Recovering containerizer
I0114 01:47:38.539424 28470 provisioner.cpp:251] Provisioner recovery complete
I0114 01:47:38.539752 28468 slave.cpp:5417] Finished recovery
I0114 01:47:38.540292 28468 slave.cpp:5591] Querying resource estimator for oversubscribable
resources
I0114 01:47:38.541322 28466 slave.cpp:5605] Received oversubscribable resources {} from the
resource estimator
I0114 01:47:38.543566 28459 process.cpp:3676] Handling HTTP event for process 'slave(684)'
with path: '/slave(684)/monitor/statistics.json'
I0114 01:47:38.544742 28460 http.cpp:874] Authorizing principal 'test-principal' to GET the
'/monitor/statistics.json' endpoint
I0114 01:47:38.547837 28463 slave.cpp:796] Agent terminating
[       OK ] Endpoint/SlaveEndpointTest.NoAuthorizer/1 (32 ms)
[ RUN      ] Endpoint/SlaveEndpointTest.NoAuthorizer/2
I0114 01:47:38.559262 28440 containerizer.cpp:220] Using isolation: posix/cpu,posix/mem,filesystem/posix,network/cni
W0114 01:47:38.559783 28440 backend.cpp:76] Failed to create 'aufs' backend: AufsBackend requires
root privileges, but is running as user mesos
W0114 01:47:38.559937 28440 backend.cpp:76] Failed to create 'bind' backend: BindBackend requires
root privileges
I0114 01:47:38.561434 28440 cluster.cpp:446] Creating default 'local' authorizer
I0114 01:47:38.562861 28468 slave.cpp:209] Mesos agent started on (685)@172.17.0.2:53716
I0114 01:47:38.563107 28468 slave.cpp:210] Flags at startup: --acls="" --appc_simple_discovery_uri_prefix="http://"
--appc_store_dir="/tmp/mesos/store/appc" --authenticate_http_readonly="true" --authenticate_http_readwrite="true"
--authenticatee="crammd5" --authentication_backoff_factor="1secs" --authorizer="local" --cgroups_cpu_enable_pids_and_tids_count="false"
--cgroups_enable_cfs="false" --cgroups_hierarchy="/sys/fs/cgroup" --cgroups_limit_swap="false"
--cgroups_root="mesos" --container_disk_watch_interval="15secs" --containerizers="mesos" --credential="/tmp/Endpoint_SlaveEndpointTest_NoAuthorizer_2_OBJlwQ/credential"
--default_role="*" --disk_watch_interval="1mins" --docker="docker" --docker_kill_orphans="true"
--docker_registry="https://registry-1.docker.io" --docker_remove_delay="6hrs" --docker_socket="/var/run/docker.sock"
--docker_stop_timeout="0ns" --docker_store_dir="/tmp/mesos/store/docker" --docker_volume_checkpoint_dir="/var/run/mesos/isolators/docker/volume"
--enforce_container_disk_quota="false" --executor_registration_timeout="1mins" --executor_shutdown_grace_period="5secs"
--fetcher_cache_dir="/tmp/Endpoint_SlaveEndpointTest_NoAuthorizer_2_OBJlwQ/fetch" --fetcher_cache_size="2GB"
--frameworks_home="" --gc_delay="1weeks" --gc_disk_headroom="0.1" --hadoop_home="" --help="false"
--hostname_lookup="true" --http_authenticators="basic" --http_command_executor="false" --http_credentials="/tmp/Endpoint_SlaveEndpointTest_NoAuthorizer_2_OBJlwQ/http_credentials"
--http_heartbeat_interval="30secs" --image_provisioner_backend="copy" --initialize_driver_logging="true"
--isolation="posix/cpu,posix/mem" --launcher="posix" --launcher_dir="/mesos/mesos-1.2.0/_build/src"
--logbufsecs="0" --logging_level="INFO" --max_completed_executors_per_framework="150" --oversubscribed_resources_interval="15secs"
--perf_duration="10secs" --perf_interval="1mins" --qos_correction_interval_min="0ns" --quiet="false"
--recover="reconnect" --recovery_timeout="15mins" --registration_backoff_factor="10ms" --resources="cpus:2;gpus:0;mem:1024;disk:1024;ports:[31000-32000]"
--revocable_cpu_low_priority="true" --runtime_dir="/tmp/Endpoint_SlaveEndpointTest_NoAuthorizer_2_OBJlwQ"
--sandbox_directory="/mnt/mesos/sandbox" --strict="true" --switch_user="true" --systemd_enable_support="true"
--systemd_runtime_directory="/run/systemd/system" --version="false" --work_dir="/tmp/Endpoint_SlaveEndpointTest_NoAuthorizer_2_j52Idl"
I0114 01:47:38.563820 28468 credentials.hpp:86] Loading credential for authentication from
'/tmp/Endpoint_SlaveEndpointTest_NoAuthorizer_2_OBJlwQ/credential'
I0114 01:47:38.564136 28468 slave.cpp:352] Agent using credential for: test-principal
I0114 01:47:38.564162 28468 credentials.hpp:37] Loading credentials for authentication from
'/tmp/Endpoint_SlaveEndpointTest_NoAuthorizer_2_OBJlwQ/http_credentials'
I0114 01:47:38.564420 28468 http.cpp:922] Using default 'basic' HTTP authenticator for realm
'mesos-agent-readonly'
I0114 01:47:38.564569 28468 http.cpp:922] Using default 'basic' HTTP authenticator for realm
'mesos-agent-readwrite'
I0114 01:47:38.565603 28468 slave.cpp:539] Agent resources: cpus(*):2; mem(*):1024; disk(*):1024;
ports(*):[31000-32000]
I0114 01:47:38.565675 28468 slave.cpp:547] Agent attributes: [  ]
I0114 01:47:38.565691 28468 slave.cpp:552] Agent hostname: de85c123cdea
I0114 01:47:38.567101 28463 state.cpp:60] Recovering state from '/tmp/Endpoint_SlaveEndpointTest_NoAuthorizer_2_j52Idl/meta'
I0114 01:47:38.567323 28466 status_update_manager.cpp:203] Recovering status update manager
I0114 01:47:38.567690 28462 containerizer.cpp:599] Recovering containerizer
I0114 01:47:38.569123 28469 provisioner.cpp:251] Provisioner recovery complete
I0114 01:47:38.569481 28461 slave.cpp:5417] Finished recovery
I0114 01:47:38.570017 28461 slave.cpp:5591] Querying resource estimator for oversubscribable
resources
I0114 01:47:38.570341 28465 slave.cpp:5605] Received oversubscribable resources {} from the
resource estimator
I0114 01:47:38.572639 28460 process.cpp:3676] Handling HTTP event for process 'slave(685)'
with path: '/slave(685)/containers'
I0114 01:47:38.573839 28467 http.cpp:874] Authorizing principal 'test-principal' to GET the
'/containers' endpoint
I0114 01:47:38.576678 28466 slave.cpp:796] Agent terminating
[       OK ] Endpoint/SlaveEndpointTest.NoAuthorizer/2 (26 ms)
[----------] 9 tests from Endpoint/SlaveEndpointTest (262 ms total)

[----------] Global test environment tear-down
[==========] 1448 tests from 164 test cases ran. (507635 ms total)
[  PASSED  ] 1447 tests.
[  FAILED  ] 1 test, listed below:
[  FAILED  ] SlaveRecoveryTest/0.RecoverTerminatedExecutor, where TypeParam = mesos::internal::slave::MesosContainerizer

 1 FAILED TEST
  YOU HAVE 14 DISABLED TESTS

make[4]: *** [check-local] Error 1
make[4]: Leaving directory `/mesos/mesos-1.2.0/_build/src'
make[3]: *** [check-am] Error 2
make[3]: Leaving directory `/mesos/mesos-1.2.0/_build/src'
make[2]: *** [check] Error 2
make[2]: Leaving directory `/mesos/mesos-1.2.0/_build/src'
make[1]: *** [check-recursive] Error 1
make[1]: Leaving directory `/mesos/mesos-1.2.0/_build'
make: *** [distcheck] Error 1
+ docker rmi mesos-1484355535-10236
Untagged: mesos-1484355535-10236:latest
Deleted: sha256:9fa941d74554e7bb3f2690d702fdfb99f793fccf9b8f0dce2a58185d75e10d6d
Deleted: sha256:f7b01832edee2ca448360d8cbe8817f2ba0edc5f040efb1cc81319178ff4eb56
Deleted: sha256:88161491056f3b7fa984dfc592effb7ca7d9fb7338162e7f4506d2772f62a3c7
Deleted: sha256:f6ed13a130e985ccc668823fdd3bc1ff0104e7d8920279a704b4d28d5fecd91c
Deleted: sha256:90e232bb755bda66a4c8240ef7eac4e35a1e37a62277cd6bbae23966297439bc
Deleted: sha256:f0cce532eb9120f12d984a6cced7c8619bce08e9c76bad428c556b458141c91d
Deleted: sha256:1ead82dbfb4c351d5ae22221c69f398e01d221236fc049699ac921efe2a07a1a
Deleted: sha256:2134c0c27b1b04f20da71599a4a1f9d0d1b0caf819bb6c8db67bfb12b01a1123
Deleted: sha256:9e907fe8594a6e441d066a8d96c48262fa5d1d4ccf22d8391d4a60b1383c9d19
Deleted: sha256:6af3f2985af6aedf2c75abdf174ba29aacaacf681722e37a9d1366418f5ddaf0
Deleted: sha256:23e99b48783b0b3b3d8252e0322da17d50b21afb506e8a1af53bd72ce683ceeb
Deleted: sha256:ec708cdc6550840103c156d447fdfba40fcab41cb4ac5aaf360faaa7989444a6
Deleted: sha256:8b2d043960e68a3035ff8599e7d442fcd7b6bf96dbec319a17586f847276afb7
Deleted: sha256:9a5c405cc8a21445df677a7605da8c70ed0b955359b83fb34c1e956792a7d905
Deleted: sha256:b33b5285ed4af8304b31d22a9360c3ffabd0baac240bf9cfff5a358be4785643
Deleted: sha256:09bb3bdbc52cdb0dfdd8f8c56b317450ee88cf3911337f84d66fbeb9346482b5
Deleted: sha256:ba386d9d705b18254d2fbb1b907034e366ea2e3d419693166d16d0c7e91a0a09
Deleted: sha256:138fb7981f07f11a4a707360a6e284fff7748e59c569fdf8bad1493ecd1ec284
Deleted: sha256:b1c6c44b5517ec625e5029576ebcd8ca7a71a4697ace169c8cdef701525b61ae
Deleted: sha256:6fc27d6075d9dd6131221de2c9b540884c4283387071e13ec1afacaadd542987
Deleted: sha256:ded0c76751b969996459520bda62881abc8667e4dfb7e020eeea4ef3ce4f0fcc
Deleted: sha256:71082cc849687c8444fe852db1cff946b76303d35c9cbd88207bb1f01ed05436
Deleted: sha256:0bfc807eb6ebde8c305013beb3c886baedb63bc41fbfe8813c55b8936003e062
Deleted: sha256:e2086dc15a6b4a87815b063bbb6af39e4e0598db17d05da65abbbada7f61a055
Build step 'Execute shell' marked build as failure

Mime
View raw message