mesos-builds mailing list archives

Site index · List index
Message view « Date » · « Thread »
Top « Date » · « Thread »
From Apache Jenkins Server <jenk...@builds.apache.org>
Subject Build failed in Jenkins: Mesos » cmake,gcc,--verbose,GLOG_v=1 MESOS_VERBOSE=1,centos:7,(docker||Hadoop)&&(!ubuntu-us1)&&(!ubuntu-6)&&(!ubuntu-eu2) #3093
Date Tue, 03 Jan 2017 16:46:12 GMT
See <https://builds.apache.org/job/Mesos/BUILDTOOL=cmake,COMPILER=gcc,CONFIGURATION=--verbose,ENVIRONMENT=GLOG_v=1%20MESOS_VERBOSE=1,OS=centos%3A7,label_exp=(docker%7C%7CHadoop)&&(!ubuntu-us1)&&(!ubuntu-6)&&(!ubuntu-eu2)/3093/changes>

Changes:

[alexr] Corrected a comment about task health status.

[alexr] Fixed test flakiness due to floating point conversions.

------------------------------------------
[...truncated 158133 lines...]
[ RUN      ] Endpoint/SlaveEndpointTest.AuthorizedRequest/1
I0103 16:45:40.120714 25404 containerizer.cpp:220] Using isolation: posix/cpu,posix/mem,filesystem/posix,network/cni
W0103 16:45:40.121191 25404 backend.cpp:76] Failed to create 'aufs' backend: AufsBackend requires
root privileges, but is running as user mesos
W0103 16:45:40.121323 25404 backend.cpp:76] Failed to create 'bind' backend: BindBackend requires
root privileges
I0103 16:45:40.122678 25418 slave.cpp:209] Mesos agent started on (669)@172.17.0.2:54367
I0103 16:45:40.122699 25418 slave.cpp:210] Flags at startup: --acls="" --appc_simple_discovery_uri_prefix="http://"
--appc_store_dir="/tmp/mesos/store/appc" --authenticate_http_readonly="true" --authenticate_http_readwrite="true"
--authenticatee="crammd5" --authentication_backoff_factor="1secs" --authorizer="local" --cgroups_cpu_enable_pids_and_tids_count="false"
--cgroups_enable_cfs="false" --cgroups_hierarchy="/sys/fs/cgroup" --cgroups_limit_swap="false"
--cgroups_root="mesos" --container_disk_watch_interval="15secs" --containerizers="mesos" --credential="/tmp/Endpoint_SlaveEndpointTest_AuthorizedRequest_1_U5DuLE/credential"
--default_role="*" --disk_watch_interval="1mins" --docker="docker" --docker_kill_orphans="true"
--docker_registry="https://registry-1.docker.io" --docker_remove_delay="6hrs" --docker_socket="/var/run/docker.sock"
--docker_stop_timeout="0ns" --docker_store_dir="/tmp/mesos/store/docker" --docker_volume_checkpoint_dir="/var/run/mesos/isolators/docker/volume"
--enforce_container_disk_quota="false" --executor_registration_timeout="1mins" --executor_shutdown_grace_period="5secs"
--fetcher_cache_dir="/tmp/Endpoint_SlaveEndpointTest_AuthorizedRequest_1_U5DuLE/fetch" --fetcher_cache_size="2GB"
--frameworks_home="" --gc_delay="1weeks" --gc_disk_headroom="0.1" --hadoop_home="" --help="false"
--hostname_lookup="true" --http_authenticators="basic" --http_command_executor="false" --http_credentials="/tmp/Endpoint_SlaveEndpointTest_AuthorizedRequest_1_U5DuLE/http_credentials"
--http_heartbeat_interval="30secs" --image_provisioner_backend="copy" --initialize_driver_logging="true"
--isolation="posix/cpu,posix/mem" --launcher="posix" --launcher_dir="/mesos/build/src" --logbufsecs="0"
--logging_level="INFO" --max_completed_executors_per_framework="150" --oversubscribed_resources_interval="15secs"
--perf_duration="10secs" --perf_interval="1mins" --qos_correction_interval_min="0ns" --quiet="false"
--recover="reconnect" --recovery_timeout="15mins" --registration_backoff_factor="10ms" --resources="cpus:2;gpus:0;mem:1024;disk:1024;ports:[31000-32000]"
--revocable_cpu_low_priority="true" --runtime_dir="/tmp/Endpoint_SlaveEndpointTest_AuthorizedRequest_1_U5DuLE"
--sandbox_directory="/mnt/mesos/sandbox" --strict="true" --switch_user="true" --systemd_enable_support="true"
--systemd_runtime_directory="/run/systemd/system" --version="false" --work_dir="/tmp/Endpoint_SlaveEndpointTest_AuthorizedRequest_1_7uP49n"
I0103 16:45:40.123150 25418 credentials.hpp:86] Loading credential for authentication from
'/tmp/Endpoint_SlaveEndpointTest_AuthorizedRequest_1_U5DuLE/credential'
I0103 16:45:40.123266 25418 slave.cpp:352] Agent using credential for: test-principal
I0103 16:45:40.123284 25418 credentials.hpp:37] Loading credentials for authentication from
'/tmp/Endpoint_SlaveEndpointTest_AuthorizedRequest_1_U5DuLE/http_credentials'
I0103 16:45:40.123425 25418 http.cpp:922] Using default 'basic' HTTP authenticator for realm
'mesos-agent-readonly'
I0103 16:45:40.123504 25418 http.cpp:922] Using default 'basic' HTTP authenticator for realm
'mesos-agent-readwrite'
I0103 16:45:40.123941 25418 slave.cpp:539] Agent resources: cpus(*):2; mem(*):1024; disk(*):1024;
ports(*):[31000-32000]
I0103 16:45:40.123983 25418 slave.cpp:547] Agent attributes: [  ]
I0103 16:45:40.123994 25418 slave.cpp:552] Agent hostname: 35674ccd59b1
I0103 16:45:40.124380 25408 state.cpp:60] Recovering state from '/tmp/Endpoint_SlaveEndpointTest_AuthorizedRequest_1_7uP49n/meta'
I0103 16:45:40.124547 25405 status_update_manager.cpp:203] Recovering status update manager
I0103 16:45:40.124627 25413 containerizer.cpp:599] Recovering containerizer
I0103 16:45:40.125107 25410 provisioner.cpp:253] Provisioner recovery complete
I0103 16:45:40.125248 25418 slave.cpp:5415] Finished recovery
I0103 16:45:40.125736 25418 slave.cpp:5589] Querying resource estimator for oversubscribable
resources
I0103 16:45:40.125896 25406 slave.cpp:5603] Received oversubscribable resources {} from the
resource estimator
I0103 16:45:40.126725 25412 process.cpp:3679] Handling HTTP event for process 'slave(669)'
with path: '/slave(669)/monitor/statistics.json'
I0103 16:45:40.127176 25414 http.cpp:874] Authorizing principal 'test-principal' to GET the
'/monitor/statistics.json' endpoint
I0103 16:45:40.128525 25404 slave.cpp:796] Agent terminating
[       OK ] Endpoint/SlaveEndpointTest.AuthorizedRequest/1 (15 ms)
[ RUN      ] Endpoint/SlaveEndpointTest.AuthorizedRequest/2
I0103 16:45:40.136600 25404 containerizer.cpp:220] Using isolation: posix/cpu,posix/mem,filesystem/posix,network/cni
W0103 16:45:40.137060 25404 backend.cpp:76] Failed to create 'aufs' backend: AufsBackend requires
root privileges, but is running as user mesos
W0103 16:45:40.137184 25404 backend.cpp:76] Failed to create 'bind' backend: BindBackend requires
root privileges
I0103 16:45:40.138190 25413 slave.cpp:209] Mesos agent started on (670)@172.17.0.2:54367
I0103 16:45:40.138226 25413 slave.cpp:210] Flags at startup: --acls="" --appc_simple_discovery_uri_prefix="http://"
--appc_store_dir="/tmp/mesos/store/appc" --authenticate_http_readonly="true" --authenticate_http_readwrite="true"
--authenticatee="crammd5" --authentication_backoff_factor="1secs" --authorizer="local" --cgroups_cpu_enable_pids_and_tids_count="false"
--cgroups_enable_cfs="false" --cgroups_hierarchy="/sys/fs/cgroup" --cgroups_limit_swap="false"
--cgroups_root="mesos" --container_disk_watch_interval="15secs" --containerizers="mesos" --credential="/tmp/Endpoint_SlaveEndpointTest_AuthorizedRequest_2_gb7FjJ/credential"
--default_role="*" --disk_watch_interval="1mins" --docker="docker" --docker_kill_orphans="true"
--docker_registry="https://registry-1.docker.io" --docker_remove_delay="6hrs" --docker_socket="/var/run/docker.sock"
--docker_stop_timeout="0ns" --docker_store_dir="/tmp/mesos/store/docker" --docker_volume_checkpoint_dir="/var/run/mesos/isolators/docker/volume"
--enforce_container_disk_quota="false" --executor_registration_timeout="1mins" --executor_shutdown_grace_period="5secs"
--fetcher_cache_dir="/tmp/Endpoint_SlaveEndpointTest_AuthorizedRequest_2_gb7FjJ/fetch" --fetcher_cache_size="2GB"
--frameworks_home="" --gc_delay="1weeks" --gc_disk_headroom="0.1" --hadoop_home="" --help="false"
--hostname_lookup="true" --http_authenticators="basic" --http_command_executor="false" --http_credentials="/tmp/Endpoint_SlaveEndpointTest_AuthorizedRequest_2_gb7FjJ/http_credentials"
--http_heartbeat_interval="30secs" --image_provisioner_backend="copy" --initialize_driver_logging="true"
--isolation="posix/cpu,posix/mem" --launcher="posix" --launcher_dir="/mesos/build/src" --logbufsecs="0"
--logging_level="INFO" --max_completed_executors_per_framework="150" --oversubscribed_resources_interval="15secs"
--perf_duration="10secs" --perf_interval="1mins" --qos_correction_interval_min="0ns" --quiet="false"
--recover="reconnect" --recovery_timeout="15mins" --registration_backoff_factor="10ms" --resources="cpus:2;gpus:0;mem:1024;disk:1024;ports:[31000-32000]"
--revocable_cpu_low_priority="true" --runtime_dir="/tmp/Endpoint_SlaveEndpointTest_AuthorizedRequest_2_gb7FjJ"
--sandbox_directory="/mnt/mesos/sandbox" --strict="true" --switch_user="true" --systemd_enable_support="true"
--systemd_runtime_directory="/run/systemd/system" --version="false" --work_dir="/tmp/Endpoint_SlaveEndpointTest_AuthorizedRequest_2_HqwGFs"
I0103 16:45:40.138571 25413 credentials.hpp:86] Loading credential for authentication from
'/tmp/Endpoint_SlaveEndpointTest_AuthorizedRequest_2_gb7FjJ/credential'
I0103 16:45:40.138649 25413 slave.cpp:352] Agent using credential for: test-principal
I0103 16:45:40.138662 25413 credentials.hpp:37] Loading credentials for authentication from
'/tmp/Endpoint_SlaveEndpointTest_AuthorizedRequest_2_gb7FjJ/http_credentials'
I0103 16:45:40.138756 25413 http.cpp:922] Using default 'basic' HTTP authenticator for realm
'mesos-agent-readonly'
I0103 16:45:40.138808 25413 http.cpp:922] Using default 'basic' HTTP authenticator for realm
'mesos-agent-readwrite'
I0103 16:45:40.139123 25413 slave.cpp:539] Agent resources: cpus(*):2; mem(*):1024; disk(*):1024;
ports(*):[31000-32000]
I0103 16:45:40.139156 25413 slave.cpp:547] Agent attributes: [  ]
I0103 16:45:40.139161 25413 slave.cpp:552] Agent hostname: 35674ccd59b1
I0103 16:45:40.139549 25420 state.cpp:60] Recovering state from '/tmp/Endpoint_SlaveEndpointTest_AuthorizedRequest_2_HqwGFs/meta'
I0103 16:45:40.139720 25413 status_update_manager.cpp:203] Recovering status update manager
I0103 16:45:40.139899 25412 containerizer.cpp:599] Recovering containerizer
I0103 16:45:40.140409 25410 provisioner.cpp:253] Provisioner recovery complete
I0103 16:45:40.140625 25414 slave.cpp:5415] Finished recovery
I0103 16:45:40.141096 25414 slave.cpp:5589] Querying resource estimator for oversubscribable
resources
I0103 16:45:40.141299 25414 slave.cpp:5603] Received oversubscribable resources {} from the
resource estimator
I0103 16:45:40.142076 25413 process.cpp:3679] Handling HTTP event for process 'slave(670)'
with path: '/slave(670)/containers'
I0103 16:45:40.142521 25412 http.cpp:874] Authorizing principal 'test-principal' to GET the
'/containers' endpoint
I0103 16:45:40.143764 25404 slave.cpp:796] Agent terminating
[       OK ] Endpoint/SlaveEndpointTest.AuthorizedRequest/2 (11 ms)
[ RUN      ] Endpoint/SlaveEndpointTest.UnauthorizedRequest/0
I0103 16:45:40.148360 25404 containerizer.cpp:220] Using isolation: posix/cpu,posix/mem,filesystem/posix,network/cni
W0103 16:45:40.148685 25404 backend.cpp:76] Failed to create 'aufs' backend: AufsBackend requires
root privileges, but is running as user mesos
W0103 16:45:40.148772 25404 backend.cpp:76] Failed to create 'bind' backend: BindBackend requires
root privileges
I0103 16:45:40.150008 25411 slave.cpp:209] Mesos agent started on (671)@172.17.0.2:54367
I0103 16:45:40.150022 25411 slave.cpp:210] Flags at startup: --acls="" --appc_simple_discovery_uri_prefix="http://"
--appc_store_dir="/tmp/mesos/store/appc" --authenticate_http_readonly="true" --authenticate_http_readwrite="true"
--authenticatee="crammd5" --authentication_backoff_factor="1secs" --authorizer="local" --cgroups_cpu_enable_pids_and_tids_count="false"
--cgroups_enable_cfs="false" --cgroups_hierarchy="/sys/fs/cgroup" --cgroups_limit_swap="false"
--cgroups_root="mesos" --container_disk_watch_interval="15secs" --containerizers="mesos" --credential="/tmp/Endpoint_SlaveEndpointTest_UnauthorizedRequest_0_Oim8ZN/credential"
--default_role="*" --disk_watch_interval="1mins" --docker="docker" --docker_kill_orphans="true"
--docker_registry="https://registry-1.docker.io" --docker_remove_delay="6hrs" --docker_socket="/var/run/docker.sock"
--docker_stop_timeout="0ns" --docker_store_dir="/tmp/mesos/store/docker" --docker_volume_checkpoint_dir="/var/run/mesos/isolators/docker/volume"
--enforce_container_disk_quota="false" --executor_registration_timeout="1mins" --executor_shutdown_grace_period="5secs"
--fetcher_cache_dir="/tmp/Endpoint_SlaveEndpointTest_UnauthorizedRequest_0_Oim8ZN/fetch" --fetcher_cache_size="2GB"
--frameworks_home="" --gc_delay="1weeks" --gc_disk_headroom="0.1" --hadoop_home="" --help="false"
--hostname_lookup="true" --http_authenticators="basic" --http_command_executor="false" --http_credentials="/tmp/Endpoint_SlaveEndpointTest_UnauthorizedRequest_0_Oim8ZN/http_credentials"
--http_heartbeat_interval="30secs" --image_provisioner_backend="copy" --initialize_driver_logging="true"
--isolation="posix/cpu,posix/mem" --launcher="posix" --launcher_dir="/mesos/build/src" --logbufsecs="0"
--logging_level="INFO" --max_completed_executors_per_framework="150" --oversubscribed_resources_interval="15secs"
--perf_duration="10secs" --perf_interval="1mins" --qos_correction_interval_min="0ns" --quiet="false"
--recover="reconnect" --recovery_timeout="15mins" --registration_backoff_factor="10ms" --resources="cpus:2;gpus:0;mem:1024;disk:1024;ports:[31000-32000]"
--revocable_cpu_low_priority="true" --runtime_dir="/tmp/Endpoint_SlaveEndpointTest_UnauthorizedRequest_0_Oim8ZN"
--sandbox_directory="/mnt/mesos/sandbox" --strict="true" --switch_user="true" --systemd_enable_support="true"
--systemd_runtime_directory="/run/systemd/system" --version="false" --work_dir="/tmp/Endpoint_SlaveEndpointTest_UnauthorizedRequest_0_zcWdkx"
I0103 16:45:40.150358 25411 credentials.hpp:86] Loading credential for authentication from
'/tmp/Endpoint_SlaveEndpointTest_UnauthorizedRequest_0_Oim8ZN/credential'
I0103 16:45:40.150460 25411 slave.cpp:352] Agent using credential for: test-principal
I0103 16:45:40.150470 25411 credentials.hpp:37] Loading credentials for authentication from
'/tmp/Endpoint_SlaveEndpointTest_UnauthorizedRequest_0_Oim8ZN/http_credentials'
I0103 16:45:40.150564 25411 http.cpp:922] Using default 'basic' HTTP authenticator for realm
'mesos-agent-readonly'
I0103 16:45:40.150610 25411 http.cpp:922] Using default 'basic' HTTP authenticator for realm
'mesos-agent-readwrite'
I0103 16:45:40.150971 25411 slave.cpp:539] Agent resources: cpus(*):2; mem(*):1024; disk(*):1024;
ports(*):[31000-32000]
I0103 16:45:40.151012 25411 slave.cpp:547] Agent attributes: [  ]
I0103 16:45:40.151018 25411 slave.cpp:552] Agent hostname: 35674ccd59b1
I0103 16:45:40.151475 25414 state.cpp:60] Recovering state from '/tmp/Endpoint_SlaveEndpointTest_UnauthorizedRequest_0_zcWdkx/meta'
I0103 16:45:40.151790 25411 status_update_manager.cpp:203] Recovering status update manager
I0103 16:45:40.151890 25411 containerizer.cpp:599] Recovering containerizer
I0103 16:45:40.152256 25411 provisioner.cpp:253] Provisioner recovery complete
I0103 16:45:40.152381 25411 slave.cpp:5415] Finished recovery
I0103 16:45:40.152771 25411 slave.cpp:5589] Querying resource estimator for oversubscribable
resources
I0103 16:45:40.152894 25411 slave.cpp:5603] Received oversubscribable resources {} from the
resource estimator
I0103 16:45:40.153657 25415 process.cpp:3679] Handling HTTP event for process 'slave(671)'
with path: '/slave(671)/monitor/statistics'
I0103 16:45:40.154158 25407 http.cpp:874] Authorizing principal 'test-principal' to GET the
'/monitor/statistics' endpoint
I0103 16:45:40.155076 25420 slave.cpp:796] Agent terminating
[       OK ] Endpoint/SlaveEndpointTest.UnauthorizedRequest/0 (11 ms)
[ RUN      ] Endpoint/SlaveEndpointTest.UnauthorizedRequest/1
I0103 16:45:40.160692 25404 containerizer.cpp:220] Using isolation: posix/cpu,posix/mem,filesystem/posix,network/cni
W0103 16:45:40.161043 25404 backend.cpp:76] Failed to create 'aufs' backend: AufsBackend requires
root privileges, but is running as user mesos
W0103 16:45:40.161135 25404 backend.cpp:76] Failed to create 'bind' backend: BindBackend requires
root privileges
I0103 16:45:40.162252 25416 slave.cpp:209] Mesos agent started on (672)@172.17.0.2:54367
I0103 16:45:40.162366 25416 slave.cpp:210] Flags at startup: --acls="" --appc_simple_discovery_uri_prefix="http://"
--appc_store_dir="/tmp/mesos/store/appc" --authenticate_http_readonly="true" --authenticate_http_readwrite="true"
--authenticatee="crammd5" --authentication_backoff_factor="1secs" --authorizer="local" --cgroups_cpu_enable_pids_and_tids_count="false"
--cgroups_enable_cfs="false" --cgroups_hierarchy="/sys/fs/cgroup" --cgroups_limit_swap="false"
--cgroups_root="mesos" --container_disk_watch_interval="15secs" --containerizers="mesos" --credential="/tmp/Endpoint_SlaveEndpointTest_UnauthorizedRequest_1_tuXoOS/credential"
--default_role="*" --disk_watch_interval="1mins" --docker="docker" --docker_kill_orphans="true"
--docker_registry="https://registry-1.docker.io" --docker_remove_delay="6hrs" --docker_socket="/var/run/docker.sock"
--docker_stop_timeout="0ns" --docker_store_dir="/tmp/mesos/store/docker" --docker_volume_checkpoint_dir="/var/run/mesos/isolators/docker/volume"
--enforce_container_disk_quota="false" --executor_registration_timeout="1mins" --executor_shutdown_grace_period="5secs"
--fetcher_cache_dir="/tmp/Endpoint_SlaveEndpointTest_UnauthorizedRequest_1_tuXoOS/fetch" --fetcher_cache_size="2GB"
--frameworks_home="" --gc_delay="1weeks" --gc_disk_headroom="0.1" --hadoop_home="" --help="false"
--hostname_lookup="true" --http_authenticators="basic" --http_command_executor="false" --http_credentials="/tmp/Endpoint_SlaveEndpointTest_UnauthorizedRequest_1_tuXoOS/http_credentials"
--http_heartbeat_interval="30secs" --image_provisioner_backend="copy" --initialize_driver_logging="true"
--isolation="posix/cpu,posix/mem" --launcher="posix" --launcher_dir="/mesos/build/src" --logbufsecs="0"
--logging_level="INFO" --max_completed_executors_per_framework="150" --oversubscribed_resources_interval="15secs"
--perf_duration="10secs" --perf_interval="1mins" --qos_correction_interval_min="0ns" --quiet="false"
--recover="reconnect" --recovery_timeout="15mins" --registration_backoff_factor="10ms" --resources="cpus:2;gpus:0;mem:1024;disk:1024;ports:[31000-32000]"
--revocable_cpu_low_priority="true" --runtime_dir="/tmp/Endpoint_SlaveEndpointTest_UnauthorizedRequest_1_tuXoOS"
--sandbox_directory="/mnt/mesos/sandbox" --strict="true" --switch_user="true" --systemd_enable_support="true"
--systemd_runtime_directory="/run/systemd/system" --version="false" --work_dir="/tmp/Endpoint_SlaveEndpointTest_UnauthorizedRequest_1_KjCv6B"
I0103 16:45:40.162691 25416 credentials.hpp:86] Loading credential for authentication from
'/tmp/Endpoint_SlaveEndpointTest_UnauthorizedRequest_1_tuXoOS/credential'
I0103 16:45:40.162781 25416 slave.cpp:352] Agent using credential for: test-principal
I0103 16:45:40.162794 25416 credentials.hpp:37] Loading credentials for authentication from
'/tmp/Endpoint_SlaveEndpointTest_UnauthorizedRequest_1_tuXoOS/http_credentials'
I0103 16:45:40.162878 25416 http.cpp:922] Using default 'basic' HTTP authenticator for realm
'mesos-agent-readonly'
I0103 16:45:40.162931 25416 http.cpp:922] Using default 'basic' HTTP authenticator for realm
'mesos-agent-readwrite'
I0103 16:45:40.163275 25416 slave.cpp:539] Agent resources: cpus(*):2; mem(*):1024; disk(*):1024;
ports(*):[31000-32000]
I0103 16:45:40.163311 25416 slave.cpp:547] Agent attributes: [  ]
I0103 16:45:40.163319 25416 slave.cpp:552] Agent hostname: 35674ccd59b1
I0103 16:45:40.163673 25418 state.cpp:60] Recovering state from '/tmp/Endpoint_SlaveEndpointTest_UnauthorizedRequest_1_KjCv6B/meta'
I0103 16:45:40.163863 25416 status_update_manager.cpp:203] Recovering status update manager
I0103 16:45:40.164002 25413 containerizer.cpp:599] Recovering containerizer
I0103 16:45:40.164510 25408 provisioner.cpp:253] Provisioner recovery complete
I0103 16:45:40.164634 25412 slave.cpp:5415] Finished recovery
I0103 16:45:40.165144 25412 slave.cpp:5589] Querying resource estimator for oversubscribable
resources
I0103 16:45:40.165278 25412 slave.cpp:5603] Received oversubscribable resources {} from the
resource estimator
I0103 16:45:40.166007 25409 process.cpp:3679] Handling HTTP event for process 'slave(672)'
with path: '/slave(672)/monitor/statistics.json'
I0103 16:45:40.166415 25413 http.cpp:874] Authorizing principal 'test-principal' to GET the
'/monitor/statistics.json' endpoint
I0103 16:45:40.167071 25412 slave.cpp:796] Agent terminating
[       OK ] Endpoint/SlaveEndpointTest.UnauthorizedRequest/1 (24 ms)
[ RUN      ] Endpoint/SlaveEndpointTest.UnauthorizedRequest/2
I0103 16:45:40.184561 25404 containerizer.cpp:220] Using isolation: posix/cpu,posix/mem,filesystem/posix,network/cni
W0103 16:45:40.185125 25404 backend.cpp:76] Failed to create 'aufs' backend: AufsBackend requires
root privileges, but is running as user mesos
W0103 16:45:40.185220 25404 backend.cpp:76] Failed to create 'bind' backend: BindBackend requires
root privileges
I0103 16:45:40.186240 25407 slave.cpp:209] Mesos agent started on (673)@172.17.0.2:54367
I0103 16:45:40.186254 25407 slave.cpp:210] Flags at startup: --acls="" --appc_simple_discovery_uri_prefix="http://"
--appc_store_dir="/tmp/mesos/store/appc" --authenticate_http_readonly="true" --authenticate_http_readwrite="true"
--authenticatee="crammd5" --authentication_backoff_factor="1secs" --authorizer="local" --cgroups_cpu_enable_pids_and_tids_count="false"
--cgroups_enable_cfs="false" --cgroups_hierarchy="/sys/fs/cgroup" --cgroups_limit_swap="false"
--cgroups_root="mesos" --container_disk_watch_interval="15secs" --containerizers="mesos" --credential="/tmp/Endpoint_SlaveEndpointTest_UnauthorizedRequest_2_741rQX/credential"
--default_role="*" --disk_watch_interval="1mins" --docker="docker" --docker_kill_orphans="true"
--docker_registry="https://registry-1.docker.io" --docker_remove_delay="6hrs" --docker_socket="/var/run/docker.sock"
--docker_stop_timeout="0ns" --docker_store_dir="/tmp/mesos/store/docker" --docker_volume_checkpoint_dir="/var/run/mesos/isolators/docker/volume"
--enforce_container_disk_quota="false" --executor_registration_timeout="1mins" --executor_shutdown_grace_period="5secs"
--fetcher_cache_dir="/tmp/Endpoint_SlaveEndpointTest_UnauthorizedRequest_2_741rQX/fetch" --fetcher_cache_size="2GB"
--frameworks_home="" --gc_delay="1weeks" --gc_disk_headroom="0.1" --hadoop_home="" --help="false"
--hostname_lookup="true" --http_authenticators="basic" --http_command_executor="false" --http_credentials="/tmp/Endpoint_SlaveEndpointTest_UnauthorizedRequest_2_741rQX/http_credentials"
--http_heartbeat_interval="30secs" --image_provisioner_backend="copy" --initialize_driver_logging="true"
--isolation="posix/cpu,posix/mem" --launcher="posix" --launcher_dir="/mesos/build/src" --logbufsecs="0"
--logging_level="INFO" --max_completed_executors_per_framework="150" --oversubscribed_resources_interval="15secs"
--perf_duration="10secs" --perf_interval="1mins" --qos_correction_interval_min="0ns" --quiet="false"
--recover="reconnect" --recovery_timeout="15mins" --registration_backoff_factor="10ms" --resources="cpus:2;gpus:0;mem:1024;disk:1024;ports:[31000-32000]"
--revocable_cpu_low_priority="true" --runtime_dir="/tmp/Endpoint_SlaveEndpointTest_UnauthorizedRequest_2_741rQX"
--sandbox_directory="/mnt/mesos/sandbox" --strict="true" --switch_user="true" --systemd_enable_support="true"
--systemd_runtime_directory="/run/systemd/system" --version="false" --work_dir="/tmp/Endpoint_SlaveEndpointTest_UnauthorizedRequest_2_buWD4G"
I0103 16:45:40.186703 25407 credentials.hpp:86] Loading credential for authentication from
'/tmp/Endpoint_SlaveEndpointTest_UnauthorizedRequest_2_741rQX/credential'
I0103 16:45:40.186811 25407 slave.cpp:352] Agent using credential for: test-principal
I0103 16:45:40.186827 25407 credentials.hpp:37] Loading credentials for authentication from
'/tmp/Endpoint_SlaveEndpointTest_UnauthorizedRequest_2_741rQX/http_credentials'
I0103 16:45:40.186956 25407 http.cpp:922] Using default 'basic' HTTP authenticator for realm
'mesos-agent-readonly'
I0103 16:45:40.187012 25407 http.cpp:922] Using default 'basic' HTTP authenticator for realm
'mesos-agent-readwrite'
I0103 16:45:40.187347 25407 slave.cpp:539] Agent resources: cpus(*):2; mem(*):1024; disk(*):1024;
ports(*):[31000-32000]
I0103 16:45:40.187388 25407 slave.cpp:547] Agent attributes: [  ]
I0103 16:45:40.187399 25407 slave.cpp:552] Agent hostname: 35674ccd59b1
I0103 16:45:40.187825 25420 state.cpp:60] Recovering state from '/tmp/Endpoint_SlaveEndpointTest_UnauthorizedRequest_2_buWD4G/meta'
I0103 16:45:40.188030 25420 status_update_manager.cpp:203] Recovering status update manager
I0103 16:45:40.188094 25420 containerizer.cpp:599] Recovering containerizer
I0103 16:45:40.188511 25420 provisioner.cpp:253] Provisioner recovery complete
I0103 16:45:40.188647 25420 slave.cpp:5415] Finished recovery
I0103 16:45:40.189014 25420 slave.cpp:5589] Querying resource estimator for oversubscribable
resources
I0103 16:45:40.189173 25420 slave.cpp:5603] Received oversubscribable resources {} from the
resource estimator
I0103 16:45:40.189945 25409 process.cpp:3679] Handling HTTP event for process 'slave(673)'
with path: '/slave(673)/containers'
I0103 16:45:40.190336 25420 http.cpp:874] Authorizing principal 'test-principal' to GET the
'/containers' endpoint
I0103 16:45:40.191118 25404 slave.cpp:796] Agent terminating
[       OK ] Endpoint/SlaveEndpointTest.UnauthorizedRequest/2 (10 ms)
[ RUN      ] Endpoint/SlaveEndpointTest.NoAuthorizer/0
I0103 16:45:40.195396 25404 containerizer.cpp:220] Using isolation: posix/cpu,posix/mem,filesystem/posix,network/cni
W0103 16:45:40.195735 25404 backend.cpp:76] Failed to create 'aufs' backend: AufsBackend requires
root privileges, but is running as user mesos
W0103 16:45:40.195823 25404 backend.cpp:76] Failed to create 'bind' backend: BindBackend requires
root privileges
I0103 16:45:40.196427 25404 cluster.cpp:446] Creating default 'local' authorizer
I0103 16:45:40.196987 25419 slave.cpp:209] Mesos agent started on (674)@172.17.0.2:54367
I0103 16:45:40.197005 25419 slave.cpp:210] Flags at startup: --acls="" --appc_simple_discovery_uri_prefix="http://"
--appc_store_dir="/tmp/mesos/store/appc" --authenticate_http_readonly="true" --authenticate_http_readwrite="true"
--authenticatee="crammd5" --authentication_backoff_factor="1secs" --authorizer="local" --cgroups_cpu_enable_pids_and_tids_count="false"
--cgroups_enable_cfs="false" --cgroups_hierarchy="/sys/fs/cgroup" --cgroups_limit_swap="false"
--cgroups_root="mesos" --container_disk_watch_interval="15secs" --containerizers="mesos" --credential="/tmp/Endpoint_SlaveEndpointTest_NoAuthorizer_0_LyuE12/credential"
--default_role="*" --disk_watch_interval="1mins" --docker="docker" --docker_kill_orphans="true"
--docker_registry="https://registry-1.docker.io" --docker_remove_delay="6hrs" --docker_socket="/var/run/docker.sock"
--docker_stop_timeout="0ns" --docker_store_dir="/tmp/mesos/store/docker" --docker_volume_checkpoint_dir="/var/run/mesos/isolators/docker/volume"
--enforce_container_disk_quota="false" --executor_registration_timeout="1mins" --executor_shutdown_grace_period="5secs"
--fetcher_cache_dir="/tmp/Endpoint_SlaveEndpointTest_NoAuthorizer_0_LyuE12/fetch" --fetcher_cache_size="2GB"
--frameworks_home="" --gc_delay="1weeks" --gc_disk_headroom="0.1" --hadoop_home="" --help="false"
--hostname_lookup="true" --http_authenticators="basic" --http_command_executor="false" --http_credentials="/tmp/Endpoint_SlaveEndpointTest_NoAuthorizer_0_LyuE12/http_credentials"
--http_heartbeat_interval="30secs" --image_provisioner_backend="copy" --initialize_driver_logging="true"
--isolation="posix/cpu,posix/mem" --launcher="posix" --launcher_dir="/mesos/build/src" --logbufsecs="0"
--logging_level="INFO" --max_completed_executors_per_framework="150" --oversubscribed_resources_interval="15secs"
--perf_duration="10secs" --perf_interval="1mins" --qos_correction_interval_min="0ns" --quiet="false"
--recover="reconnect" --recovery_timeout="15mins" --registration_backoff_factor="10ms" --resources="cpus:2;gpus:0;mem:1024;disk:1024;ports:[31000-32000]"
--revocable_cpu_low_priority="true" --runtime_dir="/tmp/Endpoint_SlaveEndpointTest_NoAuthorizer_0_LyuE12"
--sandbox_directory="/mnt/mesos/sandbox" --strict="true" --switch_user="true" --systemd_enable_support="true"
--systemd_runtime_directory="/run/systemd/system" --version="false" --work_dir="/tmp/Endpoint_SlaveEndpointTest_NoAuthorizer_0_iSQ5dM"
I0103 16:45:40.197262 25419 credentials.hpp:86] Loading credential for authentication from
'/tmp/Endpoint_SlaveEndpointTest_NoAuthorizer_0_LyuE12/credential'
I0103 16:45:40.197389 25419 slave.cpp:352] Agent using credential for: test-principal
I0103 16:45:40.197407 25419 credentials.hpp:37] Loading credentials for authentication from
'/tmp/Endpoint_SlaveEndpointTest_NoAuthorizer_0_LyuE12/http_credentials'
I0103 16:45:40.197509 25419 http.cpp:922] Using default 'basic' HTTP authenticator for realm
'mesos-agent-readonly'
I0103 16:45:40.197556 25419 http.cpp:922] Using default 'basic' HTTP authenticator for realm
'mesos-agent-readwrite'
I0103 16:45:40.197862 25419 slave.cpp:539] Agent resources: cpus(*):2; mem(*):1024; disk(*):1024;
ports(*):[31000-32000]
I0103 16:45:40.197896 25419 slave.cpp:547] Agent attributes: [  ]
I0103 16:45:40.197901 25419 slave.cpp:552] Agent hostname: 35674ccd59b1
I0103 16:45:40.198364 25406 state.cpp:60] Recovering state from '/tmp/Endpoint_SlaveEndpointTest_NoAuthorizer_0_iSQ5dM/meta'
I0103 16:45:40.198536 25408 status_update_manager.cpp:203] Recovering status update manager
I0103 16:45:40.198746 25408 containerizer.cpp:599] Recovering containerizer
I0103 16:45:40.199364 25419 provisioner.cpp:253] Provisioner recovery complete
I0103 16:45:40.199555 25414 slave.cpp:5415] Finished recovery
I0103 16:45:40.199964 25414 slave.cpp:5589] Querying resource estimator for oversubscribable
resources
I0103 16:45:40.200055 25413 slave.cpp:5603] Received oversubscribable resources {} from the
resource estimator
I0103 16:45:40.200734 25405 process.cpp:3679] Handling HTTP event for process 'slave(674)'
with path: '/slave(674)/monitor/statistics'
I0103 16:45:40.201128 25412 http.cpp:874] Authorizing principal 'test-principal' to GET the
'/monitor/statistics' endpoint
I0103 16:45:40.202533 25404 slave.cpp:796] Agent terminating
[       OK ] Endpoint/SlaveEndpointTest.NoAuthorizer/0 (11 ms)
[ RUN      ] Endpoint/SlaveEndpointTest.NoAuthorizer/1
I0103 16:45:40.207067 25404 containerizer.cpp:220] Using isolation: posix/cpu,posix/mem,filesystem/posix,network/cni
W0103 16:45:40.207420 25404 backend.cpp:76] Failed to create 'aufs' backend: AufsBackend requires
root privileges, but is running as user mesos
W0103 16:45:40.207507 25404 backend.cpp:76] Failed to create 'bind' backend: BindBackend requires
root privileges
I0103 16:45:40.208048 25404 cluster.cpp:446] Creating default 'local' authorizer
I0103 16:45:40.208576 25416 slave.cpp:209] Mesos agent started on (675)@172.17.0.2:54367
I0103 16:45:40.208590 25416 slave.cpp:210] Flags at startup: --acls="" --appc_simple_discovery_uri_prefix="http://"
--appc_store_dir="/tmp/mesos/store/appc" --authenticate_http_readonly="true" --authenticate_http_readwrite="true"
--authenticatee="crammd5" --authentication_backoff_factor="1secs" --authorizer="local" --cgroups_cpu_enable_pids_and_tids_count="false"
--cgroups_enable_cfs="false" --cgroups_hierarchy="/sys/fs/cgroup" --cgroups_limit_swap="false"
--cgroups_root="mesos" --container_disk_watch_interval="15secs" --containerizers="mesos" --credential="/tmp/Endpoint_SlaveEndpointTest_NoAuthorizer_1_i7gik8/credential"
--default_role="*" --disk_watch_interval="1mins" --docker="docker" --docker_kill_orphans="true"
--docker_registry="https://registry-1.docker.io" --docker_remove_delay="6hrs" --docker_socket="/var/run/docker.sock"
--docker_stop_timeout="0ns" --docker_store_dir="/tmp/mesos/store/docker" --docker_volume_checkpoint_dir="/var/run/mesos/isolators/docker/volume"
--enforce_container_disk_quota="false" --executor_registration_timeout="1mins" --executor_shutdown_grace_period="5secs"
--fetcher_cache_dir="/tmp/Endpoint_SlaveEndpointTest_NoAuthorizer_1_i7gik8/fetch" --fetcher_cache_size="2GB"
--frameworks_home="" --gc_delay="1weeks" --gc_disk_headroom="0.1" --hadoop_home="" --help="false"
--hostname_lookup="true" --http_authenticators="basic" --http_command_executor="false" --http_credentials="/tmp/Endpoint_SlaveEndpointTest_NoAuthorizer_1_i7gik8/http_credentials"
--http_heartbeat_interval="30secs" --image_provisioner_backend="copy" --initialize_driver_logging="true"
--isolation="posix/cpu,posix/mem" --launcher="posix" --launcher_dir="/mesos/build/src" --logbufsecs="0"
--logging_level="INFO" --max_completed_executors_per_framework="150" --oversubscribed_resources_interval="15secs"
--perf_duration="10secs" --perf_interval="1mins" --qos_correction_interval_min="0ns" --quiet="false"
--recover="reconnect" --recovery_timeout="15mins" --registration_backoff_factor="10ms" --resources="cpus:2;gpus:0;mem:1024;disk:1024;ports:[31000-32000]"
--revocable_cpu_low_priority="true" --runtime_dir="/tmp/Endpoint_SlaveEndpointTest_NoAuthorizer_1_i7gik8"
--sandbox_directory="/mnt/mesos/sandbox" --strict="true" --switch_user="true" --systemd_enable_support="true"
--systemd_runtime_directory="/run/systemd/system" --version="false" --work_dir="/tmp/Endpoint_SlaveEndpointTest_NoAuthorizer_1_jzKQuR"
I0103 16:45:40.209008 25416 credentials.hpp:86] Loading credential for authentication from
'/tmp/Endpoint_SlaveEndpointTest_NoAuthorizer_1_i7gik8/credential'
I0103 16:45:40.209116 25416 slave.cpp:352] Agent using credential for: test-principal
I0103 16:45:40.209170 25416 credentials.hpp:37] Loading credentials for authentication from
'/tmp/Endpoint_SlaveEndpointTest_NoAuthorizer_1_i7gik8/http_credentials'
I0103 16:45:40.209291 25416 http.cpp:922] Using default 'basic' HTTP authenticator for realm
'mesos-agent-readonly'
I0103 16:45:40.209390 25416 http.cpp:922] Using default 'basic' HTTP authenticator for realm
'mesos-agent-readwrite'
I0103 16:45:40.209807 25416 slave.cpp:539] Agent resources: cpus(*):2; mem(*):1024; disk(*):1024;
ports(*):[31000-32000]
I0103 16:45:40.209839 25416 slave.cpp:547] Agent attributes: [  ]
I0103 16:45:40.209848 25416 slave.cpp:552] Agent hostname: 35674ccd59b1
I0103 16:45:40.210449 25417 state.cpp:60] Recovering state from '/tmp/Endpoint_SlaveEndpointTest_NoAuthorizer_1_jzKQuR/meta'
I0103 16:45:40.210638 25410 status_update_manager.cpp:203] Recovering status update manager
I0103 16:45:40.210840 25410 containerizer.cpp:599] Recovering containerizer
I0103 16:45:40.211414 25407 provisioner.cpp:253] Provisioner recovery complete
I0103 16:45:40.211580 25410 slave.cpp:5415] Finished recovery
I0103 16:45:40.212041 25410 slave.cpp:5589] Querying resource estimator for oversubscribable
resources
I0103 16:45:40.212203 25413 slave.cpp:5603] Received oversubscribable resources {} from the
resource estimator
I0103 16:45:40.212951 25415 process.cpp:3679] Handling HTTP event for process 'slave(675)'
with path: '/slave(675)/monitor/statistics.json'
I0103 16:45:40.213405 25416 http.cpp:874] Authorizing principal 'test-principal' to GET the
'/monitor/statistics.json' endpoint
I0103 16:45:40.214591 25405 slave.cpp:796] Agent terminating
[       OK ] Endpoint/SlaveEndpointTest.NoAuthorizer/1 (11 ms)
[ RUN      ] Endpoint/SlaveEndpointTest.NoAuthorizer/2
I0103 16:45:40.218757 25404 containerizer.cpp:220] Using isolation: posix/cpu,posix/mem,filesystem/posix,network/cni
W0103 16:45:40.219079 25404 backend.cpp:76] Failed to create 'aufs' backend: AufsBackend requires
root privileges, but is running as user mesos
W0103 16:45:40.219163 25404 backend.cpp:76] Failed to create 'bind' backend: BindBackend requires
root privileges
I0103 16:45:40.219614 25404 cluster.cpp:446] Creating default 'local' authorizer
I0103 16:45:40.219982 25418 slave.cpp:209] Mesos agent started on (676)@172.17.0.2:54367
I0103 16:45:40.220000 25418 slave.cpp:210] Flags at startup: --acls="" --appc_simple_discovery_uri_prefix="http://"
--appc_store_dir="/tmp/mesos/store/appc" --authenticate_http_readonly="true" --authenticate_http_readwrite="true"
--authenticatee="crammd5" --authentication_backoff_factor="1secs" --authorizer="local" --cgroups_cpu_enable_pids_and_tids_count="false"
--cgroups_enable_cfs="false" --cgroups_hierarchy="/sys/fs/cgroup" --cgroups_limit_swap="false"
--cgroups_root="mesos" --container_disk_watch_interval="15secs" --containerizers="mesos" --credential="/tmp/Endpoint_SlaveEndpointTest_NoAuthorizer_2_ABlEKd/credential"
--default_role="*" --disk_watch_interval="1mins" --docker="docker" --docker_kill_orphans="true"
--docker_registry="https://registry-1.docker.io" --docker_remove_delay="6hrs" --docker_socket="/var/run/docker.sock"
--docker_stop_timeout="0ns" --docker_store_dir="/tmp/mesos/store/docker" --docker_volume_checkpoint_dir="/var/run/mesos/isolators/docker/volume"
--enforce_container_disk_quota="false" --executor_registration_timeout="1mins" --executor_shutdown_grace_period="5secs"
--fetcher_cache_dir="/tmp/Endpoint_SlaveEndpointTest_NoAuthorizer_2_ABlEKd/fetch" --fetcher_cache_size="2GB"
--frameworks_home="" --gc_delay="1weeks" --gc_disk_headroom="0.1" --hadoop_home="" --help="false"
--hostname_lookup="true" --http_authenticators="basic" --http_command_executor="false" --http_credentials="/tmp/Endpoint_SlaveEndpointTest_NoAuthorizer_2_ABlEKd/http_credentials"
--http_heartbeat_interval="30secs" --image_provisioner_backend="copy" --initialize_driver_logging="true"
--isolation="posix/cpu,posix/mem" --launcher="posix" --launcher_dir="/mesos/build/src" --logbufsecs="0"
--logging_level="INFO" --max_completed_executors_per_framework="150" --oversubscribed_resources_interval="15secs"
--perf_duration="10secs" --perf_interval="1mins" --qos_correction_interval_min="0ns" --quiet="false"
--recover="reconnect" --recovery_timeout="15mins" --registration_backoff_factor="10ms" --resources="cpus:2;gpus:0;mem:1024;disk:1024;ports:[31000-32000]"
--revocable_cpu_low_priority="true" --runtime_dir="/tmp/Endpoint_SlaveEndpointTest_NoAuthorizer_2_ABlEKd"
--sandbox_directory="/mnt/mesos/sandbox" --strict="true" --switch_user="true" --systemd_enable_support="true"
--systemd_runtime_directory="/run/systemd/system" --version="false" --work_dir="/tmp/Endpoint_SlaveEndpointTest_NoAuthorizer_2_AvThTW"
I0103 16:45:40.220450 25418 credentials.hpp:86] Loading credential for authentication from
'/tmp/Endpoint_SlaveEndpointTest_NoAuthorizer_2_ABlEKd/credential'
I0103 16:45:40.220798 25418 slave.cpp:352] Agent using credential for: test-principal
I0103 16:45:40.220816 25418 credentials.hpp:37] Loading credentials for authentication from
'/tmp/Endpoint_SlaveEndpointTest_NoAuthorizer_2_ABlEKd/http_credentials'
I0103 16:45:40.220973 25418 http.cpp:922] Using default 'basic' HTTP authenticator for realm
'mesos-agent-readonly'
I0103 16:45:40.221026 25418 http.cpp:922] Using default 'basic' HTTP authenticator for realm
'mesos-agent-readwrite'
I0103 16:45:40.221487 25418 slave.cpp:539] Agent resources: cpus(*):2; mem(*):1024; disk(*):1024;
ports(*):[31000-32000]
I0103 16:45:40.221534 25418 slave.cpp:547] Agent attributes: [  ]
I0103 16:45:40.221544 25418 slave.cpp:552] Agent hostname: 35674ccd59b1
I0103 16:45:40.221985 25406 state.cpp:60] Recovering state from '/tmp/Endpoint_SlaveEndpointTest_NoAuthorizer_2_AvThTW/meta'
I0103 16:45:40.222326 25418 status_update_manager.cpp:203] Recovering status update manager
I0103 16:45:40.222421 25418 containerizer.cpp:599] Recovering containerizer
I0103 16:45:40.223069 25418 provisioner.cpp:253] Provisioner recovery complete
I0103 16:45:40.223228 25418 slave.cpp:5415] Finished recovery
I0103 16:45:40.223711 25418 slave.cpp:5589] Querying resource estimator for oversubscribable
resources
I0103 16:45:40.223887 25418 slave.cpp:5603] Received oversubscribable resources {} from the
resource estimator
I0103 16:45:40.224757 25409 process.cpp:3679] Handling HTTP event for process 'slave(676)'
with path: '/slave(676)/containers'
I0103 16:45:40.225322 25409 http.cpp:874] Authorizing principal 'test-principal' to GET the
'/containers' endpoint
I0103 16:45:40.226714 25407 slave.cpp:796] Agent terminating
[       OK ] Endpoint/SlaveEndpointTest.NoAuthorizer/2 (12 ms)
[----------] 9 tests from Endpoint/SlaveEndpointTest (125 ms total)

[----------] Global test environment tear-down
[==========] 1392 tests from 157 test cases ran. (193310 ms total)
[  PASSED  ] 1391 tests.
[  FAILED  ] 1 test, listed below:
[  FAILED  ] SlaveRecoveryTest/0.RegisterDisconnectedSlave, where TypeParam = mesos::internal::slave::MesosContainerizer

 1 FAILED TEST
  YOU HAVE 9 DISABLED TESTS

make[3]: *** [CMakeFiles/check] Error 1
make[3]: Leaving directory `/mesos/build'
make[2]: *** [CMakeFiles/check.dir/all] Error 2
make[2]: Leaving directory `/mesos/build'
make[1]: *** [CMakeFiles/check.dir/rule] Error 2
make[1]: Leaving directory `/mesos/build'
make: *** [check] Error 2
+ docker rmi mesos-1483459022-3195
Untagged: mesos-1483459022-3195:latest
Deleted: sha256:aed0ebaad26faff87a9d1866e3f4a30d782b928f37246fc320aaefebfe75f46f
Deleted: sha256:711779e32ddb16520a2c74bd16d295593a3d31af34e1c4b840c24ff77ee9db41
Deleted: sha256:a287936005d7c46a21afae4201c15b1d6aaa998d02e74d499cafd249aa4c3e10
Deleted: sha256:84519ad9936b005eedcac6be54fca5b59aa668df005ca665931714c74ef85030
Deleted: sha256:a5531c78c56c3f7b99048cb6994d18817a68af1e0eb618dd40bbb849cfe4c64a
Deleted: sha256:a137d91ba96851a6208f8093a2ced1f237a13efe175ba3dd39f38480af672dd5
Deleted: sha256:f30de3fa0545439d2a2d4c469c5ad48630563037a65170087982582ff438a13a
Deleted: sha256:69a60cb3d797289ee1ec74745ebaa2891699fc4fe91d86343afeaa7872546a59
Deleted: sha256:5a3b8f8cac01fda6b8a26edb992d0b41f467efbc9662695e9207311f9d0e82aa
Deleted: sha256:44c1898feebf5abdbe0ea567526ad84761af7f65f44736ad855b34d0a03a2d2e
Deleted: sha256:3c415466d4c0ce6165a18d2149a33102a5d2344bae89f3cd4502d96ef948732c
Deleted: sha256:118e82b57766c9df5447d974d8f28c036f16c6800136eb9ad6e4b9268b13dafb
Deleted: sha256:8e584b5a425b876f48d61efde510f3c89d722695b00523a45028b0488fa5d1cf
Deleted: sha256:f1c7e24794dc0d6f3d91605e17573aa5cadc184a05ee0d569ae646fd7560fc04
Deleted: sha256:bf7bfbb6819eb0dd77b6dc02f293ffc2264ced88873977ac6927521094d62762
Deleted: sha256:34b13d87a9bbfffc878f6004a5c04c38c3e7ca6068f15cf90ec03315f68cd973
Deleted: sha256:92c0412fd8b8aee3652b21a2d7e3dd16992c071240aa4573b53d37aeac4f174a
Deleted: sha256:6fc2d812e3894ef10a05fd1877337bb22f1b260c203cb160e5c794b95de9e6d8
Deleted: sha256:2f872b199a62dec59664f559d10f37ec6d35750d56a06ac803115a7edccbc9a3
Deleted: sha256:7c7b135219449f98bd227fd82b25bcbb7e1a61e405e16d2c2acba11c0eb98187
Deleted: sha256:bb82aeba14cf58c0b8afcee3541dfa7c0f4aff3a5126f5a6e9d9cd0cfa17e110
Deleted: sha256:1dd6d6f640e12f6ad52eea28c15ad5eb71596188376e7be0814d56131f10e713
Deleted: sha256:46028ab8beeca9e72348d1b9c3127c10d6d15c0ddb040757a7467d281eb4de65
Deleted: sha256:f372f0d1e125dbb2ddf2397e10de84634584042201bb6371a63fb67fcb507325
Deleted: sha256:679d353542c4f36b0537cc8f3d59c82a098260fff6508d0804d485573172b124
Build step 'Execute shell' marked build as failure

Mime
View raw message