mesos-builds mailing list archives

Site index · List index
Message view « Date » · « Thread »
Top « Date » · « Thread »
From Apache Jenkins Server <jenk...@builds.apache.org>
Subject Build failed in Jenkins: Mesos-Buildbot » cmake,clang,--verbose --enable-libevent --enable-ssl,GLOG_v=1 MESOS_VERBOSE=1,ubuntu:14.04,(docker||Hadoop)&&(!ubuntu-us1)&&(!ubuntu-eu2) #3185
Date Wed, 25 Jan 2017 12:02:39 GMT
See <https://builds.apache.org/job/Mesos-Buildbot/BUILDTOOL=cmake,COMPILER=clang,CONFIGURATION=--verbose%20--enable-libevent%20--enable-ssl,ENVIRONMENT=GLOG_v=1%20MESOS_VERBOSE=1,OS=ubuntu%3A14.04,label_exp=(docker%7C%7CHadoop)&&(!ubuntu-us1)&&(!ubuntu-eu2)/3185/changes>

Changes:

[mpark] Allowed `Master::Framework::updateFrameworkInfo` to return errors.

[mpark] Disallow multi-role frameworks to change their roles.

------------------------------------------
[...truncated 173295 lines...]
I0125 12:02:33.797354 25332 slave.cpp:352] Agent using credential for: test-principal
I0125 12:02:33.797369 25332 credentials.hpp:37] Loading credentials for authentication from
'/tmp/Endpoint_SlaveEndpointTest_AuthorizedRequest_1_w3xSQD/http_credentials'
I0125 12:02:33.797461 25332 http.cpp:922] Using default 'basic' HTTP authenticator for realm
'mesos-agent-readonly'
I0125 12:02:33.797507 25332 http.cpp:922] Using default 'basic' HTTP authenticator for realm
'mesos-agent-readwrite'
I0125 12:02:33.797783 25332 slave.cpp:539] Agent resources: cpus(*):2; mem(*):1024; disk(*):1024;
ports(*):[31000-32000]
I0125 12:02:33.797816 25332 slave.cpp:547] Agent attributes: [  ]
I0125 12:02:33.797822 25332 slave.cpp:552] Agent hostname: 390eb8fdab21
I0125 12:02:33.797878 25327 status_update_manager.cpp:177] Pausing sending status updates
I0125 12:02:33.798197 25320 state.cpp:60] Recovering state from '/tmp/Endpoint_SlaveEndpointTest_AuthorizedRequest_1_NQWszF/meta'
I0125 12:02:33.798504 25332 status_update_manager.cpp:203] Recovering status update manager
I0125 12:02:33.798568 25332 containerizer.cpp:599] Recovering containerizer
I0125 12:02:33.798915 25332 provisioner.cpp:251] Provisioner recovery complete
I0125 12:02:33.799038 25332 slave.cpp:5422] Finished recovery
I0125 12:02:33.799307 25332 slave.cpp:5596] Querying resource estimator for oversubscribable
resources
I0125 12:02:33.799424 25332 slave.cpp:5610] Received oversubscribable resources {} from the
resource estimator
I0125 12:02:33.800453 25334 process.cpp:3697] Handling HTTP event for process 'slave(680)'
with path: '/slave(680)/monitor/statistics.json'
I0125 12:02:33.804989 25334 http.cpp:874] Authorizing principal 'test-principal' to GET the
'/monitor/statistics.json' endpoint
I0125 12:02:33.809005 25318 slave.cpp:801] Agent terminating
[       OK ] Endpoint/SlaveEndpointTest.AuthorizedRequest/1 (30 ms)
[ RUN      ] Endpoint/SlaveEndpointTest.AuthorizedRequest/2
I0125 12:02:33.824672 25318 containerizer.cpp:220] Using isolation: posix/cpu,posix/mem,filesystem/posix,network/cni
W0125 12:02:33.824930 25318 backend.cpp:76] Failed to create 'aufs' backend: AufsBackend requires
root privileges
W0125 12:02:33.824976 25318 backend.cpp:76] Failed to create 'bind' backend: BindBackend requires
root privileges
I0125 12:02:33.826107 25332 slave.cpp:209] Mesos agent started on (681)@172.17.0.4:57235
I0125 12:02:33.826133 25332 slave.cpp:210] Flags at startup: --acls="" --appc_simple_discovery_uri_prefix="http://"
--appc_store_dir="/tmp/mesos/store/appc" --authenticate_http_readonly="true" --authenticate_http_readwrite="true"
--authenticatee="crammd5" --authentication_backoff_factor="1secs" --authorizer="local" --cgroups_cpu_enable_pids_and_tids_count="false"
--cgroups_enable_cfs="false" --cgroups_hierarchy="/sys/fs/cgroup" --cgroups_limit_swap="false"
--cgroups_root="mesos" --container_disk_watch_interval="15secs" --containerizers="mesos" --credential="/tmp/Endpoint_SlaveEndpointTest_AuthorizedRequest_2_RUQLdx/credential"
--default_role="*" --disk_watch_interval="1mins" --docker="docker" --docker_kill_orphans="true"
--docker_registry="https://registry-1.docker.io" --docker_remove_delay="6hrs" --docker_socket="/var/run/docker.sock"
--docker_stop_timeout="0ns" --docker_store_dir="/tmp/mesos/store/docker" --docker_volume_checkpoint_dir="/var/run/mesos/isolators/docker/volume"
--enforce_container_disk_quota="false" --executor_registration_timeout="1mins" --executor_shutdown_grace_period="5secs"
--fetcher_cache_dir="/tmp/Endpoint_SlaveEndpointTest_AuthorizedRequest_2_RUQLdx/fetch" --fetcher_cache_size="2GB"
--frameworks_home="" --gc_delay="1weeks" --gc_disk_headroom="0.1" --hadoop_home="" --help="false"
--hostname_lookup="true" --http_authenticators="basic" --http_command_executor="false" --http_credentials="/tmp/Endpoint_SlaveEndpointTest_AuthorizedRequest_2_RUQLdx/http_credentials"
--http_heartbeat_interval="30secs" --image_provisioner_backend="copy" --initialize_driver_logging="true"
--isolation="posix/cpu,posix/mem" --launcher="posix" --launcher_dir="/mesos/build/src" --logbufsecs="0"
--logging_level="INFO" --max_completed_executors_per_framework="150" --oversubscribed_resources_interval="15secs"
--perf_duration="10secs" --perf_interval="1mins" --qos_correction_interval_min="0ns" --quiet="false"
--recover="reconnect" --recovery_timeout="15mins" --registration_backoff_factor="10ms" --resources="cpus:2;gpus:0;mem:1024;disk:1024;ports:[31000-32000]"
--revocable_cpu_low_priority="true" --runtime_dir="/tmp/Endpoint_SlaveEndpointTest_AuthorizedRequest_2_RUQLdx"
--sandbox_directory="/mnt/mesos/sandbox" --strict="true" --switch_user="true" --systemd_enable_support="true"
--systemd_runtime_directory="/run/systemd/system" --version="false" --work_dir="/tmp/Endpoint_SlaveEndpointTest_AuthorizedRequest_2_hR8vRy"
I0125 12:02:33.826480 25332 credentials.hpp:86] Loading credential for authentication from
'/tmp/Endpoint_SlaveEndpointTest_AuthorizedRequest_2_RUQLdx/credential'
I0125 12:02:33.826588 25332 slave.cpp:352] Agent using credential for: test-principal
I0125 12:02:33.826606 25332 credentials.hpp:37] Loading credentials for authentication from
'/tmp/Endpoint_SlaveEndpointTest_AuthorizedRequest_2_RUQLdx/http_credentials'
I0125 12:02:33.826711 25332 http.cpp:922] Using default 'basic' HTTP authenticator for realm
'mesos-agent-readonly'
I0125 12:02:33.826762 25332 http.cpp:922] Using default 'basic' HTTP authenticator for realm
'mesos-agent-readwrite'
I0125 12:02:33.827080 25332 slave.cpp:539] Agent resources: cpus(*):2; mem(*):1024; disk(*):1024;
ports(*):[31000-32000]
I0125 12:02:33.827111 25332 slave.cpp:547] Agent attributes: [  ]
I0125 12:02:33.827116 25332 slave.cpp:552] Agent hostname: 390eb8fdab21
I0125 12:02:33.827239 25328 status_update_manager.cpp:177] Pausing sending status updates
I0125 12:02:33.827539 25321 state.cpp:60] Recovering state from '/tmp/Endpoint_SlaveEndpointTest_AuthorizedRequest_2_hR8vRy/meta'
I0125 12:02:33.827756 25326 status_update_manager.cpp:203] Recovering status update manager
I0125 12:02:33.827836 25331 containerizer.cpp:599] Recovering containerizer
I0125 12:02:33.828246 25331 provisioner.cpp:251] Provisioner recovery complete
I0125 12:02:33.828374 25331 slave.cpp:5422] Finished recovery
I0125 12:02:33.828702 25331 slave.cpp:5596] Querying resource estimator for oversubscribable
resources
I0125 12:02:33.828866 25324 slave.cpp:5610] Received oversubscribable resources {} from the
resource estimator
I0125 12:02:33.829926 25331 process.cpp:3697] Handling HTTP event for process 'slave(681)'
with path: '/slave(681)/containers'
I0125 12:02:33.830363 25320 http.cpp:874] Authorizing principal 'test-principal' to GET the
'/containers' endpoint
I0125 12:02:33.831835 25321 slave.cpp:801] Agent terminating
[       OK ] Endpoint/SlaveEndpointTest.AuthorizedRequest/2 (13 ms)
[ RUN      ] Endpoint/SlaveEndpointTest.UnauthorizedRequest/0
I0125 12:02:33.839200 25318 containerizer.cpp:220] Using isolation: posix/cpu,posix/mem,filesystem/posix,network/cni
W0125 12:02:33.839612 25318 backend.cpp:76] Failed to create 'aufs' backend: AufsBackend requires
root privileges
W0125 12:02:33.839654 25318 backend.cpp:76] Failed to create 'bind' backend: BindBackend requires
root privileges
I0125 12:02:33.840898 25325 slave.cpp:209] Mesos agent started on (682)@172.17.0.4:57235
I0125 12:02:33.840945 25325 slave.cpp:210] Flags at startup: --acls="" --appc_simple_discovery_uri_prefix="http://"
--appc_store_dir="/tmp/mesos/store/appc" --authenticate_http_readonly="true" --authenticate_http_readwrite="true"
--authenticatee="crammd5" --authentication_backoff_factor="1secs" --authorizer="local" --cgroups_cpu_enable_pids_and_tids_count="false"
--cgroups_enable_cfs="false" --cgroups_hierarchy="/sys/fs/cgroup" --cgroups_limit_swap="false"
--cgroups_root="mesos" --container_disk_watch_interval="15secs" --containerizers="mesos" --credential="/tmp/Endpoint_SlaveEndpointTest_UnauthorizedRequest_0_pZ97Lq/credential"
--default_role="*" --disk_watch_interval="1mins" --docker="docker" --docker_kill_orphans="true"
--docker_registry="https://registry-1.docker.io" --docker_remove_delay="6hrs" --docker_socket="/var/run/docker.sock"
--docker_stop_timeout="0ns" --docker_store_dir="/tmp/mesos/store/docker" --docker_volume_checkpoint_dir="/var/run/mesos/isolators/docker/volume"
--enforce_container_disk_quota="false" --executor_registration_timeout="1mins" --executor_shutdown_grace_period="5secs"
--fetcher_cache_dir="/tmp/Endpoint_SlaveEndpointTest_UnauthorizedRequest_0_pZ97Lq/fetch" --fetcher_cache_size="2GB"
--frameworks_home="" --gc_delay="1weeks" --gc_disk_headroom="0.1" --hadoop_home="" --help="false"
--hostname_lookup="true" --http_authenticators="basic" --http_command_executor="false" --http_credentials="/tmp/Endpoint_SlaveEndpointTest_UnauthorizedRequest_0_pZ97Lq/http_credentials"
--http_heartbeat_interval="30secs" --image_provisioner_backend="copy" --initialize_driver_logging="true"
--isolation="posix/cpu,posix/mem" --launcher="posix" --launcher_dir="/mesos/build/src" --logbufsecs="0"
--logging_level="INFO" --max_completed_executors_per_framework="150" --oversubscribed_resources_interval="15secs"
--perf_duration="10secs" --perf_interval="1mins" --qos_correction_interval_min="0ns" --quiet="false"
--recover="reconnect" --recovery_timeout="15mins" --registration_backoff_factor="10ms" --resources="cpus:2;gpus:0;mem:1024;disk:1024;ports:[31000-32000]"
--revocable_cpu_low_priority="true" --runtime_dir="/tmp/Endpoint_SlaveEndpointTest_UnauthorizedRequest_0_pZ97Lq"
--sandbox_directory="/mnt/mesos/sandbox" --strict="true" --switch_user="true" --systemd_enable_support="true"
--systemd_runtime_directory="/run/systemd/system" --version="false" --work_dir="/tmp/Endpoint_SlaveEndpointTest_UnauthorizedRequest_0_gKyCns"
I0125 12:02:33.841357 25325 credentials.hpp:86] Loading credential for authentication from
'/tmp/Endpoint_SlaveEndpointTest_UnauthorizedRequest_0_pZ97Lq/credential'
I0125 12:02:33.841480 25325 slave.cpp:352] Agent using credential for: test-principal
I0125 12:02:33.841492 25325 credentials.hpp:37] Loading credentials for authentication from
'/tmp/Endpoint_SlaveEndpointTest_UnauthorizedRequest_0_pZ97Lq/http_credentials'
I0125 12:02:33.841604 25325 http.cpp:922] Using default 'basic' HTTP authenticator for realm
'mesos-agent-readonly'
I0125 12:02:33.841650 25325 http.cpp:922] Using default 'basic' HTTP authenticator for realm
'mesos-agent-readwrite'
I0125 12:02:33.841958 25325 slave.cpp:539] Agent resources: cpus(*):2; mem(*):1024; disk(*):1024;
ports(*):[31000-32000]
I0125 12:02:33.841987 25325 slave.cpp:547] Agent attributes: [  ]
I0125 12:02:33.841992 25325 slave.cpp:552] Agent hostname: 390eb8fdab21
I0125 12:02:33.842046 25322 status_update_manager.cpp:177] Pausing sending status updates
I0125 12:02:33.842372 25327 state.cpp:60] Recovering state from '/tmp/Endpoint_SlaveEndpointTest_UnauthorizedRequest_0_gKyCns/meta'
I0125 12:02:33.842556 25328 status_update_manager.cpp:203] Recovering status update manager
I0125 12:02:33.842667 25325 containerizer.cpp:599] Recovering containerizer
I0125 12:02:33.843160 25323 provisioner.cpp:251] Provisioner recovery complete
I0125 12:02:33.843360 25323 slave.cpp:5422] Finished recovery
I0125 12:02:33.843663 25323 slave.cpp:5596] Querying resource estimator for oversubscribable
resources
I0125 12:02:33.843896 25329 slave.cpp:5610] Received oversubscribable resources {} from the
resource estimator
I0125 12:02:33.844606 25322 process.cpp:3697] Handling HTTP event for process 'slave(682)'
with path: '/slave(682)/monitor/statistics'
I0125 12:02:33.844988 25328 http.cpp:874] Authorizing principal 'test-principal' to GET the
'/monitor/statistics' endpoint
I0125 12:02:33.845887 25321 slave.cpp:801] Agent terminating
[       OK ] Endpoint/SlaveEndpointTest.UnauthorizedRequest/0 (25 ms)
[ RUN      ] Endpoint/SlaveEndpointTest.UnauthorizedRequest/1
I0125 12:02:33.863747 25318 containerizer.cpp:220] Using isolation: posix/cpu,posix/mem,filesystem/posix,network/cni
W0125 12:02:33.864024 25318 backend.cpp:76] Failed to create 'aufs' backend: AufsBackend requires
root privileges
W0125 12:02:33.864066 25318 backend.cpp:76] Failed to create 'bind' backend: BindBackend requires
root privileges
I0125 12:02:33.865206 25327 slave.cpp:209] Mesos agent started on (683)@172.17.0.4:57235
I0125 12:02:33.865232 25327 slave.cpp:210] Flags at startup: --acls="" --appc_simple_discovery_uri_prefix="http://"
--appc_store_dir="/tmp/mesos/store/appc" --authenticate_http_readonly="true" --authenticate_http_readwrite="true"
--authenticatee="crammd5" --authentication_backoff_factor="1secs" --authorizer="local" --cgroups_cpu_enable_pids_and_tids_count="false"
--cgroups_enable_cfs="false" --cgroups_hierarchy="/sys/fs/cgroup" --cgroups_limit_swap="false"
--cgroups_root="mesos" --container_disk_watch_interval="15secs" --containerizers="mesos" --credential="/tmp/Endpoint_SlaveEndpointTest_UnauthorizedRequest_1_lRsizk/credential"
--default_role="*" --disk_watch_interval="1mins" --docker="docker" --docker_kill_orphans="true"
--docker_registry="https://registry-1.docker.io" --docker_remove_delay="6hrs" --docker_socket="/var/run/docker.sock"
--docker_stop_timeout="0ns" --docker_store_dir="/tmp/mesos/store/docker" --docker_volume_checkpoint_dir="/var/run/mesos/isolators/docker/volume"
--enforce_container_disk_quota="false" --executor_registration_timeout="1mins" --executor_shutdown_grace_period="5secs"
--fetcher_cache_dir="/tmp/Endpoint_SlaveEndpointTest_UnauthorizedRequest_1_lRsizk/fetch" --fetcher_cache_size="2GB"
--frameworks_home="" --gc_delay="1weeks" --gc_disk_headroom="0.1" --hadoop_home="" --help="false"
--hostname_lookup="true" --http_authenticators="basic" --http_command_executor="false" --http_credentials="/tmp/Endpoint_SlaveEndpointTest_UnauthorizedRequest_1_lRsizk/http_credentials"
--http_heartbeat_interval="30secs" --image_provisioner_backend="copy" --initialize_driver_logging="true"
--isolation="posix/cpu,posix/mem" --launcher="posix" --launcher_dir="/mesos/build/src" --logbufsecs="0"
--logging_level="INFO" --max_completed_executors_per_framework="150" --oversubscribed_resources_interval="15secs"
--perf_duration="10secs" --perf_interval="1mins" --qos_correction_interval_min="0ns" --quiet="false"
--recover="reconnect" --recovery_timeout="15mins" --registration_backoff_factor="10ms" --resources="cpus:2;gpus:0;mem:1024;disk:1024;ports:[31000-32000]"
--revocable_cpu_low_priority="true" --runtime_dir="/tmp/Endpoint_SlaveEndpointTest_UnauthorizedRequest_1_lRsizk"
--sandbox_directory="/mnt/mesos/sandbox" --strict="true" --switch_user="true" --systemd_enable_support="true"
--systemd_runtime_directory="/run/systemd/system" --version="false" --work_dir="/tmp/Endpoint_SlaveEndpointTest_UnauthorizedRequest_1_HZLG6l"
I0125 12:02:33.865697 25327 credentials.hpp:86] Loading credential for authentication from
'/tmp/Endpoint_SlaveEndpointTest_UnauthorizedRequest_1_lRsizk/credential'
I0125 12:02:33.865777 25327 slave.cpp:352] Agent using credential for: test-principal
I0125 12:02:33.865789 25327 credentials.hpp:37] Loading credentials for authentication from
'/tmp/Endpoint_SlaveEndpointTest_UnauthorizedRequest_1_lRsizk/http_credentials'
I0125 12:02:33.865895 25327 http.cpp:922] Using default 'basic' HTTP authenticator for realm
'mesos-agent-readonly'
I0125 12:02:33.865989 25327 http.cpp:922] Using default 'basic' HTTP authenticator for realm
'mesos-agent-readwrite'
I0125 12:02:33.866315 25327 slave.cpp:539] Agent resources: cpus(*):2; mem(*):1024; disk(*):1024;
ports(*):[31000-32000]
I0125 12:02:33.866345 25327 slave.cpp:547] Agent attributes: [  ]
I0125 12:02:33.866350 25327 slave.cpp:552] Agent hostname: 390eb8fdab21
I0125 12:02:33.866659 25327 status_update_manager.cpp:177] Pausing sending status updates
I0125 12:02:33.866865 25327 state.cpp:60] Recovering state from '/tmp/Endpoint_SlaveEndpointTest_UnauthorizedRequest_1_HZLG6l/meta'
I0125 12:02:33.866984 25327 status_update_manager.cpp:203] Recovering status update manager
I0125 12:02:33.867036 25327 containerizer.cpp:599] Recovering containerizer
I0125 12:02:33.867410 25327 provisioner.cpp:251] Provisioner recovery complete
I0125 12:02:33.867522 25327 slave.cpp:5422] Finished recovery
I0125 12:02:33.867825 25327 slave.cpp:5596] Querying resource estimator for oversubscribable
resources
I0125 12:02:33.867954 25327 slave.cpp:5610] Received oversubscribable resources {} from the
resource estimator
I0125 12:02:33.868687 25328 process.cpp:3697] Handling HTTP event for process 'slave(683)'
with path: '/slave(683)/monitor/statistics.json'
I0125 12:02:33.869096 25321 http.cpp:874] Authorizing principal 'test-principal' to GET the
'/monitor/statistics.json' endpoint
I0125 12:02:33.870031 25319 slave.cpp:801] Agent terminating
[       OK ] Endpoint/SlaveEndpointTest.UnauthorizedRequest/1 (11 ms)
[ RUN      ] Endpoint/SlaveEndpointTest.UnauthorizedRequest/2
I0125 12:02:33.874289 25318 containerizer.cpp:220] Using isolation: posix/cpu,posix/mem,filesystem/posix,network/cni
W0125 12:02:33.874557 25318 backend.cpp:76] Failed to create 'aufs' backend: AufsBackend requires
root privileges
W0125 12:02:33.874590 25318 backend.cpp:76] Failed to create 'bind' backend: BindBackend requires
root privileges
I0125 12:02:33.875391 25331 slave.cpp:209] Mesos agent started on (684)@172.17.0.4:57235
I0125 12:02:33.875419 25331 slave.cpp:210] Flags at startup: --acls="" --appc_simple_discovery_uri_prefix="http://"
--appc_store_dir="/tmp/mesos/store/appc" --authenticate_http_readonly="true" --authenticate_http_readwrite="true"
--authenticatee="crammd5" --authentication_backoff_factor="1secs" --authorizer="local" --cgroups_cpu_enable_pids_and_tids_count="false"
--cgroups_enable_cfs="false" --cgroups_hierarchy="/sys/fs/cgroup" --cgroups_limit_swap="false"
--cgroups_root="mesos" --container_disk_watch_interval="15secs" --containerizers="mesos" --credential="/tmp/Endpoint_SlaveEndpointTest_UnauthorizedRequest_2_ipNAve/credential"
--default_role="*" --disk_watch_interval="1mins" --docker="docker" --docker_kill_orphans="true"
--docker_registry="https://registry-1.docker.io" --docker_remove_delay="6hrs" --docker_socket="/var/run/docker.sock"
--docker_stop_timeout="0ns" --docker_store_dir="/tmp/mesos/store/docker" --docker_volume_checkpoint_dir="/var/run/mesos/isolators/docker/volume"
--enforce_container_disk_quota="false" --executor_registration_timeout="1mins" --executor_shutdown_grace_period="5secs"
--fetcher_cache_dir="/tmp/Endpoint_SlaveEndpointTest_UnauthorizedRequest_2_ipNAve/fetch" --fetcher_cache_size="2GB"
--frameworks_home="" --gc_delay="1weeks" --gc_disk_headroom="0.1" --hadoop_home="" --help="false"
--hostname_lookup="true" --http_authenticators="basic" --http_command_executor="false" --http_credentials="/tmp/Endpoint_SlaveEndpointTest_UnauthorizedRequest_2_ipNAve/http_credentials"
--http_heartbeat_interval="30secs" --image_provisioner_backend="copy" --initialize_driver_logging="true"
--isolation="posix/cpu,posix/mem" --launcher="posix" --launcher_dir="/mesos/build/src" --logbufsecs="0"
--logging_level="INFO" --max_completed_executors_per_framework="150" --oversubscribed_resources_interval="15secs"
--perf_duration="10secs" --perf_interval="1mins" --qos_correction_interval_min="0ns" --quiet="false"
--recover="reconnect" --recovery_timeout="15mins" --registration_backoff_factor="10ms" --resources="cpus:2;gpus:0;mem:1024;disk:1024;ports:[31000-32000]"
--revocable_cpu_low_priority="true" --runtime_dir="/tmp/Endpoint_SlaveEndpointTest_UnauthorizedRequest_2_ipNAve"
--sandbox_directory="/mnt/mesos/sandbox" --strict="true" --switch_user="true" --systemd_enable_support="true"
--systemd_runtime_directory="/run/systemd/system" --version="false" --work_dir="/tmp/Endpoint_SlaveEndpointTest_UnauthorizedRequest_2_nwQf1f"
I0125 12:02:33.875818 25331 credentials.hpp:86] Loading credential for authentication from
'/tmp/Endpoint_SlaveEndpointTest_UnauthorizedRequest_2_ipNAve/credential'
I0125 12:02:33.875923 25331 slave.cpp:352] Agent using credential for: test-principal
I0125 12:02:33.875941 25331 credentials.hpp:37] Loading credentials for authentication from
'/tmp/Endpoint_SlaveEndpointTest_UnauthorizedRequest_2_ipNAve/http_credentials'
I0125 12:02:33.876055 25331 http.cpp:922] Using default 'basic' HTTP authenticator for realm
'mesos-agent-readonly'
I0125 12:02:33.876128 25331 http.cpp:922] Using default 'basic' HTTP authenticator for realm
'mesos-agent-readwrite'
I0125 12:02:33.876562 25331 slave.cpp:539] Agent resources: cpus(*):2; mem(*):1024; disk(*):1024;
ports(*):[31000-32000]
I0125 12:02:33.876610 25331 slave.cpp:547] Agent attributes: [  ]
I0125 12:02:33.876619 25331 slave.cpp:552] Agent hostname: 390eb8fdab21
I0125 12:02:33.877107 25334 state.cpp:60] Recovering state from '/tmp/Endpoint_SlaveEndpointTest_UnauthorizedRequest_2_nwQf1f/meta'
I0125 12:02:33.877178 25320 status_update_manager.cpp:177] Pausing sending status updates
I0125 12:02:33.877341 25334 status_update_manager.cpp:203] Recovering status update manager
I0125 12:02:33.877446 25332 containerizer.cpp:599] Recovering containerizer
I0125 12:02:33.877846 25332 provisioner.cpp:251] Provisioner recovery complete
I0125 12:02:33.877977 25332 slave.cpp:5422] Finished recovery
I0125 12:02:33.878270 25332 slave.cpp:5596] Querying resource estimator for oversubscribable
resources
I0125 12:02:33.878407 25332 slave.cpp:5610] Received oversubscribable resources {} from the
resource estimator
I0125 12:02:33.879122 25325 process.cpp:3697] Handling HTTP event for process 'slave(684)'
with path: '/slave(684)/containers'
I0125 12:02:33.879467 25325 http.cpp:874] Authorizing principal 'test-principal' to GET the
'/containers' endpoint
I0125 12:02:33.880520 25318 slave.cpp:801] Agent terminating
[       OK ] Endpoint/SlaveEndpointTest.UnauthorizedRequest/2 (17 ms)
[ RUN      ] Endpoint/SlaveEndpointTest.NoAuthorizer/0
I0125 12:02:33.891458 25318 containerizer.cpp:220] Using isolation: posix/cpu,posix/mem,filesystem/posix,network/cni
W0125 12:02:33.891705 25318 backend.cpp:76] Failed to create 'aufs' backend: AufsBackend requires
root privileges
W0125 12:02:33.891739 25318 backend.cpp:76] Failed to create 'bind' backend: BindBackend requires
root privileges
I0125 12:02:33.892288 25318 cluster.cpp:446] Creating default 'local' authorizer
I0125 12:02:33.892861 25322 slave.cpp:209] Mesos agent started on (685)@172.17.0.4:57235
I0125 12:02:33.892882 25322 slave.cpp:210] Flags at startup: --acls="" --appc_simple_discovery_uri_prefix="http://"
--appc_store_dir="/tmp/mesos/store/appc" --authenticate_http_readonly="true" --authenticate_http_readwrite="true"
--authenticatee="crammd5" --authentication_backoff_factor="1secs" --authorizer="local" --cgroups_cpu_enable_pids_and_tids_count="false"
--cgroups_enable_cfs="false" --cgroups_hierarchy="/sys/fs/cgroup" --cgroups_limit_swap="false"
--cgroups_root="mesos" --container_disk_watch_interval="15secs" --containerizers="mesos" --credential="/tmp/Endpoint_SlaveEndpointTest_NoAuthorizer_0_7cYUB8/credential"
--default_role="*" --disk_watch_interval="1mins" --docker="docker" --docker_kill_orphans="true"
--docker_registry="https://registry-1.docker.io" --docker_remove_delay="6hrs" --docker_socket="/var/run/docker.sock"
--docker_stop_timeout="0ns" --docker_store_dir="/tmp/mesos/store/docker" --docker_volume_checkpoint_dir="/var/run/mesos/isolators/docker/volume"
--enforce_container_disk_quota="false" --executor_registration_timeout="1mins" --executor_shutdown_grace_period="5secs"
--fetcher_cache_dir="/tmp/Endpoint_SlaveEndpointTest_NoAuthorizer_0_7cYUB8/fetch" --fetcher_cache_size="2GB"
--frameworks_home="" --gc_delay="1weeks" --gc_disk_headroom="0.1" --hadoop_home="" --help="false"
--hostname_lookup="true" --http_authenticators="basic" --http_command_executor="false" --http_credentials="/tmp/Endpoint_SlaveEndpointTest_NoAuthorizer_0_7cYUB8/http_credentials"
--http_heartbeat_interval="30secs" --image_provisioner_backend="copy" --initialize_driver_logging="true"
--isolation="posix/cpu,posix/mem" --launcher="posix" --launcher_dir="/mesos/build/src" --logbufsecs="0"
--logging_level="INFO" --max_completed_executors_per_framework="150" --oversubscribed_resources_interval="15secs"
--perf_duration="10secs" --perf_interval="1mins" --qos_correction_interval_min="0ns" --quiet="false"
--recover="reconnect" --recovery_timeout="15mins" --registration_backoff_factor="10ms" --resources="cpus:2;gpus:0;mem:1024;disk:1024;ports:[31000-32000]"
--revocable_cpu_low_priority="true" --runtime_dir="/tmp/Endpoint_SlaveEndpointTest_NoAuthorizer_0_7cYUB8"
--sandbox_directory="/mnt/mesos/sandbox" --strict="true" --switch_user="true" --systemd_enable_support="true"
--systemd_runtime_directory="/run/systemd/system" --version="false" --work_dir="/tmp/Endpoint_SlaveEndpointTest_NoAuthorizer_0_CtXN49"
I0125 12:02:33.893178 25322 credentials.hpp:86] Loading credential for authentication from
'/tmp/Endpoint_SlaveEndpointTest_NoAuthorizer_0_7cYUB8/credential'
I0125 12:02:33.893249 25322 slave.cpp:352] Agent using credential for: test-principal
I0125 12:02:33.893260 25322 credentials.hpp:37] Loading credentials for authentication from
'/tmp/Endpoint_SlaveEndpointTest_NoAuthorizer_0_7cYUB8/http_credentials'
I0125 12:02:33.893343 25322 http.cpp:922] Using default 'basic' HTTP authenticator for realm
'mesos-agent-readonly'
I0125 12:02:33.893395 25322 http.cpp:922] Using default 'basic' HTTP authenticator for realm
'mesos-agent-readwrite'
I0125 12:02:33.893730 25322 slave.cpp:539] Agent resources: cpus(*):2; mem(*):1024; disk(*):1024;
ports(*):[31000-32000]
I0125 12:02:33.893762 25322 slave.cpp:547] Agent attributes: [  ]
I0125 12:02:33.893769 25322 slave.cpp:552] Agent hostname: 390eb8fdab21
I0125 12:02:33.893858 25327 status_update_manager.cpp:177] Pausing sending status updates
I0125 12:02:33.894101 25322 state.cpp:60] Recovering state from '/tmp/Endpoint_SlaveEndpointTest_NoAuthorizer_0_CtXN49/meta'
I0125 12:02:33.894260 25327 status_update_manager.cpp:203] Recovering status update manager
I0125 12:02:33.894348 25325 containerizer.cpp:599] Recovering containerizer
I0125 12:02:33.894731 25325 provisioner.cpp:251] Provisioner recovery complete
I0125 12:02:33.894848 25325 slave.cpp:5422] Finished recovery
I0125 12:02:33.895122 25325 slave.cpp:5596] Querying resource estimator for oversubscribable
resources
I0125 12:02:33.895257 25325 slave.cpp:5610] Received oversubscribable resources {} from the
resource estimator
I0125 12:02:33.895931 25329 process.cpp:3697] Handling HTTP event for process 'slave(685)'
with path: '/slave(685)/monitor/statistics'
I0125 12:02:33.896304 25324 http.cpp:874] Authorizing principal 'test-principal' to GET the
'/monitor/statistics' endpoint
I0125 12:02:33.897538 25320 slave.cpp:801] Agent terminating
[       OK ] Endpoint/SlaveEndpointTest.NoAuthorizer/0 (10 ms)
[ RUN      ] Endpoint/SlaveEndpointTest.NoAuthorizer/1
I0125 12:02:33.901610 25318 containerizer.cpp:220] Using isolation: posix/cpu,posix/mem,filesystem/posix,network/cni
W0125 12:02:33.901865 25318 backend.cpp:76] Failed to create 'aufs' backend: AufsBackend requires
root privileges
W0125 12:02:33.901903 25318 backend.cpp:76] Failed to create 'bind' backend: BindBackend requires
root privileges
I0125 12:02:33.902505 25318 cluster.cpp:446] Creating default 'local' authorizer
I0125 12:02:33.902962 25327 slave.cpp:209] Mesos agent started on (686)@172.17.0.4:57235
I0125 12:02:33.902987 25327 slave.cpp:210] Flags at startup: --acls="" --appc_simple_discovery_uri_prefix="http://"
--appc_store_dir="/tmp/mesos/store/appc" --authenticate_http_readonly="true" --authenticate_http_readwrite="true"
--authenticatee="crammd5" --authentication_backoff_factor="1secs" --authorizer="local" --cgroups_cpu_enable_pids_and_tids_count="false"
--cgroups_enable_cfs="false" --cgroups_hierarchy="/sys/fs/cgroup" --cgroups_limit_swap="false"
--cgroups_root="mesos" --container_disk_watch_interval="15secs" --containerizers="mesos" --credential="/tmp/Endpoint_SlaveEndpointTest_NoAuthorizer_1_vC0TP2/credential"
--default_role="*" --disk_watch_interval="1mins" --docker="docker" --docker_kill_orphans="true"
--docker_registry="https://registry-1.docker.io" --docker_remove_delay="6hrs" --docker_socket="/var/run/docker.sock"
--docker_stop_timeout="0ns" --docker_store_dir="/tmp/mesos/store/docker" --docker_volume_checkpoint_dir="/var/run/mesos/isolators/docker/volume"
--enforce_container_disk_quota="false" --executor_registration_timeout="1mins" --executor_shutdown_grace_period="5secs"
--fetcher_cache_dir="/tmp/Endpoint_SlaveEndpointTest_NoAuthorizer_1_vC0TP2/fetch" --fetcher_cache_size="2GB"
--frameworks_home="" --gc_delay="1weeks" --gc_disk_headroom="0.1" --hadoop_home="" --help="false"
--hostname_lookup="true" --http_authenticators="basic" --http_command_executor="false" --http_credentials="/tmp/Endpoint_SlaveEndpointTest_NoAuthorizer_1_vC0TP2/http_credentials"
--http_heartbeat_interval="30secs" --image_provisioner_backend="copy" --initialize_driver_logging="true"
--isolation="posix/cpu,posix/mem" --launcher="posix" --launcher_dir="/mesos/build/src" --logbufsecs="0"
--logging_level="INFO" --max_completed_executors_per_framework="150" --oversubscribed_resources_interval="15secs"
--perf_duration="10secs" --perf_interval="1mins" --qos_correction_interval_min="0ns" --quiet="false"
--recover="reconnect" --recovery_timeout="15mins" --registration_backoff_factor="10ms" --resources="cpus:2;gpus:0;mem:1024;disk:1024;ports:[31000-32000]"
--revocable_cpu_low_priority="true" --runtime_dir="/tmp/Endpoint_SlaveEndpointTest_NoAuthorizer_1_vC0TP2"
--sandbox_directory="/mnt/mesos/sandbox" --strict="true" --switch_user="true" --systemd_enable_support="true"
--systemd_runtime_directory="/run/systemd/system" --version="false" --work_dir="/tmp/Endpoint_SlaveEndpointTest_NoAuthorizer_1_oak9g4"
I0125 12:02:33.903324 25327 credentials.hpp:86] Loading credential for authentication from
'/tmp/Endpoint_SlaveEndpointTest_NoAuthorizer_1_vC0TP2/credential'
I0125 12:02:33.903414 25327 slave.cpp:352] Agent using credential for: test-principal
I0125 12:02:33.903432 25327 credentials.hpp:37] Loading credentials for authentication from
'/tmp/Endpoint_SlaveEndpointTest_NoAuthorizer_1_vC0TP2/http_credentials'
I0125 12:02:33.903565 25327 http.cpp:922] Using default 'basic' HTTP authenticator for realm
'mesos-agent-readonly'
I0125 12:02:33.903654 25327 http.cpp:922] Using default 'basic' HTTP authenticator for realm
'mesos-agent-readwrite'
I0125 12:02:33.903972 25327 slave.cpp:539] Agent resources: cpus(*):2; mem(*):1024; disk(*):1024;
ports(*):[31000-32000]
I0125 12:02:33.904003 25327 slave.cpp:547] Agent attributes: [  ]
I0125 12:02:33.904007 25327 slave.cpp:552] Agent hostname: 390eb8fdab21
I0125 12:02:33.904121 25328 status_update_manager.cpp:177] Pausing sending status updates
I0125 12:02:33.904379 25329 state.cpp:60] Recovering state from '/tmp/Endpoint_SlaveEndpointTest_NoAuthorizer_1_oak9g4/meta'
I0125 12:02:33.904599 25321 status_update_manager.cpp:203] Recovering status update manager
I0125 12:02:33.904767 25331 containerizer.cpp:599] Recovering containerizer
I0125 12:02:33.905361 25326 provisioner.cpp:251] Provisioner recovery complete
I0125 12:02:33.905550 25321 slave.cpp:5422] Finished recovery
I0125 12:02:33.905982 25321 slave.cpp:5596] Querying resource estimator for oversubscribable
resources
I0125 12:02:33.906158 25325 slave.cpp:5610] Received oversubscribable resources {} from the
resource estimator
I0125 12:02:33.906767 25319 process.cpp:3697] Handling HTTP event for process 'slave(686)'
with path: '/slave(686)/monitor/statistics.json'
I0125 12:02:33.907167 25325 http.cpp:874] Authorizing principal 'test-principal' to GET the
'/monitor/statistics.json' endpoint
I0125 12:02:33.908972 25331 slave.cpp:801] Agent terminating
[       OK ] Endpoint/SlaveEndpointTest.NoAuthorizer/1 (11 ms)
[ RUN      ] Endpoint/SlaveEndpointTest.NoAuthorizer/2
I0125 12:02:33.913888 25318 containerizer.cpp:220] Using isolation: posix/cpu,posix/mem,filesystem/posix,network/cni
W0125 12:02:33.914207 25318 backend.cpp:76] Failed to create 'aufs' backend: AufsBackend requires
root privileges
W0125 12:02:33.914248 25318 backend.cpp:76] Failed to create 'bind' backend: BindBackend requires
root privileges
I0125 12:02:33.914813 25318 cluster.cpp:446] Creating default 'local' authorizer
I0125 12:02:33.915297 25329 slave.cpp:209] Mesos agent started on (687)@172.17.0.4:57235
I0125 12:02:33.915341 25329 slave.cpp:210] Flags at startup: --acls="" --appc_simple_discovery_uri_prefix="http://"
--appc_store_dir="/tmp/mesos/store/appc" --authenticate_http_readonly="true" --authenticate_http_readwrite="true"
--authenticatee="crammd5" --authentication_backoff_factor="1secs" --authorizer="local" --cgroups_cpu_enable_pids_and_tids_count="false"
--cgroups_enable_cfs="false" --cgroups_hierarchy="/sys/fs/cgroup" --cgroups_limit_swap="false"
--cgroups_root="mesos" --container_disk_watch_interval="15secs" --containerizers="mesos" --credential="/tmp/Endpoint_SlaveEndpointTest_NoAuthorizer_2_yFembX/credential"
--default_role="*" --disk_watch_interval="1mins" --docker="docker" --docker_kill_orphans="true"
--docker_registry="https://registry-1.docker.io" --docker_remove_delay="6hrs" --docker_socket="/var/run/docker.sock"
--docker_stop_timeout="0ns" --docker_store_dir="/tmp/mesos/store/docker" --docker_volume_checkpoint_dir="/var/run/mesos/isolators/docker/volume"
--enforce_container_disk_quota="false" --executor_registration_timeout="1mins" --executor_shutdown_grace_period="5secs"
--fetcher_cache_dir="/tmp/Endpoint_SlaveEndpointTest_NoAuthorizer_2_yFembX/fetch" --fetcher_cache_size="2GB"
--frameworks_home="" --gc_delay="1weeks" --gc_disk_headroom="0.1" --hadoop_home="" --help="false"
--hostname_lookup="true" --http_authenticators="basic" --http_command_executor="false" --http_credentials="/tmp/Endpoint_SlaveEndpointTest_NoAuthorizer_2_yFembX/http_credentials"
--http_heartbeat_interval="30secs" --image_provisioner_backend="copy" --initialize_driver_logging="true"
--isolation="posix/cpu,posix/mem" --launcher="posix" --launcher_dir="/mesos/build/src" --logbufsecs="0"
--logging_level="INFO" --max_completed_executors_per_framework="150" --oversubscribed_resources_interval="15secs"
--perf_duration="10secs" --perf_interval="1mins" --qos_correction_interval_min="0ns" --quiet="false"
--recover="reconnect" --recovery_timeout="15mins" --registration_backoff_factor="10ms" --resources="cpus:2;gpus:0;mem:1024;disk:1024;ports:[31000-32000]"
--revocable_cpu_low_priority="true" --runtime_dir="/tmp/Endpoint_SlaveEndpointTest_NoAuthorizer_2_yFembX"
--sandbox_directory="/mnt/mesos/sandbox" --strict="true" --switch_user="true" --systemd_enable_support="true"
--systemd_runtime_directory="/run/systemd/system" --version="false" --work_dir="/tmp/Endpoint_SlaveEndpointTest_NoAuthorizer_2_ZcxGAY"
I0125 12:02:33.915676 25329 credentials.hpp:86] Loading credential for authentication from
'/tmp/Endpoint_SlaveEndpointTest_NoAuthorizer_2_yFembX/credential'
I0125 12:02:33.915768 25329 slave.cpp:352] Agent using credential for: test-principal
I0125 12:02:33.915784 25329 credentials.hpp:37] Loading credentials for authentication from
'/tmp/Endpoint_SlaveEndpointTest_NoAuthorizer_2_yFembX/http_credentials'
I0125 12:02:33.915953 25329 http.cpp:922] Using default 'basic' HTTP authenticator for realm
'mesos-agent-readonly'
I0125 12:02:33.916009 25329 http.cpp:922] Using default 'basic' HTTP authenticator for realm
'mesos-agent-readwrite'
I0125 12:02:33.916337 25329 slave.cpp:539] Agent resources: cpus(*):2; mem(*):1024; disk(*):1024;
ports(*):[31000-32000]
I0125 12:02:33.916368 25329 slave.cpp:547] Agent attributes: [  ]
I0125 12:02:33.916371 25329 slave.cpp:552] Agent hostname: 390eb8fdab21
I0125 12:02:33.916491 25323 status_update_manager.cpp:177] Pausing sending status updates
I0125 12:02:33.916877 25327 state.cpp:60] Recovering state from '/tmp/Endpoint_SlaveEndpointTest_NoAuthorizer_2_ZcxGAY/meta'
I0125 12:02:33.917048 25326 status_update_manager.cpp:203] Recovering status update manager
I0125 12:02:33.917119 25331 containerizer.cpp:599] Recovering containerizer
I0125 12:02:33.917722 25323 provisioner.cpp:251] Provisioner recovery complete
I0125 12:02:33.917968 25320 slave.cpp:5422] Finished recovery
I0125 12:02:33.918298 25320 slave.cpp:5596] Querying resource estimator for oversubscribable
resources
I0125 12:02:33.918376 25331 slave.cpp:5610] Received oversubscribable resources {} from the
resource estimator
I0125 12:02:33.918956 25324 process.cpp:3697] Handling HTTP event for process 'slave(687)'
with path: '/slave(687)/containers'
I0125 12:02:33.919284 25325 http.cpp:874] Authorizing principal 'test-principal' to GET the
'/containers' endpoint
I0125 12:02:33.920366 25328 slave.cpp:801] Agent terminating
[       OK ] Endpoint/SlaveEndpointTest.NoAuthorizer/2 (11 ms)
[----------] 9 tests from Endpoint/SlaveEndpointTest (142 ms total)

[----------] Global test environment tear-down
[==========] 1413 tests from 158 test cases ran. (195706 ms total)
[  PASSED  ] 1412 tests.
[  FAILED  ] 1 test, listed below:
[  FAILED  ] FaultToleranceTest.FrameworkReregister

 1 FAILED TEST
  YOU HAVE 14 DISABLED TESTS

make[3]: Leaving directory `/mesos/build'
make[3]: *** [CMakeFiles/check] Error 1
make[2]: *** [CMakeFiles/check.dir/all] Error 2
make[2]: Leaving directory `/mesos/build'
make[1]: *** [CMakeFiles/check.dir/rule] Error 2
make[1]: Leaving directory `/mesos/build'
make: *** [check] Error 2
+ docker rmi mesos-1485343430-13754
Untagged: mesos-1485343430-13754:latest
Deleted: sha256:965c86a52774e2ac6159c761e354e266f8c1c743b4783c275e522d2d06e99980
Deleted: sha256:f50147c414bf51684fd3f9b0ffe820f423714355a36ec807baf5772c121b1782
Deleted: sha256:d01a69a472407ccf205c205f3defb2cae06a1cb22fa46eb61d1144e2e9d19e9e
Deleted: sha256:b1ebbb8dbbc187c0c4f647e4dc3bd6a81d290e4a8e52113770f825b59db53bfb
Deleted: sha256:cb9adfe2bff38bbe49f1a61a880c9b0594f1e261cb6a51770a6b86aeba93f1b9
Deleted: sha256:8d983f256db76f987a0c8528dff0a3048a3557a0b381f736ff95fb53500f3d04
Deleted: sha256:44a4f7c8514b1531f0dd6b591d4f723cda4d19a5faf6627a83b5832fc539523c
Deleted: sha256:794e5dc0f8a12bed548bc852d7d8c53d17f06a3e06141f6f2077966409f5abcd
Deleted: sha256:787b7a1e31921f77e9dc2ab2fe8d38cbd970daa6e06c83b3b4ce9ea1cf43d23b
Deleted: sha256:88e97a67e316d81969678f9f0801928979155668906725bc1bd74b5e896c8dcf
Deleted: sha256:327a311f6bc59f8e00a5784d2610c2afe756639e876dfbb9f947ba0cbeb4d867
Deleted: sha256:e5571ba4a7788f32a2bf1ccee515266437d5cf41c89d10baa0648c3fa1184ea6
Deleted: sha256:99f5697f9a6da22d992d7c2425a476126a5cc46f82b5d66268c7eb2c01ae0b63
Deleted: sha256:bfa762eaa1b7d305f2d6b6e8d245afd5a5973c4fb67ce4377c34bc65e2a45969
Deleted: sha256:5cbd600a87cdfd0a7c4ec6f41f27911a8e5c2ff40fbfa05c10ec1384f7987c9d
Deleted: sha256:42952e71c304207c9d9dc5200e0b94d5ef334d1e0e65c0ce154ffa07df882659
Deleted: sha256:b5d9133f85f26e76ef6adc1f9af6ab15efbe2ec04da33975a5e8c71140c0096e
Deleted: sha256:256ba32edaf21acb221058c01caadb604dc2d09a3696f3f1b805662110a522d4
Deleted: sha256:f2e65e83d741de260b1b18b3391f884ea5c9cd79eb84c4ec7c65b5de5da28fef
Deleted: sha256:4ad7a184d7299f52594be4a1bbf7c6d0f6f0015cb9ffda891ef69f3a95b95623
Deleted: sha256:e8e1ac8a69697c07d2f3766e7edd03996ae84dd326a4286b0f0753878b510723
Deleted: sha256:5775b3237ce22d89d902a26277494d5a8be30dcfcabf46d4a63a865e10936356
Deleted: sha256:a24a2d23d7d7dc6742d990ab90475c128610ead2101d6a7f9a1c253377b26ebf
Deleted: sha256:065a937e5b1d1ca79375ad23e171b85b21db98401799bea3e4c3edb24ae0970a
Build step 'Execute shell' marked build as failure

Mime
View raw message