mesos-builds mailing list archives

Site index · List index
Message view « Date » · « Thread »
Top « Date » · « Thread »
From Apache Jenkins Server <jenk...@builds.apache.org>
Subject Build failed in Jenkins: Mesos-Buildbot » autotools,gcc,--verbose --enable-libevent --enable-ssl,GLOG_v=1 MESOS_VERBOSE=1,centos:7,(docker||Hadoop)&&(!ubuntu-us1)&&(!ubuntu-eu2) #3185
Date Wed, 25 Jan 2017 11:34:04 GMT
See <https://builds.apache.org/job/Mesos-Buildbot/BUILDTOOL=autotools,COMPILER=gcc,CONFIGURATION=--verbose%20--enable-libevent%20--enable-ssl,ENVIRONMENT=GLOG_v=1%20MESOS_VERBOSE=1,OS=centos%3A7,label_exp=(docker%7C%7CHadoop)&&(!ubuntu-us1)&&(!ubuntu-eu2)/3185/changes>

Changes:

[mpark] Allowed `Master::Framework::updateFrameworkInfo` to return errors.

[mpark] Disallow multi-role frameworks to change their roles.

------------------------------------------
[...truncated 13065 lines...]
I0125 11:33:53.300067 27745 process.cpp:1246] libprocess is initialized on 172.17.0.3:54119
with 16 worker threads
I0125 11:33:53.308900 28872 process.cpp:3697] Handling HTTP event for process '(87)' with
path: '/(87)/pipe'
I0125 11:33:53.349501 28872 process.cpp:1597] Failed to read from stream: oops
[       OK ] Scheme/HTTPTest.StreamingGetFailure/0 (515 ms)
[ RUN      ] Scheme/HTTPTest.StreamingGetFailure/1
I0125 11:33:53.354996 27745 process.cpp:1246] libprocess is initialized on 172.17.0.3:46313
with 16 worker threads
I0125 11:33:53.358348 28893 process.cpp:3697] Handling HTTP event for process '(88)' with
path: '/(88)/pipe'
I0125 11:33:53.362045 28891 process.cpp:1597] Failed to read from stream: oops
[       OK ] Scheme/HTTPTest.StreamingGetFailure/1 (27 ms)
[ RUN      ] Scheme/HTTPTest.PipeEquality/0
I0125 11:33:53.769207 27745 openssl.cpp:419] CA file path is unspecified! NOTE: Set CA file
path with LIBPROCESS_SSL_CA_FILE=<filepath>
I0125 11:33:53.769232 27745 openssl.cpp:424] CA directory path unspecified! NOTE: Set CA directory
path with LIBPROCESS_SSL_CA_DIR=<dirpath>
I0125 11:33:53.769237 27745 openssl.cpp:429] Will not verify peer certificate!
NOTE: Set LIBPROCESS_SSL_VERIFY_CERT=1 to enable peer certificate verification
I0125 11:33:53.769239 27745 openssl.cpp:435] Will only verify peer certificate if presented!
NOTE: Set LIBPROCESS_SSL_REQUIRE_CERT=1 to require peer certificate verification
I0125 11:33:53.782331 27745 process.cpp:1246] libprocess is initialized on 172.17.0.3:43546
with 16 worker threads
[       OK ] Scheme/HTTPTest.PipeEquality/0 (405 ms)
[ RUN      ] Scheme/HTTPTest.PipeEquality/1
I0125 11:33:53.786749 27745 process.cpp:1246] libprocess is initialized on 172.17.0.3:53731
with 16 worker threads
[       OK ] Scheme/HTTPTest.PipeEquality/1 (5 ms)
[ RUN      ] Scheme/HTTPTest.Post/0
I0125 11:33:54.202644 27745 openssl.cpp:419] CA file path is unspecified! NOTE: Set CA file
path with LIBPROCESS_SSL_CA_FILE=<filepath>
I0125 11:33:54.202752 27745 openssl.cpp:424] CA directory path unspecified! NOTE: Set CA directory
path with LIBPROCESS_SSL_CA_DIR=<dirpath>
I0125 11:33:54.202798 27745 openssl.cpp:429] Will not verify peer certificate!
NOTE: Set LIBPROCESS_SSL_VERIFY_CERT=1 to enable peer certificate verification
I0125 11:33:54.202826 27745 openssl.cpp:435] Will only verify peer certificate if presented!
NOTE: Set LIBPROCESS_SSL_REQUIRE_CERT=1 to require peer certificate verification
I0125 11:33:54.206526 27745 process.cpp:1246] libprocess is initialized on 172.17.0.3:41937
with 16 worker threads
I0125 11:33:54.211927 28940 process.cpp:3697] Handling HTTP event for process '(89)' with
path: '/(89)/post'
I0125 11:33:54.253985 28950 process.cpp:3697] Handling HTTP event for process '(89)' with
path: '/(89)/post'
[       OK ] Scheme/HTTPTest.Post/0 (507 ms)
[ RUN      ] Scheme/HTTPTest.Post/1
I0125 11:33:54.296357 27745 process.cpp:1246] libprocess is initialized on 172.17.0.3:35345
with 16 worker threads
I0125 11:33:54.299259 28956 process.cpp:3697] Handling HTTP event for process '(90)' with
path: '/(90)/post'
I0125 11:33:54.301228 28968 process.cpp:3697] Handling HTTP event for process '(90)' with
path: '/(90)/post'
[       OK ] Scheme/HTTPTest.Post/1 (8 ms)
[ RUN      ] Scheme/HTTPTest.Delete/0
I0125 11:33:54.851492 27745 openssl.cpp:419] CA file path is unspecified! NOTE: Set CA file
path with LIBPROCESS_SSL_CA_FILE=<filepath>
I0125 11:33:54.851506 27745 openssl.cpp:424] CA directory path unspecified! NOTE: Set CA directory
path with LIBPROCESS_SSL_CA_DIR=<dirpath>
I0125 11:33:54.851511 27745 openssl.cpp:429] Will not verify peer certificate!
NOTE: Set LIBPROCESS_SSL_VERIFY_CERT=1 to enable peer certificate verification
I0125 11:33:54.851516 27745 openssl.cpp:435] Will only verify peer certificate if presented!
NOTE: Set LIBPROCESS_SSL_REQUIRE_CERT=1 to require peer certificate verification
I0125 11:33:54.854532 27745 process.cpp:1246] libprocess is initialized on 172.17.0.3:55092
with 16 worker threads
I0125 11:33:54.859565 28981 process.cpp:3697] Handling HTTP event for process '(91)' with
path: '/(91)/delete'
[       OK ] Scheme/HTTPTest.Delete/0 (559 ms)
[ RUN      ] Scheme/HTTPTest.Delete/1
I0125 11:33:54.864631 27745 process.cpp:1246] libprocess is initialized on 172.17.0.3:36746
with 16 worker threads
I0125 11:33:54.867966 29001 process.cpp:3697] Handling HTTP event for process '(92)' with
path: '/(92)/delete'
[       OK ] Scheme/HTTPTest.Delete/1 (8 ms)
[ RUN      ] Scheme/HTTPTest.Request/0
I0125 11:33:55.547857 27745 openssl.cpp:419] CA file path is unspecified! NOTE: Set CA file
path with LIBPROCESS_SSL_CA_FILE=<filepath>
I0125 11:33:55.547881 27745 openssl.cpp:424] CA directory path unspecified! NOTE: Set CA directory
path with LIBPROCESS_SSL_CA_DIR=<dirpath>
I0125 11:33:55.547886 27745 openssl.cpp:429] Will not verify peer certificate!
NOTE: Set LIBPROCESS_SSL_VERIFY_CERT=1 to enable peer certificate verification
I0125 11:33:55.547890 27745 openssl.cpp:435] Will only verify peer certificate if presented!
NOTE: Set LIBPROCESS_SSL_REQUIRE_CERT=1 to require peer certificate verification
I0125 11:33:55.576777 27745 process.cpp:1246] libprocess is initialized on 172.17.0.3:40490
with 16 worker threads
I0125 11:33:55.582849 29007 process.cpp:3697] Handling HTTP event for process '(93)' with
path: '/(93)/request'
[       OK ] Scheme/HTTPTest.Request/0 (715 ms)
[ RUN      ] Scheme/HTTPTest.Request/1
I0125 11:33:55.587991 27745 process.cpp:1246] libprocess is initialized on 172.17.0.3:44166
with 16 worker threads
I0125 11:33:55.588955 29024 process.cpp:3697] Handling HTTP event for process '(94)' with
path: '/(94)/request'
[       OK ] Scheme/HTTPTest.Request/1 (5 ms)
[ RUN      ] Scheme/HTTPTest.QueryEncodeDecode/0
I0125 11:33:56.073240 27745 openssl.cpp:419] CA file path is unspecified! NOTE: Set CA file
path with LIBPROCESS_SSL_CA_FILE=<filepath>
I0125 11:33:56.073253 27745 openssl.cpp:424] CA directory path unspecified! NOTE: Set CA directory
path with LIBPROCESS_SSL_CA_DIR=<dirpath>
I0125 11:33:56.073257 27745 openssl.cpp:429] Will not verify peer certificate!
NOTE: Set LIBPROCESS_SSL_VERIFY_CERT=1 to enable peer certificate verification
I0125 11:33:56.073263 27745 openssl.cpp:435] Will only verify peer certificate if presented!
NOTE: Set LIBPROCESS_SSL_REQUIRE_CERT=1 to require peer certificate verification
I0125 11:33:56.079437 27745 process.cpp:1246] libprocess is initialized on 172.17.0.3:51364
with 16 worker threads
[       OK ] Scheme/HTTPTest.QueryEncodeDecode/0 (490 ms)
[ RUN      ] Scheme/HTTPTest.QueryEncodeDecode/1
I0125 11:33:56.090936 27745 process.cpp:1246] libprocess is initialized on 172.17.0.3:51300
with 16 worker threads
[       OK ] Scheme/HTTPTest.QueryEncodeDecode/1 (11 ms)
[ RUN      ] Scheme/HTTPTest.CaseInsensitiveHeaders/0
I0125 11:33:56.428181 27745 openssl.cpp:419] CA file path is unspecified! NOTE: Set CA file
path with LIBPROCESS_SSL_CA_FILE=<filepath>
I0125 11:33:56.428207 27745 openssl.cpp:424] CA directory path unspecified! NOTE: Set CA directory
path with LIBPROCESS_SSL_CA_DIR=<dirpath>
I0125 11:33:56.428216 27745 openssl.cpp:429] Will not verify peer certificate!
NOTE: Set LIBPROCESS_SSL_VERIFY_CERT=1 to enable peer certificate verification
I0125 11:33:56.428222 27745 openssl.cpp:435] Will only verify peer certificate if presented!
NOTE: Set LIBPROCESS_SSL_REQUIRE_CERT=1 to require peer certificate verification
I0125 11:33:56.436280 27745 process.cpp:1246] libprocess is initialized on 172.17.0.3:59376
with 16 worker threads
[       OK ] Scheme/HTTPTest.CaseInsensitiveHeaders/0 (346 ms)
[ RUN      ] Scheme/HTTPTest.CaseInsensitiveHeaders/1
I0125 11:33:56.456976 27745 process.cpp:1246] libprocess is initialized on 172.17.0.3:53261
with 16 worker threads
[       OK ] Scheme/HTTPTest.CaseInsensitiveHeaders/1 (20 ms)
[ RUN      ] Scheme/HTTPTest.Accepts/0
I0125 11:33:57.495017 27745 openssl.cpp:419] CA file path is unspecified! NOTE: Set CA file
path with LIBPROCESS_SSL_CA_FILE=<filepath>
I0125 11:33:57.495041 27745 openssl.cpp:424] CA directory path unspecified! NOTE: Set CA directory
path with LIBPROCESS_SSL_CA_DIR=<dirpath>
I0125 11:33:57.495046 27745 openssl.cpp:429] Will not verify peer certificate!
NOTE: Set LIBPROCESS_SSL_VERIFY_CERT=1 to enable peer certificate verification
I0125 11:33:57.495050 27745 openssl.cpp:435] Will only verify peer certificate if presented!
NOTE: Set LIBPROCESS_SSL_REQUIRE_CERT=1 to require peer certificate verification
I0125 11:33:57.519773 27745 process.cpp:1246] libprocess is initialized on 172.17.0.3:55165
with 16 worker threads
[       OK ] Scheme/HTTPTest.Accepts/0 (1063 ms)
[ RUN      ] Scheme/HTTPTest.Accepts/1
I0125 11:33:57.523736 27745 process.cpp:1246] libprocess is initialized on 172.17.0.3:44335
with 16 worker threads
[       OK ] Scheme/HTTPTest.Accepts/1 (4 ms)
I0125 11:33:57.543902 27745 process.cpp:1246] libprocess is initialized on 172.17.0.3:33328
with 16 worker threads
[----------] 38 tests from Scheme/HTTPTest (9428 ms total)

[----------] 4 tests from Encryption/NetSocketTest
[ RUN      ] Encryption/NetSocketTest.EOFBeforeRecv/0
I0125 11:33:57.670665 27745 openssl.cpp:419] CA file path is unspecified! NOTE: Set CA file
path with LIBPROCESS_SSL_CA_FILE=<filepath>
I0125 11:33:57.670691 27745 openssl.cpp:424] CA directory path unspecified! NOTE: Set CA directory
path with LIBPROCESS_SSL_CA_DIR=<dirpath>
I0125 11:33:57.670696 27745 openssl.cpp:429] Will not verify peer certificate!
NOTE: Set LIBPROCESS_SSL_VERIFY_CERT=1 to enable peer certificate verification
I0125 11:33:57.670701 27745 openssl.cpp:435] Will only verify peer certificate if presented!
NOTE: Set LIBPROCESS_SSL_REQUIRE_CERT=1 to require peer certificate verification
I0125 11:33:57.678488 27745 process.cpp:1246] libprocess is initialized on 172.17.0.3:39277
with 16 worker threads
[       OK ] Encryption/NetSocketTest.EOFBeforeRecv/0 (177 ms)
[ RUN      ] Encryption/NetSocketTest.EOFBeforeRecv/1
I0125 11:33:57.725778 27745 process.cpp:1246] libprocess is initialized on 172.17.0.3:40574
with 16 worker threads
[       OK ] Encryption/NetSocketTest.EOFBeforeRecv/1 (6 ms)
[ RUN      ] Encryption/NetSocketTest.EOFAfterRecv/0
I0125 11:33:58.031960 27745 openssl.cpp:419] CA file path is unspecified! NOTE: Set CA file
path with LIBPROCESS_SSL_CA_FILE=<filepath>
I0125 11:33:58.031975 27745 openssl.cpp:424] CA directory path unspecified! NOTE: Set CA directory
path with LIBPROCESS_SSL_CA_DIR=<dirpath>
I0125 11:33:58.031980 27745 openssl.cpp:429] Will not verify peer certificate!
NOTE: Set LIBPROCESS_SSL_VERIFY_CERT=1 to enable peer certificate verification
I0125 11:33:58.031986 27745 openssl.cpp:435] Will only verify peer certificate if presented!
NOTE: Set LIBPROCESS_SSL_REQUIRE_CERT=1 to require peer certificate verification
I0125 11:33:58.038352 27745 process.cpp:1246] libprocess is initialized on 172.17.0.3:56310
with 16 worker threads
[       OK ] Encryption/NetSocketTest.EOFAfterRecv/0 (354 ms)
[ RUN      ] Encryption/NetSocketTest.EOFAfterRecv/1
I0125 11:33:58.083926 27745 process.cpp:1246] libprocess is initialized on 172.17.0.3:47627
with 16 worker threads
[       OK ] Encryption/NetSocketTest.EOFAfterRecv/1 (4 ms)
I0125 11:33:58.088922 27745 process.cpp:1246] libprocess is initialized on 172.17.0.3:33546
with 16 worker threads
[----------] 4 tests from Encryption/NetSocketTest (541 ms total)

[----------] 6 tests from SSLVerifyIPAdd/SSLTest
[ RUN      ] SSLVerifyIPAdd/SSLTest.BasicSameProcess/0
I0125 11:33:58.405244 27745 openssl.cpp:429] Will not verify peer certificate!
NOTE: Set LIBPROCESS_SSL_VERIFY_CERT=1 to enable peer certificate verification
I0125 11:33:58.405259 27745 openssl.cpp:449] LIBPROCESS_SSL_REQUIRE_CERT implies peer certificate
verification.
LIBPROCESS_SSL_VERIFY_CERT set to true
I0125 11:33:58.405359 27745 openssl.cpp:478] Using CA file: /tmp/PnKLxR/cert.pem
I0125 11:33:58.405370 27745 openssl.cpp:481] Using CA dir: /tmp/PnKLxR
[       OK ] SSLVerifyIPAdd/SSLTest.BasicSameProcess/0 (328 ms)
[ RUN      ] SSLVerifyIPAdd/SSLTest.BasicSameProcess/1
I0125 11:33:58.673794 27745 openssl.cpp:429] Will not verify peer certificate!
NOTE: Set LIBPROCESS_SSL_VERIFY_CERT=1 to enable peer certificate verification
I0125 11:33:58.673809 27745 openssl.cpp:441] Will use IP address verification in subject alternative
name certificate extension.
I0125 11:33:58.673812 27745 openssl.cpp:449] LIBPROCESS_SSL_REQUIRE_CERT implies peer certificate
verification.
LIBPROCESS_SSL_VERIFY_CERT set to true
I0125 11:33:58.673907 27745 openssl.cpp:478] Using CA file: /tmp/wvpXUl/cert.pem
I0125 11:33:58.673919 27745 openssl.cpp:481] Using CA dir: /tmp/wvpXUl
[       OK ] SSLVerifyIPAdd/SSLTest.BasicSameProcess/1 (267 ms)
[ RUN      ] SSLVerifyIPAdd/SSLTest.BasicSameProcessUnix/0
I0125 11:33:58.998693 27745 openssl.cpp:429] Will not verify peer certificate!
NOTE: Set LIBPROCESS_SSL_VERIFY_CERT=1 to enable peer certificate verification
I0125 11:33:58.998724 27745 openssl.cpp:435] Will only verify peer certificate if presented!
NOTE: Set LIBPROCESS_SSL_REQUIRE_CERT=1 to require peer certificate verification
[       OK ] SSLVerifyIPAdd/SSLTest.BasicSameProcessUnix/0 (326 ms)
[ RUN      ] SSLVerifyIPAdd/SSLTest.BasicSameProcessUnix/1
I0125 11:33:59.352707 27745 openssl.cpp:429] Will not verify peer certificate!
NOTE: Set LIBPROCESS_SSL_VERIFY_CERT=1 to enable peer certificate verification
I0125 11:33:59.352743 27745 openssl.cpp:435] Will only verify peer certificate if presented!
NOTE: Set LIBPROCESS_SSL_REQUIRE_CERT=1 to require peer certificate verification
I0125 11:33:59.352752 27745 openssl.cpp:441] Will use IP address verification in subject alternative
name certificate extension.
[       OK ] SSLVerifyIPAdd/SSLTest.BasicSameProcessUnix/1 (352 ms)
[ RUN      ] SSLVerifyIPAdd/SSLTest.RequireCertificate/0
I0125 11:33:59.642066 27745 openssl.cpp:424] CA directory path unspecified! NOTE: Set CA directory
path with LIBPROCESS_SSL_CA_DIR=<dirpath>
I0125 11:33:59.642094 27745 openssl.cpp:429] Will not verify peer certificate!
NOTE: Set LIBPROCESS_SSL_VERIFY_CERT=1 to enable peer certificate verification
I0125 11:33:59.642101 27745 openssl.cpp:449] LIBPROCESS_SSL_REQUIRE_CERT implies peer certificate
verification.
LIBPROCESS_SSL_VERIFY_CERT set to true
I0125 11:33:59.642232 27745 openssl.cpp:478] Using CA file: /tmp/tDNGLT/cert.pem
WARNING: Logging before InitGoogleLogging() is written to STDERR
I0125 11:33:59.653707 29243 openssl.cpp:424] CA directory path unspecified! NOTE: Set CA directory
path with LIBPROCESS_SSL_CA_DIR=<dirpath>
I0125 11:33:59.653849 29243 openssl.cpp:429] Will not verify peer certificate!
NOTE: Set LIBPROCESS_SSL_VERIFY_CERT=1 to enable peer certificate verification
I0125 11:33:59.653856 29243 openssl.cpp:449] LIBPROCESS_SSL_REQUIRE_CERT implies peer certificate
verification.
LIBPROCESS_SSL_VERIFY_CERT set to true
I0125 11:33:59.654014 29243 openssl.cpp:478] Using CA file: /tmp/tDNGLT/cert.pem
[       OK ] SSLVerifyIPAdd/SSLTest.RequireCertificate/0 (335 ms)
[ RUN      ] SSLVerifyIPAdd/SSLTest.RequireCertificate/1
I0125 11:33:59.810871 27745 openssl.cpp:424] CA directory path unspecified! NOTE: Set CA directory
path with LIBPROCESS_SSL_CA_DIR=<dirpath>
I0125 11:33:59.810896 27745 openssl.cpp:429] Will not verify peer certificate!
NOTE: Set LIBPROCESS_SSL_VERIFY_CERT=1 to enable peer certificate verification
I0125 11:33:59.810904 27745 openssl.cpp:441] Will use IP address verification in subject alternative
name certificate extension.
I0125 11:33:59.810909 27745 openssl.cpp:449] LIBPROCESS_SSL_REQUIRE_CERT implies peer certificate
verification.
LIBPROCESS_SSL_VERIFY_CERT set to true
I0125 11:33:59.811040 27745 openssl.cpp:478] Using CA file: /tmp/1EtJur/cert.pem
WARNING: Logging before InitGoogleLogging() is written to STDERR
I0125 11:33:59.824548 29261 openssl.cpp:424] CA directory path unspecified! NOTE: Set CA directory
path with LIBPROCESS_SSL_CA_DIR=<dirpath>
I0125 11:33:59.824690 29261 openssl.cpp:429] Will not verify peer certificate!
NOTE: Set LIBPROCESS_SSL_VERIFY_CERT=1 to enable peer certificate verification
I0125 11:33:59.824697 29261 openssl.cpp:441] Will use IP address verification in subject alternative
name certificate extension.
I0125 11:33:59.824715 29261 openssl.cpp:449] LIBPROCESS_SSL_REQUIRE_CERT implies peer certificate
verification.
LIBPROCESS_SSL_VERIFY_CERT set to true
I0125 11:33:59.824867 29261 openssl.cpp:478] Using CA file: /tmp/1EtJur/cert.pem
[       OK ] SSLVerifyIPAdd/SSLTest.RequireCertificate/1 (201 ms)
[----------] 6 tests from SSLVerifyIPAdd/SSLTest (1810 ms total)

[----------] Global test environment tear-down
[==========] 228 tests from 35 test cases ran. (24937 ms total)
[  PASSED  ] 227 tests.
[  FAILED  ] 1 test, listed below:
[  FAILED  ] FutureTest.After3

 1 FAILED TEST
  YOU HAVE 2 DISABLED TESTS

make[7]: *** [check-local] Error 1
make[7]: Leaving directory `/mesos/mesos-1.2.0/_build/3rdparty/libprocess'
make[6]: *** [check-am] Error 2
make[6]: Leaving directory `/mesos/mesos-1.2.0/_build/3rdparty/libprocess'
make[5]: *** [check-recursive] Error 1
make[5]: Leaving directory `/mesos/mesos-1.2.0/_build/3rdparty/libprocess'
make[4]: *** [check] Error 2
make[4]: Leaving directory `/mesos/mesos-1.2.0/_build/3rdparty/libprocess'
make[3]: *** [check-recursive] Error 1
make[3]: Leaving directory `/mesos/mesos-1.2.0/_build/3rdparty'
make[2]: *** [check] Error 2
make[2]: Leaving directory `/mesos/mesos-1.2.0/_build/3rdparty'
make[1]: *** [check-recursive] Error 1
make[1]: Leaving directory `/mesos/mesos-1.2.0/_build'
make: *** [distcheck] Error 1
+ docker rmi mesos-1485342931-26757
Untagged: mesos-1485342931-26757:latest
Deleted: sha256:feec98783c59350c01e6e3298f7e061d783843a67e330aeb35f94f7895970a4e
Deleted: sha256:64b98b137859a6dc91230b206864bcd9233c865c8af1b2d02ebf81f58731fe8e
Deleted: sha256:4ee33854dd73526c538aa7671f7d6ed5fdec40f7950c0d2cfa2854b087e6f22d
Deleted: sha256:bb751488a89f3d3a321ecc48c39beb917f403ec79751138ac307ca5a0656ad54
Deleted: sha256:5cb9aea3ea1764234d9a27fbac844556f91de43d42c7ef781a966609937ad374
Deleted: sha256:7482e3cd75db3ce0819830af6f8839e4f671d8a76cf6233cbd3f63a9435f9c4b
Deleted: sha256:62058a6700f58c450c92d9dc136d0c8bb14a32e82a2b7bd6e958640cb82f4b07
Deleted: sha256:78a6ca85c179b87a189cbe3b3ac257bc515ced7ec82d565348d7622fdc8fc781
Deleted: sha256:d32bd474be8113f82934d2eebadc836bdbf9fffbe3b3123eb741b0a5fdc26a1f
Deleted: sha256:41f681a2c052a39c3f55db69f4599f3bc1fe1fe887850c243064741f43e7ebfd
Deleted: sha256:dd6ac28348e7f514da24651bebbeb141d7bab1d7eb5a11d6963ec2c7ec87e17e
Deleted: sha256:60e5ec880e55d35789bc5982b7618788d9ad72c88a035b7bce6d931650a0facc
Deleted: sha256:6eccaabf2e18cadd233dec04c72f120402f8f76ca7e6f599ebc52ae831cf285a
Deleted: sha256:bdb11594fc413d4c43c8ab7080d9125a4ce487da7dc092dc8b0fa60541899e76
Deleted: sha256:adac23399f2d414b3d29865d75b49e9c9fe753b351e5ac165f18c7b1fc7723f2
Deleted: sha256:cfae7ead025592531383c2f847f44db0022043b8f73c32c9c8996ba0dfa0cb73
Deleted: sha256:096249e5ec74eb66fa5dd7f7e7f77a5c18771af14dd50691acaf3f33138a6c5e
Deleted: sha256:5d171b9a464640e7e562e3c7a0b743828cc5de1943a1870b2903a2f2c4842223
Deleted: sha256:b30169ed85e143ef6b8e445d5ccafbe46df12938f9384988a07140d9a85785d6
Deleted: sha256:432968791ac52d53cc838e3c51b2b2598feace54eb4e0b74ee705b7a7c086fb8
Deleted: sha256:99ad405a6addbde0fce4395b330024cf3cf7bc4566bf208babda39b9645b6b36
Deleted: sha256:924f7882662a2ba7b0e03c15871e66312d3514e418bff584bf317e06e4135cda
Deleted: sha256:a6d7dd7fe22cfdd7e9b9d6822a9e18470d8bf6b5ec9762efeed465d511c3e336
Deleted: sha256:3db8b89b9adcb51e5c86796a3c91c90c228f2196e4ea40ceb6ac7dcfd47423ec
Deleted: sha256:463be6e12289eedd4c857addc9dffe6fc017f25efb9e95b5f57a09161ad9a05d
Build step 'Execute shell' marked build as failure

Mime
View raw message