mesos-builds mailing list archives

Site index · List index
Message view « Date » · « Thread »
Top « Date » · « Thread »
From Alex R <al...@apache.org>
Subject Re: Build failed in Jenkins: Mesos » cmake,gcc,--verbose --enable-libevent --enable-ssl,GLOG_v=1 MESOS_VERBOSE=1,ubuntu:14.04,(docker||Hadoop)&&(!ubuntu-us1)&&(!ubuntu-6)&&(!ubuntu-eu2) #3028
Date Sat, 10 Dec 2016 22:38:06 GMT
Looks like VM lag again:

I1210 02:45:35.529021 27019 master.cpp:4240] Launching task 0 of framework
91613826-0d06-4dcc-b16d-69116b6dea38-0000 (default) at
scheduler-046342d4-2bf9-4599-8700-a1ef66772305@172.17.0.3:33881 with
resources cpus(*):1; mem(*):64 on agent
91613826-0d06-4dcc-b16d-69116b6dea38-S0 at slave(213)@172.17.0.3:33881
(3e2990cdec81)
I1210 02:45:36.518956 27024 hierarchical.cpp:1689] No allocations performed
I1210 02:45:50.527333 27013 slave.cpp:5589] Querying resource estimator for
oversubscribable resources
I1210 02:45:50.568394 27024 hierarchical.cpp:1784] No inverse offers to
send out!

On 10 December 2016 at 03:48, Apache Jenkins Server <
jenkins@builds.apache.org> wrote:

> See <https://builds.apache.org/job/Mesos/BUILDTOOL=cmake,
> COMPILER=gcc,CONFIGURATION=--verbose%20--enable-libevent%
> 20--enable-ssl,ENVIRONMENT=GLOG_v=1%20MESOS_VERBOSE=1,OS=
> ubuntu%3A14.04,label_exp=(docker%7C%7CHadoop)&&(!ubuntu-
> us1)&&(!ubuntu-6)&&(!ubuntu-eu2)/3028/changes>
>
> Changes:
>
> [bmahler] Updated `Role::resources()` in master to handle multi-role
> frameworks.
>
> [bmahler] Updated master and agent endpoints to expose
> FrameworkInfo::roles.
>
> ------------------------------------------
> [...truncated 173338 lines...]
> I1210 02:47:32.184470 27014 http.cpp:922] Using default 'basic' HTTP
> authenticator for realm 'mesos-agent-readwrite'
> I1210 02:47:32.184978 27014 slave.cpp:534] Agent resources: cpus(*):2;
> mem(*):1024; disk(*):1024; ports(*):[31000-32000]
> I1210 02:47:32.185019 27014 slave.cpp:542] Agent attributes: [  ]
> I1210 02:47:32.185029 27014 slave.cpp:547] Agent hostname: 3e2990cdec81
> I1210 02:47:32.185536 27019 state.cpp:57] Recovering state from
> '/tmp/Endpoint_SlaveEndpointTest_AuthorizedRequest_2_K7c3Da/meta'
> I1210 02:47:32.185727 27019 status_update_manager.cpp:203] Recovering
> status update manager
> I1210 02:47:32.185865 27011 containerizer.cpp:594] Recovering containerizer
> I1210 02:47:32.186712 27010 provisioner.cpp:253] Provisioner recovery
> complete
> I1210 02:47:32.186964 27023 slave.cpp:5415] Finished recovery
> I1210 02:47:32.187517 27023 slave.cpp:5589] Querying resource estimator
> for oversubscribable resources
> I1210 02:47:32.187690 27012 slave.cpp:5603] Received oversubscribable
> resources {} from the resource estimator
> I1210 02:47:32.188307 27010 process.cpp:3679] Handling HTTP event for
> process 'slave(660)' with path: '/slave(660)/containers'
> I1210 02:47:32.188813 27018 http.cpp:874] Authorizing principal
> 'test-principal' to GET the '/containers' endpoint
> I1210 02:47:32.190214 27010 slave.cpp:791] Agent terminating
> I1210 02:47:32.196149 27008 containerizer.cpp:220] Using isolation:
> posix/cpu,posix/mem,filesystem/posix,network/cni
> W1210 02:47:32.196516 27008 backend.cpp:76] Failed to create 'aufs'
> backend: AufsBackend requires root privileges, but is running as user mesos
> W1210 02:47:32.196602 27008 backend.cpp:76] Failed to create 'bind'
> backend: BindBackend requires root privileges
> I1210 02:47:32.198174 27021 slave.cpp:209] Mesos agent started on (661)@
> 172.17.0.3:33881
> I1210 02:47:32.198194 27021 slave.cpp:210] Flags at startup: --acls=""
> --appc_simple_discovery_uri_prefix="http://" --appc_store_dir="/tmp/mesos/store/appc"
> --authenticate_http_readonly="true" --authenticate_http_readwrite="true"
> --authenticatee="crammd5" --authentication_backoff_factor="1secs"
> --authorizer="local" --cgroups_cpu_enable_pids_and_tids_count="false"
> --cgroups_enable_cfs="false" --cgroups_hierarchy="/sys/fs/cgroup"
> --cgroups_limit_swap="false" --cgroups_root="mesos" --container_disk_watch_interval="15secs"
> --containerizers="mesos" --credential="/tmp/Endpoint_SlaveEndpointTest_
> UnauthorizedRequest_0_kaaJKh/credential" --default_role="*"
> --disk_watch_interval="1mins" --docker="docker"
> --docker_kill_orphans="true" --docker_registry="https://
> registry-1.docker.io" --docker_remove_delay="6hrs"
> --docker_socket="/var/run/docker.sock" --docker_stop_timeout="0ns"
> --docker_store_dir="/tmp/mesos/store/docker" --docker_volume_checkpoint_
> dir="/var/run/mesos/isolators/docker/volume" --enforce_container_disk_quota="false"
> --executor_registration_timeout="1mins" --executor_shutdown_grace_period="5secs"
> --fetcher_cache_dir="/tmp/Endpoint_SlaveEndpointTest_
> UnauthorizedRequest_0_kaaJKh/fetch" --fetcher_cache_size="2GB"
> --frameworks_home="" --gc_delay="1weeks" --gc_disk_headroom="0.1"
> --hadoop_home="" --help="false" --hostname_lookup="true"
> --http_authenticators="basic" --http_command_executor="false"
> --http_credentials="/tmp/Endpoint_SlaveEndpointTest_
> UnauthorizedRequest_0_kaaJKh/http_credentials"
> --image_provisioner_backend="copy" --initialize_driver_logging="true"
> --io_switchboard_enable_server="true" --isolation="posix/cpu,posix/mem"
> --launcher="posix" --launcher_dir="/mesos/build/src" --logbufsecs="0"
> --logging_level="INFO" --max_completed_executors_per_framework="150"
> --oversubscribed_resources_interval="15secs" --perf_duration="10secs"
> --perf_interval="1mins" --qos_correction_interval_min="0ns"
> --quiet="false" --recover="reconnect" --recovery_timeout="15mins"
> --registration_backoff_factor="10ms" --resources="cpus:2;gpus:0;
> mem:1024;disk:1024;ports:[31000-32000]" --revocable_cpu_low_priority="true"
> --runtime_dir="/tmp/Endpoint_SlaveEndpointTest_UnauthorizedRequest_0_kaaJKh"
> --sandbox_directory="/mnt/mesos/sandbox" --strict="true"
> --switch_user="true" --systemd_enable_support="true"
> --systemd_runtime_directory="/run/systemd/system" --version="false"
> --work_dir="/tmp/Endpoint_SlaveEndpointTest_UnauthorizedRequest_0_C8HQjg"
> I1210 02:47:32.198607 27021 credentials.hpp:86] Loading credential for
> authentication from '/tmp/Endpoint_SlaveEndpointTest_
> UnauthorizedRequest_0_kaaJKh/credential'
> I1210 02:47:32.198691 27021 slave.cpp:347] Agent using credential for:
> test-principal
> I1210 02:47:32.198709 27021 credentials.hpp:37] Loading credentials for
> authentication from '/tmp/Endpoint_SlaveEndpointTest_
> UnauthorizedRequest_0_kaaJKh/http_credentials'
> I1210 02:47:32.198868 27021 http.cpp:922] Using default 'basic' HTTP
> authenticator for realm 'mesos-agent-readonly'
> I1210 02:47:32.198916 27021 http.cpp:922] Using default 'basic' HTTP
> authenticator for realm 'mesos-agent-readwrite'
> I1210 02:47:32.199295 27021 slave.cpp:534] Agent resources: cpus(*):2;
> mem(*):1024; disk(*):1024; ports(*):[31000-32000]
> I1210 02:47:32.199337 27021 slave.cpp:542] Agent attributes: [  ]
> I1210 02:47:32.199344 27021 slave.cpp:547] Agent hostname: 3e2990cdec81
> I1210 02:47:32.199776 27021 state.cpp:57] Recovering state from
> '/tmp/Endpoint_SlaveEndpointTest_UnauthorizedRequest_0_C8HQjg/meta'
> I1210 02:47:32.200011 27014 status_update_manager.cpp:203] Recovering
> status update manager
> I1210 02:47:32.200095 27014 containerizer.cpp:594] Recovering containerizer
> I1210 02:47:32.200786 27016 provisioner.cpp:253] Provisioner recovery
> complete
> I1210 02:47:32.201174 27016 slave.cpp:5415] Finished recovery
> I1210 02:47:32.201597 27016 slave.cpp:5589] Querying resource estimator
> for oversubscribable resources
> I1210 02:47:32.201784 27018 slave.cpp:5603] Received oversubscribable
> resources {} from the resource estimator
> I1210 02:47:32.202512 27013 process.cpp:3679] Handling HTTP event for
> process 'slave(661)' with path: '/slave(661)/monitor/statistics'
> I1210 02:47:32.202949 27012 http.cpp:874] Authorizing principal
> 'test-principal' to GET the '/monitor/statistics' endpoint
> I1210 02:47:32.204299 27016 slave.cpp:791] Agent terminating
> I1210 02:47:32.209962 27008 containerizer.cpp:220] Using isolation:
> posix/cpu,posix/mem,filesystem/posix,network/cni
> W1210 02:47:32.210327 27008 backend.cpp:76] Failed to create 'aufs'
> backend: AufsBackend requires root privileges, but is running as user mesos
> W1210 02:47:32.210495 27008 backend.cpp:76] Failed to create 'bind'
> backend: BindBackend requires root privileges
> I1210 02:47:32.211882 27021 slave.cpp:209] Mesos agent started on (662)@
> 172.17.0.3:33881
> I1210 02:47:32.211905 27021 slave.cpp:210] Flags at startup: --acls=""
> --appc_simple_discovery_uri_prefix="http://" --appc_store_dir="/tmp/mesos/store/appc"
> --authenticate_http_readonly="true" --authenticate_http_readwrite="true"
> --authenticatee="crammd5" --authentication_backoff_factor="1secs"
> --authorizer="local" --cgroups_cpu_enable_pids_and_tids_count="false"
> --cgroups_enable_cfs="false" --cgroups_hierarchy="/sys/fs/cgroup"
> --cgroups_limit_swap="false" --cgroups_root="mesos" --container_disk_watch_interval="15secs"
> --containerizers="mesos" --credential="/tmp/Endpoint_SlaveEndpointTest_
> UnauthorizedRequest_1_M6uRBn/credential" --default_role="*"
> --disk_watch_interval="1mins" --docker="docker"
> --docker_kill_orphans="true" --docker_registry="https://
> registry-1.docker.io" --docker_remove_delay="6hrs"
> --docker_socket="/var/run/docker.sock" --docker_stop_timeout="0ns"
> --docker_store_dir="/tmp/mesos/store/docker" --docker_volume_checkpoint_
> dir="/var/run/mesos/isolators/docker/volume" --enforce_container_disk_quota="false"
> --executor_registration_timeout="1mins" --executor_shutdown_grace_period="5secs"
> --fetcher_cache_dir="/tmp/Endpoint_SlaveEndpointTest_
> UnauthorizedRequest_1_M6uRBn/fetch" --fetcher_cache_size="2GB"
> --frameworks_home="" --gc_delay="1weeks" --gc_disk_headroom="0.1"
> --hadoop_home="" --help="false" --hostname_lookup="true"
> --http_authenticators="basic" --http_command_executor="false"
> --http_credentials="/tmp/Endpoint_SlaveEndpointTest_
> UnauthorizedRequest_1_M6uRBn/http_credentials"
> --image_provisioner_backend="copy" --initialize_driver_logging="true"
> --io_switchboard_enable_server="true" --isolation="posix/cpu,posix/mem"
> --launcher="posix" --launcher_dir="/mesos/build/src" --logbufsecs="0"
> --logging_level="INFO" --max_completed_executors_per_framework="150"
> --oversubscribed_resources_interval="15secs" --perf_duration="10secs"
> --perf_interval="1mins" --qos_correction_interval_min="0ns"
> --quiet="false" --recover="reconnect" --recovery_timeout="15mins"
> --registration_backoff_factor="10ms" --resources="cpus:2;gpus:0;
> mem:1024;disk:1024;ports:[31000-32000]" --revocable_cpu_low_priority="true"
> --runtime_dir="/tmp/Endpoint_SlaveEndpointTest_UnauthorizedRequest_1_M6uRBn"
> --sandbox_directory="/mnt/mesos/sandbox" --strict="true"
> --switch_user="true" --systemd_enable_support="true"
> --systemd_runtime_directory="/run/systemd/system" --version="false"
> --work_dir="/tmp/Endpoint_SlaveEndpointTest_UnauthorizedRequest_1_AVaK8l"
> I1210 02:47:32.212267 27021 credentials.hpp:86] Loading credential for
> authentication from '/tmp/Endpoint_SlaveEndpointTest_
> UnauthorizedRequest_1_M6uRBn/credential'
> I1210 02:47:32.212355 27021 slave.cpp:347] Agent using credential for:
> test-principal
> I1210 02:47:32.212370 27021 credentials.hpp:37] Loading credentials for
> authentication from '/tmp/Endpoint_SlaveEndpointTest_
> UnauthorizedRequest_1_M6uRBn/http_credentials'
> I1210 02:47:32.212481 27021 http.cpp:922] Using default 'basic' HTTP
> authenticator for realm 'mesos-agent-readonly'
> I1210 02:47:32.212528 27021 http.cpp:922] Using default 'basic' HTTP
> authenticator for realm 'mesos-agent-readwrite'
> I1210 02:47:32.212888 27021 slave.cpp:534] Agent resources: cpus(*):2;
> mem(*):1024; disk(*):1024; ports(*):[31000-32000]
> I1210 02:47:32.212929 27021 slave.cpp:542] Agent attributes: [  ]
> I1210 02:47:32.212936 27021 slave.cpp:547] Agent hostname: 3e2990cdec81
> I1210 02:47:32.213392 27012 state.cpp:57] Recovering state from
> '/tmp/Endpoint_SlaveEndpointTest_UnauthorizedRequest_1_AVaK8l/meta'
> I1210 02:47:32.213713 27009 status_update_manager.cpp:203] Recovering
> status update manager
> I1210 02:47:32.213871 27022 containerizer.cpp:594] Recovering containerizer
> I1210 02:47:32.214587 27011 provisioner.cpp:253] Provisioner recovery
> complete
> I1210 02:47:32.214872 27011 slave.cpp:5415] Finished recovery
> I1210 02:47:32.215291 27011 slave.cpp:5589] Querying resource estimator
> for oversubscribable resources
> I1210 02:47:32.215442 27011 slave.cpp:5603] Received oversubscribable
> resources {} from the resource estimator
> I1210 02:47:32.216233 27018 process.cpp:3679] Handling HTTP event for
> process 'slave(662)' with path: '/slave(662)/monitor/statistics.json'
> I1210 02:47:32.216759 27013 http.cpp:874] Authorizing principal
> 'test-principal' to GET the '/monitor/statistics.json' endpoint
> I1210 02:47:32.219017 27013 slave.cpp:791] Agent terminating
> I1210 02:47:32.225198 27008 containerizer.cpp:220] Using isolation:
> posix/cpu,posix/mem,filesystem/posix,network/cni
> W1210 02:47:32.225566 27008 backend.cpp:76] Failed to create 'aufs'
> backend: AufsBackend requires root privileges, but is running as user mesos
> W1210 02:47:32.225652 27008 backend.cpp:76] Failed to create 'bind'
> backend: BindBackend requires root privileges
> I1210 02:47:32.226999 27020 slave.cpp:209] Mesos agent started on (663)@
> 172.17.0.3:33881
> I1210 02:47:32.227018 27020 slave.cpp:210] Flags at startup: --acls=""
> --appc_simple_discovery_uri_prefix="http://" --appc_store_dir="/tmp/mesos/store/appc"
> --authenticate_http_readonly="true" --authenticate_http_readwrite="true"
> --authenticatee="crammd5" --authentication_backoff_factor="1secs"
> --authorizer="local" --cgroups_cpu_enable_pids_and_tids_count="false"
> --cgroups_enable_cfs="false" --cgroups_hierarchy="/sys/fs/cgroup"
> --cgroups_limit_swap="false" --cgroups_root="mesos" --container_disk_watch_interval="15secs"
> --containerizers="mesos" --credential="/tmp/Endpoint_SlaveEndpointTest_
> UnauthorizedRequest_2_a7iDCt/credential" --default_role="*"
> --disk_watch_interval="1mins" --docker="docker"
> --docker_kill_orphans="true" --docker_registry="https://
> registry-1.docker.io" --docker_remove_delay="6hrs"
> --docker_socket="/var/run/docker.sock" --docker_stop_timeout="0ns"
> --docker_store_dir="/tmp/mesos/store/docker" --docker_volume_checkpoint_
> dir="/var/run/mesos/isolators/docker/volume" --enforce_container_disk_quota="false"
> --executor_registration_timeout="1mins" --executor_shutdown_grace_period="5secs"
> --fetcher_cache_dir="/tmp/Endpoint_SlaveEndpointTest_
> UnauthorizedRequest_2_a7iDCt/fetch" --fetcher_cache_size="2GB"
> --frameworks_home="" --gc_delay="1weeks" --gc_disk_headroom="0.1"
> --hadoop_home="" --help="false" --hostname_lookup="true"
> --http_authenticators="basic" --http_command_executor="false"
> --http_credentials="/tmp/Endpoint_SlaveEndpointTest_
> UnauthorizedRequest_2_a7iDCt/http_credentials"
> --image_provisioner_backend="copy" --initialize_driver_logging="true"
> --io_switchboard_enable_server="true" --isolation="posix/cpu,posix/mem"
> --launcher="posix" --launcher_dir="/mesos/build/src" --logbufsecs="0"
> --logging_level="INFO" --max_completed_executors_per_framework="150"
> --oversubscribed_resources_interval="15secs" --perf_duration="10secs"
> --perf_interval="1mins" --qos_correction_interval_min="0ns"
> --quiet="false" --recover="reconnect" --recovery_timeout="15mins"
> --registration_backoff_factor="10ms" --resources="cpus:2;gpus:0;
> mem:1024;disk:1024;ports:[31000-32000]" --revocable_cpu_low_priority="true"
> --runtime_dir="/tmp/Endpoint_SlaveEndpointTest_UnauthorizedRequest_2_a7iDCt"
> --sandbox_directory="/mnt/mesos/sandbox" --strict="true"
> --switch_user="true" --systemd_enable_support="true"
> --systemd_runtime_directory="/run/systemd/system" --version="false"
> --work_dir="/tmp/Endpoint_SlaveEndpointTest_UnauthorizedRequest_2_YqB26r"
> I1210 02:47:32.227412 27020 credentials.hpp:86] Loading credential for
> authentication from '/tmp/Endpoint_SlaveEndpointTest_
> UnauthorizedRequest_2_a7iDCt/credential'
> I1210 02:47:32.227511 27020 slave.cpp:347] Agent using credential for:
> test-principal
> I1210 02:47:32.227527 27020 credentials.hpp:37] Loading credentials for
> authentication from '/tmp/Endpoint_SlaveEndpointTest_
> UnauthorizedRequest_2_a7iDCt/http_credentials'
> I1210 02:47:32.227640 27020 http.cpp:922] Using default 'basic' HTTP
> authenticator for realm 'mesos-agent-readonly'
> I1210 02:47:32.227689 27020 http.cpp:922] Using default 'basic' HTTP
> authenticator for realm 'mesos-agent-readwrite'
> I1210 02:47:32.228044 27020 slave.cpp:534] Agent resources: cpus(*):2;
> mem(*):1024; disk(*):1024; ports(*):[31000-32000]
> I1210 02:47:32.228085 27020 slave.cpp:542] Agent attributes: [  ]
> I1210 02:47:32.228093 27020 slave.cpp:547] Agent hostname: 3e2990cdec81
> I1210 02:47:32.228613 27020 state.cpp:57] Recovering state from
> '/tmp/Endpoint_SlaveEndpointTest_UnauthorizedRequest_2_YqB26r/meta'
> I1210 02:47:32.228935 27017 status_update_manager.cpp:203] Recovering
> status update manager
> I1210 02:47:32.229183 27012 containerizer.cpp:594] Recovering containerizer
> I1210 02:47:32.229871 27015 provisioner.cpp:253] Provisioner recovery
> complete
> I1210 02:47:32.230417 27024 slave.cpp:5415] Finished recovery
> I1210 02:47:32.230830 27024 slave.cpp:5589] Querying resource estimator
> for oversubscribable resources
> I1210 02:47:32.231544 27022 slave.cpp:5603] Received oversubscribable
> resources {} from the resource estimator
> I1210 02:47:32.232230 27017 process.cpp:3679] Handling HTTP event for
> process 'slave(663)' with path: '/slave(663)/containers'
> I1210 02:47:32.232791 27021 http.cpp:874] Authorizing principal
> 'test-principal' to GET the '/containers' endpoint
> I1210 02:47:32.234035 27020 slave.cpp:791] Agent terminating
> I1210 02:47:32.240038 27008 containerizer.cpp:220] Using isolation:
> posix/cpu,posix/mem,filesystem/posix,network/cni
> W1210 02:47:32.240406 27008 backend.cpp:76] Failed to create 'aufs'
> backend: AufsBackend requires root privileges, but is running as user mesos
> W1210 02:47:32.240532 27008 backend.cpp:76] Failed to create 'bind'
> backend: BindBackend requires root privileges
> I1210 02:47:32.241323 27008 cluster.cpp:446] Creating default 'local'
> authorizer
> I1210 02:47:32.242254 27009 slave.cpp:209] Mesos agent started on (664)@
> 172.17.0.3:33881
> I1210 02:47:32.242277 27009 slave.cpp:210] Flags at startup: --acls=""
> --appc_simple_discovery_uri_prefix="http://" --appc_store_dir="/tmp/mesos/store/appc"
> --authenticate_http_readonly="true" --authenticate_http_readwrite="true"
> --authenticatee="crammd5" --authentication_backoff_factor="1secs"
> --authorizer="local" --cgroups_cpu_enable_pids_and_tids_count="false"
> --cgroups_enable_cfs="false" --cgroups_hierarchy="/sys/fs/cgroup"
> --cgroups_limit_swap="false" --cgroups_root="mesos" --container_disk_watch_interval="15secs"
> --containerizers="mesos" --credential="/tmp/Endpoint_SlaveEndpointTest_
> NoAuthorizer_0_QeS7Mz/credential" --default_role="*"
> --disk_watch_interval="1mins" --docker="docker"
> --docker_kill_orphans="true" --docker_registry="https://
> registry-1.docker.io" --docker_remove_delay="6hrs"
> --docker_socket="/var/run/docker.sock" --docker_stop_timeout="0ns"
> --docker_store_dir="/tmp/mesos/store/docker" --docker_volume_checkpoint_
> dir="/var/run/mesos/isolators/docker/volume" --enforce_container_disk_quota="false"
> --executor_registration_timeout="1mins" --executor_shutdown_grace_period="5secs"
> --fetcher_cache_dir="/tmp/Endpoint_SlaveEndpointTest_NoAuthorizer_0_QeS7Mz/fetch"
> --fetcher_cache_size="2GB" --frameworks_home="" --gc_delay="1weeks"
> --gc_disk_headroom="0.1" --hadoop_home="" --help="false"
> --hostname_lookup="true" --http_authenticators="basic"
> --http_command_executor="false" --http_credentials="/tmp/
> Endpoint_SlaveEndpointTest_NoAuthorizer_0_QeS7Mz/http_credentials"
> --image_provisioner_backend="copy" --initialize_driver_logging="true"
> --io_switchboard_enable_server="true" --isolation="posix/cpu,posix/mem"
> --launcher="posix" --launcher_dir="/mesos/build/src" --logbufsecs="0"
> --logging_level="INFO" --max_completed_executors_per_framework="150"
> --oversubscribed_resources_interval="15secs" --perf_duration="10secs"
> --perf_interval="1mins" --qos_correction_interval_min="0ns"
> --quiet="false" --recover="reconnect" --recovery_timeout="15mins"
> --registration_backoff_factor="10ms" --resources="cpus:2;gpus:0;
> mem:1024;disk:1024;ports:[31000-32000]" --revocable_cpu_low_priority="true"
> --runtime_dir="/tmp/Endpoint_SlaveEndpointTest_NoAuthorizer_0_QeS7Mz"
> --sandbox_directory="/mnt/mesos/sandbox" --strict="true"
> --switch_user="true" --systemd_enable_support="true"
> --systemd_runtime_directory="/run/systemd/system" --version="false"
> --work_dir="/tmp/Endpoint_SlaveEndpointTest_NoAuthorizer_0_4lC8ey"
> I1210 02:47:32.242676 27009 credentials.hpp:86] Loading credential for
> authentication from '/tmp/Endpoint_SlaveEndpointTest_
> NoAuthorizer_0_QeS7Mz/credential'
> I1210 02:47:32.242835 27009 slave.cpp:347] Agent using credential for:
> test-principal
> I1210 02:47:32.242854 27009 credentials.hpp:37] Loading credentials for
> authentication from '/tmp/Endpoint_SlaveEndpointTest_
> NoAuthorizer_0_QeS7Mz/http_credentials'
> I1210 02:47:32.242970 27009 http.cpp:922] Using default 'basic' HTTP
> authenticator for realm 'mesos-agent-readonly'
> I1210 02:47:32.243018 27009 http.cpp:922] Using default 'basic' HTTP
> authenticator for realm 'mesos-agent-readwrite'
> I1210 02:47:32.243382 27009 slave.cpp:534] Agent resources: cpus(*):2;
> mem(*):1024; disk(*):1024; ports(*):[31000-32000]
> I1210 02:47:32.243425 27009 slave.cpp:542] Agent attributes: [  ]
> I1210 02:47:32.243432 27009 slave.cpp:547] Agent hostname: 3e2990cdec81
> I1210 02:47:32.243897 27023 state.cpp:57] Recovering state from
> '/tmp/Endpoint_SlaveEndpointTest_NoAuthorizer_0_4lC8ey/meta'
> I1210 02:47:32.244089 27009 status_update_manager.cpp:203] Recovering
> status update manager
> I1210 02:47:32.244266 27022 containerizer.cpp:594] Recovering containerizer
> I1210 02:47:32.244940 27011 provisioner.cpp:253] Provisioner recovery
> complete
> I1210 02:47:32.245168 27017 slave.cpp:5415] Finished recovery
> I1210 02:47:32.245584 27017 slave.cpp:5589] Querying resource estimator
> for oversubscribable resources
> I1210 02:47:32.245808 27016 slave.cpp:5603] Received oversubscribable
> resources {} from the resource estimator
> I1210 02:47:32.246493 27020 process.cpp:3679] Handling HTTP event for
> process 'slave(664)' with path: '/slave(664)/monitor/statistics'
> I1210 02:47:32.247112 27021 http.cpp:874] Authorizing principal
> 'test-principal' to GET the '/monitor/statistics' endpoint
> I1210 02:47:32.249030 27012 slave.cpp:791] Agent terminating
> I1210 02:47:32.254629 27008 containerizer.cpp:220] Using isolation:
> posix/cpu,posix/mem,filesystem/posix,network/cni
> W1210 02:47:32.255007 27008 backend.cpp:76] Failed to create 'aufs'
> backend: AufsBackend requires root privileges, but is running as user mesos
> W1210 02:47:32.255125 27008 backend.cpp:76] Failed to create 'bind'
> backend: BindBackend requires root privileges
> I1210 02:47:32.255997 27008 cluster.cpp:446] Creating default 'local'
> authorizer
> I1210 02:47:32.256690 27016 slave.cpp:209] Mesos agent started on (665)@
> 172.17.0.3:33881
> I1210 02:47:32.256707 27016 slave.cpp:210] Flags at startup: --acls=""
> --appc_simple_discovery_uri_prefix="http://" --appc_store_dir="/tmp/mesos/store/appc"
> --authenticate_http_readonly="true" --authenticate_http_readwrite="true"
> --authenticatee="crammd5" --authentication_backoff_factor="1secs"
> --authorizer="local" --cgroups_cpu_enable_pids_and_tids_count="false"
> --cgroups_enable_cfs="false" --cgroups_hierarchy="/sys/fs/cgroup"
> --cgroups_limit_swap="false" --cgroups_root="mesos" --container_disk_watch_interval="15secs"
> --containerizers="mesos" --credential="/tmp/Endpoint_SlaveEndpointTest_
> NoAuthorizer_1_gp586F/credential" --default_role="*"
> --disk_watch_interval="1mins" --docker="docker"
> --docker_kill_orphans="true" --docker_registry="https://
> registry-1.docker.io" --docker_remove_delay="6hrs"
> --docker_socket="/var/run/docker.sock" --docker_stop_timeout="0ns"
> --docker_store_dir="/tmp/mesos/store/docker" --docker_volume_checkpoint_
> dir="/var/run/mesos/isolators/docker/volume" --enforce_container_disk_quota="false"
> --executor_registration_timeout="1mins" --executor_shutdown_grace_period="5secs"
> --fetcher_cache_dir="/tmp/Endpoint_SlaveEndpointTest_NoAuthorizer_1_gp586F/fetch"
> --fetcher_cache_size="2GB" --frameworks_home="" --gc_delay="1weeks"
> --gc_disk_headroom="0.1" --hadoop_home="" --help="false"
> --hostname_lookup="true" --http_authenticators="basic"
> --http_command_executor="false" --http_credentials="/tmp/
> Endpoint_SlaveEndpointTest_NoAuthorizer_1_gp586F/http_credentials"
> --image_provisioner_backend="copy" --initialize_driver_logging="true"
> --io_switchboard_enable_server="true" --isolation="posix/cpu,posix/mem"
> --launcher="posix" --launcher_dir="/mesos/build/src" --logbufsecs="0"
> --logging_level="INFO" --max_completed_executors_per_framework="150"
> --oversubscribed_resources_interval="15secs" --perf_duration="10secs"
> --perf_interval="1mins" --qos_correction_interval_min="0ns"
> --quiet="false" --recover="reconnect" --recovery_timeout="15mins"
> --registration_backoff_factor="10ms" --resources="cpus:2;gpus:0;
> mem:1024;disk:1024;ports:[31000-32000]" --revocable_cpu_low_priority="true"
> --runtime_dir="/tmp/Endpoint_SlaveEndpointTest_NoAuthorizer_1_gp586F"
> --sandbox_directory="/mnt/mesos/sandbox" --strict="true"
> --switch_user="true" --systemd_enable_support="true"
> --systemd_runtime_directory="/run/systemd/system" --version="false"
> --work_dir="/tmp/Endpoint_SlaveEndpointTest_NoAuthorizer_1_6XCMwE"
> I1210 02:47:32.257107 27016 credentials.hpp:86] Loading credential for
> authentication from '/tmp/Endpoint_SlaveEndpointTest_
> NoAuthorizer_1_gp586F/credential'
> I1210 02:47:32.257210 27016 slave.cpp:347] Agent using credential for:
> test-principal
> I1210 02:47:32.257226 27016 credentials.hpp:37] Loading credentials for
> authentication from '/tmp/Endpoint_SlaveEndpointTest_
> NoAuthorizer_1_gp586F/http_credentials'
> I1210 02:47:32.257361 27016 http.cpp:922] Using default 'basic' HTTP
> authenticator for realm 'mesos-agent-readonly'
> I1210 02:47:32.257423 27016 http.cpp:922] Using default 'basic' HTTP
> authenticator for realm 'mesos-agent-readwrite'
> I1210 02:47:32.257850 27016 slave.cpp:534] Agent resources: cpus(*):2;
> mem(*):1024; disk(*):1024; ports(*):[31000-32000]
> I1210 02:47:32.257894 27016 slave.cpp:542] Agent attributes: [  ]
> I1210 02:47:32.257903 27016 slave.cpp:547] Agent hostname: 3e2990cdec81
> I1210 02:47:32.258363 27010 state.cpp:57] Recovering state from
> '/tmp/Endpoint_SlaveEndpointTest_NoAuthorizer_1_6XCMwE/meta'
> I1210 02:47:32.258555 27015 status_update_manager.cpp:203] Recovering
> status update manager
> I1210 02:47:32.258652 27013 containerizer.cpp:594] Recovering containerizer
> I1210 02:47:32.259376 27009 provisioner.cpp:253] Provisioner recovery
> complete
> I1210 02:47:32.259582 27010 slave.cpp:5415] Finished recovery
> I1210 02:47:32.259984 27010 slave.cpp:5589] Querying resource estimator
> for oversubscribable resources
> I1210 02:47:32.260089 27017 slave.cpp:5603] Received oversubscribable
> resources {} from the resource estimator
> I1210 02:47:32.260767 27013 process.cpp:3679] Handling HTTP event for
> process 'slave(665)' with path: '/slave(665)/monitor/statistics.json'
> I1210 02:47:32.261342 27014 http.cpp:874] Authorizing principal
> 'test-principal' to GET the '/monitor/statistics.json' endpoint
> I1210 02:47:32.263367 27013 slave.cpp:791] Agent terminating
> I1210 02:47:32.269243 27008 containerizer.cpp:220] Using isolation:
> posix/cpu,posix/mem,filesystem/posix,network/cni
> W1210 02:47:32.269609 27008 backend.cpp:76] Failed to create 'aufs'
> backend: AufsBackend requires root privileges, but is running as user mesos
> W1210 02:47:32.269695 27008 backend.cpp:76] Failed to create 'bind'
> backend: BindBackend requires root privileges
> I1210 02:47:32.270733 27008 cluster.cpp:446] Creating default 'local'
> authorizer
> I1210 02:47:32.271544 27021 slave.cpp:209] Mesos agent started on (666)@
> 172.17.0.3:33881
> I1210 02:47:32.271569 27021 slave.cpp:210] Flags at startup: --acls=""
> --appc_simple_discovery_uri_prefix="http://" --appc_store_dir="/tmp/mesos/store/appc"
> --authenticate_http_readonly="true" --authenticate_http_readwrite="true"
> --authenticatee="crammd5" --authentication_backoff_factor="1secs"
> --authorizer="local" --cgroups_cpu_enable_pids_and_tids_count="false"
> --cgroups_enable_cfs="false" --cgroups_hierarchy="/sys/fs/cgroup"
> --cgroups_limit_swap="false" --cgroups_root="mesos" --container_disk_watch_interval="15secs"
> --containerizers="mesos" --credential="/tmp/Endpoint_SlaveEndpointTest_
> NoAuthorizer_2_gfzzAM/credential" --default_role="*"
> --disk_watch_interval="1mins" --docker="docker"
> --docker_kill_orphans="true" --docker_registry="https://
> registry-1.docker.io" --docker_remove_delay="6hrs"
> --docker_socket="/var/run/docker.sock" --docker_stop_timeout="0ns"
> --docker_store_dir="/tmp/mesos/store/docker" --docker_volume_checkpoint_
> dir="/var/run/mesos/isolators/docker/volume" --enforce_container_disk_quota="false"
> --executor_registration_timeout="1mins" --executor_shutdown_grace_period="5secs"
> --fetcher_cache_dir="/tmp/Endpoint_SlaveEndpointTest_NoAuthorizer_2_gfzzAM/fetch"
> --fetcher_cache_size="2GB" --frameworks_home="" --gc_delay="1weeks"
> --gc_disk_headroom="0.1" --hadoop_home="" --help="false"
> --hostname_lookup="true" --http_authenticators="basic"
> --http_command_executor="false" --http_credentials="/tmp/
> Endpoint_SlaveEndpointTest_NoAuthorizer_2_gfzzAM/http_credentials"
> --image_provisioner_backend="copy" --initialize_driver_logging="true"
> --io_switchboard_enable_server="true" --isolation="posix/cpu,posix/mem"
> --launcher="posix" --launcher_dir="/mesos/build/src" --logbufsecs="0"
> --logging_level="INFO" --max_completed_executors_per_framework="150"
> --oversubscribed_resources_interval="15secs" --perf_duration="10secs"
> --perf_interval="1mins" --qos_correction_interval_min="0ns"
> --quiet="false" --recover="reconnect" --recovery_timeout="15mins"
> --registration_backoff_factor="10ms" --resources="cpus:2;gpus:0;
> mem:1024;disk:1024;ports:[31000-32000]" --revocable_cpu_low_priority="true"
> --runtime_dir="/tmp/Endpoint_SlaveEndpointTest_NoAuthorizer_2_gfzzAM"
> --sandbox_directory="/mnt/mesos/sandbox" --strict="true"
> --switch_user="true" --systemd_enable_support="true"
> --systemd_runtime_directory="/run/systemd/system" --version="false"
> --work_dir="/tmp/Endpoint_SlaveEndpointTest_NoAuthorizer_2_KFZQXK"
> I1210 02:47:32.272042 27021 credentials.hpp:86] Loading credential for
> authentication from '/tmp/Endpoint_SlaveEndpointTest_
> NoAuthorizer_2_gfzzAM/credential'
> I1210 02:47:32.272155 27021 slave.cpp:347] Agent using credential for:
> test-principal
> I1210 02:47:32.272173 27021 credentials.hpp:37] Loading credentials for
> authentication from '/tmp/Endpoint_SlaveEndpointTest_
> NoAuthorizer_2_gfzzAM/http_credentials'
> I1210 02:47:32.272297 27021 http.cpp:922] Using default 'basic' HTTP
> authenticator for realm 'mesos-agent-readonly'
> I1210 02:47:32.272356 27021 http.cpp:922] Using default 'basic' HTTP
> authenticator for realm 'mesos-agent-readwrite'
> I1210 02:47:32.272729 27021 slave.cpp:534] Agent resources: cpus(*):2;
> mem(*):1024; disk(*):1024; ports(*):[31000-32000]
> I1210 02:47:32.272774 27021 slave.cpp:542] Agent attributes: [  ]
> I1210 02:47:32.272788 27021 slave.cpp:547] Agent hostname: 3e2990cdec81
> I1210 02:47:32.273309 27012 state.cpp:57] Recovering state from
> '/tmp/Endpoint_SlaveEndpointTest_NoAuthorizer_2_KFZQXK/meta'
> I1210 02:47:32.273506 27021 status_update_manager.cpp:203] Recovering
> status update manager
> I1210 02:47:32.273747 27013 containerizer.cpp:594] Recovering containerizer
> I1210 02:47:32.274447 27010 provisioner.cpp:253] Provisioner recovery
> complete
> I1210 02:47:32.274706 27010 slave.cpp:5415] Finished recovery
> I1210 02:47:32.275116 27010 slave.cpp:5589] Querying resource estimator
> for oversubscribable resources
> I1210 02:47:32.275291 27019 slave.cpp:5603] Received oversubscribable
> resources {} from the resource estimator
> I1210 02:47:32.276221 27018 process.cpp:3679] Handling HTTP event for
> process 'slave(666)' with path: '/slave(666)/containers'
> I1210 02:47:32.276738 27015 http.cpp:874] Authorizing principal
> 'test-principal' to GET the '/containers' endpoint
> I1210 02:47:32.278568 27011 slave.cpp:791] Agent terminating
> Inconsistency detected by ld.so: dl-close.c: 762: _dl_close: Assertion
> `map->l_init_called' failed!
> make[3]: *** [CMakeFiles/check] Error 127
> make[2]: *** [CMakeFiles/check.dir/all] Error 2
> make[1]: *** [CMakeFiles/check.dir/rule] Error 2
> make: *** [check] Error 2
> [       OK ] ContentType/SchedulerTest.Teardown/0 (85 ms)
> [ RUN      ] ContentType/SchedulerTest.Teardown/1
> [       OK ] ContentType/SchedulerTest.Teardown/1 (93 ms)
> [ RUN      ] ContentType/SchedulerTest.Decline/0
> [       OK ] ContentType/SchedulerTest.Decline/0 (29 ms)
> [ RUN      ] ContentType/SchedulerTest.Decline/1
> [       OK ] ContentType/SchedulerTest.Decline/1 (32 ms)
> [ RUN      ] ContentType/SchedulerTest.Revive/0
> [       OK ] ContentType/SchedulerTest.Revive/0 (40 ms)
> [ RUN      ] ContentType/SchedulerTest.Revive/1
> [       OK ] ContentType/SchedulerTest.Revive/1 (83 ms)
> [ RUN      ] ContentType/SchedulerTest.Suppress/0
> [       OK ] ContentType/SchedulerTest.Suppress/0 (73 ms)
> [ RUN      ] ContentType/SchedulerTest.Suppress/1
> [       OK ] ContentType/SchedulerTest.Suppress/1 (84 ms)
> [ RUN      ] ContentType/SchedulerTest.Message/0
> [       OK ] ContentType/SchedulerTest.Message/0 (85 ms)
> [ RUN      ] ContentType/SchedulerTest.Message/1
> [       OK ] ContentType/SchedulerTest.Message/1 (82 ms)
> [ RUN      ] ContentType/SchedulerTest.Request/0
> [       OK ] ContentType/SchedulerTest.Request/0 (14 ms)
> [ RUN      ] ContentType/SchedulerTest.Request/1
> [       OK ] ContentType/SchedulerTest.Request/1 (16 ms)
> [ RUN      ] ContentType/SchedulerTest.SchedulerReconnect/0
> [       OK ] ContentType/SchedulerTest.SchedulerReconnect/0 (12 ms)
> [ RUN      ] ContentType/SchedulerTest.SchedulerReconnect/1
> [       OK ] ContentType/SchedulerTest.SchedulerReconnect/1 (13 ms)
> [----------] 32 tests from ContentType/SchedulerTest (1807 ms total)
>
> [----------] 9 tests from Endpoint/SlaveEndpointTest
> [ RUN      ] Endpoint/SlaveEndpointTest.AuthorizedRequest/0
> [       OK ] Endpoint/SlaveEndpointTest.AuthorizedRequest/0 (14 ms)
> [ RUN      ] Endpoint/SlaveEndpointTest.AuthorizedRequest/1
> [       OK ] Endpoint/SlaveEndpointTest.AuthorizedRequest/1 (15 ms)
> [ RUN      ] Endpoint/SlaveEndpointTest.AuthorizedRequest/2
> [       OK ] Endpoint/SlaveEndpointTest.AuthorizedRequest/2 (14 ms)
> [ RUN      ] Endpoint/SlaveEndpointTest.UnauthorizedRequest/0
> [       OK ] Endpoint/SlaveEndpointTest.UnauthorizedRequest/0 (13 ms)
> [ RUN      ] Endpoint/SlaveEndpointTest.UnauthorizedRequest/1
> [       OK ] Endpoint/SlaveEndpointTest.UnauthorizedRequest/1 (15 ms)
> [ RUN      ] Endpoint/SlaveEndpointTest.UnauthorizedRequest/2
> [       OK ] Endpoint/SlaveEndpointTest.UnauthorizedRequest/2 (14 ms)
> [ RUN      ] Endpoint/SlaveEndpointTest.NoAuthorizer/0
> [       OK ] Endpoint/SlaveEndpointTest.NoAuthorizer/0 (14 ms)
> [ RUN      ] Endpoint/SlaveEndpointTest.NoAuthorizer/1
> [       OK ] Endpoint/SlaveEndpointTest.NoAuthorizer/1 (14 ms)
> [ RUN      ] Endpoint/SlaveEndpointTest.NoAuthorizer/2
> [       OK ] Endpoint/SlaveEndpointTest.NoAuthorizer/2 (14 ms)
> [----------] 9 tests from Endpoint/SlaveEndpointTest (132 ms total)
>
> [----------] Global test environment tear-down
> [==========] 1376 tests from 157 test cases ran. (203515 ms total)
> [  PASSED  ] 1375 tests.
> [  FAILED  ] 1 test, listed below:
> [  FAILED  ] MasterTest.ReleaseResourcesForTerminalTaskWithPendingUpdates
>
>  1 FAILED TEST
>   YOU HAVE 9 DISABLED TESTS
>
> make[3]: Leaving directory `/mesos/build'
> make[2]: Leaving directory `/mesos/build'
> make[1]: Leaving directory `/mesos/build'
> + docker rmi mesos-1481335503-21521
> Untagged: mesos-1481335503-21521:latest
> Deleted: sha256:e39ef25b26bdae3db38c48cd3a06bc
> 16a8570f6171a37092f2a3cac1999aed07
> Deleted: sha256:cc3772be6c73cedb359f0f3da240db
> ce0057d63fefb18981bb5d05c7ef338156
> Deleted: sha256:41fe98b0cd8cceac0af3b734bd52d5
> ec981c0502b555cdd77c0d8943f454f033
> Deleted: sha256:cf3d5f30bb9d175f225bf2742df17a
> 50ef367b3c8be33b114a063152afc948e0
> Deleted: sha256:2fec574c8f78a597438544a854dafb
> 4901b8e8b533c2e25fb1eca22ea63433d6
> Deleted: sha256:dbe91120c9012b41cddde7f5d17352
> 25f2e0ccd2b68e6af4f733436d5bfb8611
> Deleted: sha256:fb54fd2317e661b0c1402557b56733
> e714fa8382ba64e8ed692d5f191570a82e
> Deleted: sha256:0770a6b0b83a5c21b7039e7d3ea87d
> 10f1e84585190fa2a010a9e2f60e57f166
> Deleted: sha256:cebda6a017efe67950cad9759e60db
> ab6f4eaf31859d4baf9ddfaa82c5879081
> Deleted: sha256:3d68530c6cb6e3afe60a3c0251a6ae
> 20bc5a63c5178d0b971ee07615f8780631
> Deleted: sha256:0c7ce2908af79f3a9a10f96bbb6087
> 2f69806032ba5e83699e9fd7b00c9e6a00
> Deleted: sha256:f08c5aacf853dc0c6ccaf46614fa86
> f7f2aae4a725536d9ea54e461243db1344
> Deleted: sha256:211a394f00745c8bcee3a58028d153
> b0f9bac383290966c8d0f00619a859a5dc
> Deleted: sha256:91a4ae4a0a9b3ac2d7f0d1448a0df8
> f273f0996003689259c838d0419926acd4
> Deleted: sha256:e092c601d82ffb7f03c7c50bee5732
> 436f57d119304f2a174dae585b3251a48f
> Deleted: sha256:d8d100c02e1cc6744982e0253b7aaa
> 952c8ee86b16a85b99c4cc8261f262aa8c
> Deleted: sha256:c879ac4a29562b129fa6abbfbc804b
> 432c6b017a11eb548e0c6bee60cc865ba0
> Deleted: sha256:f36b12d3cfa241d1d7d352312e8d5c
> 31265c27430267d46e4c38dcb6c12aca08
> Deleted: sha256:90bd3f460f5387dfb379428c4626a9
> fbb4a0b36e25a319e34fd07ffc8f0f7746
> Deleted: sha256:804bd56964a5bf5311120b4823b93e
> 7e71c1572652394103cf7925df814d106e
> Deleted: sha256:f6b1577ae0151d874c9aad9b1db2b6
> 763a5082a6898033dea8a03bef2867cf88
> Deleted: sha256:9de17ca581072c67fa87a991c6e75f
> 077c48c7fb8343e5b6b97fec8e417a41ca
> Deleted: sha256:d1b2792af13f0f321462c7c1b849f2
> c96cbaa8bc546d15b87aa02c7dc734eae2
> Deleted: sha256:05f4b393930a3736a1c07368701039
> 54a52854903a048a14b452870f1344f76c
> Build step 'Execute shell' marked build as failure
>

Mime
  • Unnamed multipart/alternative (inline, None, 0 bytes)
View raw message