mesos-builds mailing list archives

Site index · List index
Message view « Date » · « Thread »
Top « Date » · « Thread »
From Apache Jenkins Server <jenk...@builds.apache.org>
Subject Build failed in Jenkins: Mesos » cmake,gcc,--verbose,GLOG_v=1 MESOS_VERBOSE=1,ubuntu:14.04,(docker||Hadoop)&&(!ubuntu-us1)&&(!ubuntu-6)&&(!ubuntu-eu2) #3011
Date Mon, 05 Dec 2016 22:10:29 GMT
See <https://builds.apache.org/job/Mesos/BUILDTOOL=cmake,COMPILER=gcc,CONFIGURATION=--verbose,ENVIRONMENT=GLOG_v=1%20MESOS_VERBOSE=1,OS=ubuntu%3A14.04,label_exp=(docker%7C%7CHadoop)&&(!ubuntu-us1)&&(!ubuntu-6)&&(!ubuntu-eu2)/3011/changes>

Changes:

[anand] Fixed missing includes in default_executor_tests.cpp.

[anand] Removed test assumptions about arrival order of status updates.

[anand] Fixed missing protobuf java package/classname definition.

[anand] Enabled java protos generation for v1 Master/Agent API.

[anand] Enabled python proto generation for v1 Master/Agent API.

[yujie.jay] Implement a namespaces/ipc isolator.

[yujie.jay] Use a common fixture for the PID namespace test.

[yujie.jay] Add namespaces/ipc documentation.

[yujie.jay] Added removal of unix domain socket path in IOSwitchboard::cleanup.

------------------------------------------
[...truncated 8193 lines...]
/usr/bin/cmake -E cmake_progress_report /mesos/build/CMakeFiles  87 88 89 90 91 92 93 94
[ 38%] Built target stout_tests
Linking CXX shared library libprocess-0.0.1.so
cd /mesos/build/3rdparty/libprocess/src && /usr/bin/cmake -E cmake_link_script CMakeFiles/process-0.0.1.dir/link.txt --verbose=1
/usr/bin/g++  -fPIC  -O2 -std=c++11 -g   -shared -Wl,-soname,libprocess-0.0.1.so.0 -o libprocess-0.0.1.so.0.0.1 CMakeFiles/process-0.0.1.dir/subprocess_posix.cpp.o CMakeFiles/process-0.0.1.dir/authenticator_manager.cpp.o CMakeFiles/process-0.0.1.dir/authenticator.cpp.o CMakeFiles/process-0.0.1.dir/clock.cpp.o CMakeFiles/process-0.0.1.dir/firewall.cpp.o CMakeFiles/process-0.0.1.dir/help.cpp.o CMakeFiles/process-0.0.1.dir/http.cpp.o CMakeFiles/process-0.0.1.dir/io.cpp.o CMakeFiles/process-0.0.1.dir/latch.cpp.o CMakeFiles/process-0.0.1.dir/logging.cpp.o CMakeFiles/process-0.0.1.dir/metrics/metrics.cpp.o CMakeFiles/process-0.0.1.dir/pid.cpp.o CMakeFiles/process-0.0.1.dir/poll_socket.cpp.o CMakeFiles/process-0.0.1.dir/profiler.cpp.o CMakeFiles/process-0.0.1.dir/process.cpp.o CMakeFiles/process-0.0.1.dir/reap.cpp.o CMakeFiles/process-0.0.1.dir/socket.cpp.o CMakeFiles/process-0.0.1.dir/subprocess.cpp.o CMakeFiles/process-0.0.1.dir/time.cpp.o CMakeFiles/process-0.0.1.dir/timeseries.cpp.o CMakeFiles/process-0.0.1.dir/libev.cpp.o CMakeFiles/process-0.0.1.dir/libev_poll.cpp.o  -L/usr/lib/x86_64-linux-gnu/libapr-1.so  -L/mesos/build/3rdparty/glog-0.3.3/src/glog-0.3.3-lib/lib/lib  -L/mesos/build/3rdparty/protobuf-2.6.1/src/protobuf-2.6.1-lib/lib/lib  -L/usr/lib/x86_64-linux-gnu/libsvn_delta-1.so  -L/usr/lib/x86_64-linux-gnu/libsvn_diff-1.so  -L/usr/lib/x86_64-linux-gnu/libsvn_subr-1.so  -L/mesos/build/3rdparty/http_parser-2.6.2/src/http_parser-2.6.2-build  -L/mesos/build/3rdparty/libev-4.22/src/libev-4.22-build/.libs -lcurl -lglog -lsvn_delta-1 -lsvn_diff-1 -lsvn_subr-1 -lprotobuf -ldl -lapr-1 -lrt -lhttp_parser -lev -lrt -lz -lpthread -lhttp_parser -lev -lz -lpthread -Wl,-rpath,/usr/lib/x86_64-linux-gnu/libapr-1.so:/mesos/build/3rdparty/glog-0.3.3/src/glog-0.3.3-lib/lib/lib:/mesos/build/3rdparty/protobuf-2.6.1/src/protobuf-2.6.1-lib/lib/lib:/usr/lib/x86_64-linux-gnu/libsvn_delta-1.so:/usr/lib/x86_64-linux-gnu/libsvn_diff-1.so:/usr/lib/x86_64-linux-gnu/libsvn_subr-1.so:/mesos/build/3rdparty/http_parser-2.6.2/src/http_parser-2.6.2-build:/mesos/build/3rdparty/libev-4.22/src/libev-4.22-build/.libs 
cd /mesos/build/3rdparty/libprocess/src && /usr/bin/cmake -E cmake_symlink_library libprocess-0.0.1.so.0.0.1 libprocess-0.0.1.so.0 libprocess-0.0.1.so
make[3]: Leaving directory `/mesos/build'
/usr/bin/cmake -E cmake_progress_report /mesos/build/CMakeFiles  79 80 81
[ 38%] Built target process-0.0.1
make -f src/CMakeFiles/mesos-1.2.0.dir/build.make src/CMakeFiles/mesos-1.2.0.dir/depend
make -f 3rdparty/libprocess/src/tests/CMakeFiles/test-linkee.dir/build.make 3rdparty/libprocess/src/tests/CMakeFiles/test-linkee.dir/depend
make[3]: Entering directory `/mesos/build'
cd /mesos/build && /usr/bin/cmake -E cmake_depends "Unix Makefiles" /mesos /mesos/3rdparty/libprocess/src/tests /mesos/build /mesos/build/3rdparty/libprocess/src/tests /mesos/build/3rdparty/libprocess/src/tests/CMakeFiles/test-linkee.dir/DependInfo.cmake --color=
make[3]: Entering directory `/mesos/build'
cd /mesos/build && /usr/bin/cmake -E cmake_depends "Unix Makefiles" /mesos /mesos/src /mesos/build /mesos/build/src /mesos/build/src/CMakeFiles/mesos-1.2.0.dir/DependInfo.cmake --color=
Scanning dependencies of target test-linkee
make[3]: Leaving directory `/mesos/build'
make -f 3rdparty/libprocess/src/tests/CMakeFiles/test-linkee.dir/build.make 3rdparty/libprocess/src/tests/CMakeFiles/test-linkee.dir/build
make[3]: Entering directory `/mesos/build'
/usr/bin/cmake -E cmake_progress_report /mesos/build/CMakeFiles 
[ 38%] Building CXX object 3rdparty/libprocess/src/tests/CMakeFiles/test-linkee.dir/test_linkee.cpp.o
cd /mesos/build/3rdparty/libprocess/src/tests && /usr/bin/g++   -DBUILD_DIR=\"/mesos/build/3rdparty/libprocess/src/tests\" -DHAS_AUTHENTICATION=1 -DLIBDIR=\"/usr/local/libmesos\" -DPICOJSON_USE_INT64 -DPKGDATADIR=\"/usr/local/share/mesos\" -DPKGLIBEXECDIR=\"/usr/local/libexec/mesos\" -DVERSION=\"1.2.0\" -D__STDC_FORMAT_MACROS -O2 -std=c++11 -g -fPIE -I/mesos/3rdparty/libprocess/src/tests/.. -I/mesos/3rdparty/stout/include -I/usr/include/apr-1.0 -I/mesos/build/3rdparty/boost-1.53.0/src/boost-1.53.0 -I/mesos/build/3rdparty/elfio-3.2/src/elfio-3.2 -I/mesos/build/3rdparty/glog-0.3.3/src/glog-0.3.3-lib/lib/include -I/mesos/build/3rdparty/nvml-352.79/src/nvml-352.79 -I/mesos/build/3rdparty/picojson-1.3.0/src/picojson-1.3.0 -I/mesos/build/3rdparty/protobuf-2.6.1/src/protobuf-2.6.1-lib/lib/include -I/usr/include/subversion-1 -I/mesos/3rdparty/libprocess/src/tests/src -I/mesos/3rdparty/libprocess/include -I/mesos/build/3rdparty/http_parser-2.6.2/src/http_parser-2.6.2 -I/mesos/build/3rdparty/libev-4.22/src/libev-4.22 -I/mesos/build/3rdparty/gmock-1.7.0/src/gmock-1.7.0/include -I/mesos/build/3rdparty/gmock-1.7.0/src/gmock-1.7.0/gtest/include    -o CMakeFiles/test-linkee.dir/test_linkee.cpp.o -c /mesos/3rdparty/libprocess/src/tests/test_linkee.cpp
Scanning dependencies of target mesos-1.2.0
make[3]: Leaving directory `/mesos/build'
make -f src/CMakeFiles/mesos-1.2.0.dir/build.make src/CMakeFiles/mesos-1.2.0.dir/build
make[3]: Entering directory `/mesos/build'
/usr/bin/cmake -E cmake_progress_report /mesos/build/CMakeFiles 
[ 38%] /usr/bin/cmake -E cmake_progress_report /mesos/build/CMakeFiles 
Building CXX object src/CMakeFiles/mesos-1.2.0.dir/slave/constants.cpp.o
cd /mesos/build/src && /usr/bin/g++   -DBUILD_DATE="\"2016-3-3 10:20\"" -DBUILD_FLAGS=\"\" -DBUILD_JAVA_JVM_LIBRARY=\"\" -DBUILD_TIME=\"1111100\" -DBUILD_USER=\"frank\" -DHAS_AUTHENTICATION=1 -DLIBDIR=\"/usr/local/libmesos\" -DPICOJSON_USE_INT64 -DPKGDATADIR=\"/usr/local/share/mesos\" -DPKGLIBEXECDIR=\"/usr/local/libexec/mesos\" -DUSE_STATIC_LIB -DVERSION=\"1.2.0\" -D__STDC_FORMAT_MACROS -Dmesos_1_2_0_EXPORTS -O2 -std=c++11 -g -fPIC -I/mesos/build/include -I/mesos/build/include/mesos -I/mesos/build/src -I/mesos/src -I/mesos/build/3rdparty/protobuf-2.6.1/src/protobuf-2.6.1-lib/lib/include -I/mesos/include -I/mesos/3rdparty/stout/include -I/usr/include/apr-1.0 -I/mesos/build/3rdparty/boost-1.53.0/src/boost-1.53.0 -I/mesos/build/3rdparty/elfio-3.2/src/elfio-3.2 -I/mesos/build/3rdparty/glog-0.3.3/src/glog-0.3.3-lib/lib/include -I/mesos/build/3rdparty/nvml-352.79/src/nvml-352.79 -I/mesos/build/3rdparty/picojson-1.3.0/src/picojson-1.3.0 -I/usr/include/subversion-1 -I/mesos/src/src -I/mesos/3rdparty/libprocess/include -I/mesos/build/3rdparty/http_parser-2.6.2/src/http_parser-2.6.2 -I/mesos/build/3rdparty/libev-4.22/src/libev-4.22 -I/mesos/build/3rdparty/zookeeper-3.4.8/src/zookeeper-3.4.8/src/c/include -I/mesos/build/3rdparty/zookeeper-3.4.8/src/zookeeper-3.4.8/src/c/generated -I/mesos/build/3rdparty/leveldb-1.4/src/leveldb-1.4/include    -o CMakeFiles/mesos-1.2.0.dir/slave/constants.cpp.o -c /mesos/src/slave/constants.cpp
/usr/bin/cmake -E cmake_progress_report /mesos/build/CMakeFiles 
/usr/bin/cmake -E cmake_progress_report /mesos/build/CMakeFiles 
[ 38%] /usr/bin/cmake -E cmake_progress_report /mesos/build/CMakeFiles 
[ 38%] [ 38%] Building CXX object src/CMakeFiles/mesos-1.2.0.dir/slave/container_logger.cpp.o
cd /mesos/build/src && /usr/bin/g++   -DBUILD_DATE="\"2016-3-3 10:20\"" -DBUILD_FLAGS=\"\" -DBUILD_JAVA_JVM_LIBRARY=\"\" -DBUILD_TIME=\"1111100\" -DBUILD_USER=\"frank\" -DHAS_AUTHENTICATION=1 -DLIBDIR=\"/usr/local/libmesos\" -DPICOJSON_USE_INT64 -DPKGDATADIR=\"/usr/local/share/mesos\" -DPKGLIBEXECDIR=\"/usr/local/libexec/mesos\" -DUSE_STATIC_LIB -DVERSION=\"1.2.0\" -D__STDC_FORMAT_MACROS -Dmesos_1_2_0_EXPORTS -O2 -std=c++11 -g -fPIC -I/mesos/build/include -I/mesos/build/include/mesos -I/mesos/build/src -I/mesos/src -I/mesos/build/3rdparty/protobuf-2.6.1/src/protobuf-2.6.1-lib/lib/include -I/mesos/include -I/mesos/3rdparty/stout/include -I/usr/include/apr-1.0 -I/mesos/build/3rdparty/boost-1.53.0/src/boost-1.53.0 -I/mesos/build/3rdparty/elfio-3.2/src/elfio-3.2 -I/mesos/build/3rdparty/glog-0.3.3/src/glog-0.3.3-lib/lib/include -I/mesos/build/3rdparty/nvml-352.79/src/nvml-352.79 -I/mesos/build/3rdparty/picojson-1.3.0/src/picojson-1.3.0 -I/usr/include/subversion-1 -I/mesos/src/src -I/mesos/3rdparty/libprocess/include -I/mesos/build/3rdparty/http_parser-2.6.2/src/http_parser-2.6.2 -I/mesos/build/3rdparty/libev-4.22/src/libev-4.22 -I/mesos/build/3rdparty/zookeeper-3.4.8/src/zookeeper-3.4.8/src/c/include -I/mesos/build/3rdparty/zookeeper-3.4.8/src/zookeeper-3.4.8/src/c/generated -I/mesos/build/3rdparty/leveldb-1.4/src/leveldb-1.4/include    -o CMakeFiles/mesos-1.2.0.dir/slave/container_logger.cpp.o -c /mesos/src/slave/container_logger.cpp
[ 38%] Building CXX object src/CMakeFiles/mesos-1.2.0.dir/slave/flags.cpp.o
cd /mesos/build/src && /usr/bin/g++   -DBUILD_DATE="\"2016-3-3 10:20\"" -DBUILD_FLAGS=\"\" -DBUILD_JAVA_JVM_LIBRARY=\"\" -DBUILD_TIME=\"1111100\" -DBUILD_USER=\"frank\" -DHAS_AUTHENTICATION=1 -DLIBDIR=\"/usr/local/libmesos\" -DPICOJSON_USE_INT64 -DPKGDATADIR=\"/usr/local/share/mesos\" -DPKGLIBEXECDIR=\"/usr/local/libexec/mesos\" -DUSE_STATIC_LIB -DVERSION=\"1.2.0\" -D__STDC_FORMAT_MACROS -Dmesos_1_2_0_EXPORTS -O2 -std=c++11 -g -fPIC -I/mesos/build/include -I/mesos/build/include/mesos -I/mesos/build/src -I/mesos/src -I/mesos/build/3rdparty/protobuf-2.6.1/src/protobuf-2.6.1-lib/lib/include -I/mesos/include -I/mesos/3rdparty/stout/include -I/usr/include/apr-1.0 -I/mesos/build/3rdparty/boost-1.53.0/src/boost-1.53.0 -I/mesos/build/3rdparty/elfio-3.2/src/elfio-3.2 -I/mesos/build/3rdparty/glog-0.3.3/src/glog-0.3.3-lib/lib/include -I/mesos/build/3rdparty/nvml-352.79/src/nvml-352.79 -I/mesos/build/3rdparty/picojson-1.3.0/src/picojson-1.3.0 -I/usr/include/subversion-1 -I/mesos/src/src -I/mesos/3rdparty/libprocess/include -I/mesos/build/3rdparty/http_parser-2.6.2/src/http_parser-2.6.2 -I/mesos/build/3rdparty/libev-4.22/src/libev-4.22 -I/mesos/build/3rdparty/zookeeper-3.4.8/src/zookeeper-3.4.8/src/c/include -I/mesos/build/3rdparty/zookeeper-3.4.8/src/zookeeper-3.4.8/src/c/generated -I/mesos/build/3rdparty/leveldb-1.4/src/leveldb-1.4/include    -o CMakeFiles/mesos-1.2.0.dir/slave/flags.cpp.o -c /mesos/src/slave/flags.cpp
Building CXX object src/CMakeFiles/mesos-1.2.0.dir/slave/gc.cpp.o
cd /mesos/build/src && /usr/bin/g++   -DBUILD_DATE="\"2016-3-3 10:20\"" -DBUILD_FLAGS=\"\" -DBUILD_JAVA_JVM_LIBRARY=\"\" -DBUILD_TIME=\"1111100\" -DBUILD_USER=\"frank\" -DHAS_AUTHENTICATION=1 -DLIBDIR=\"/usr/local/libmesos\" -DPICOJSON_USE_INT64 -DPKGDATADIR=\"/usr/local/share/mesos\" -DPKGLIBEXECDIR=\"/usr/local/libexec/mesos\" -DUSE_STATIC_LIB -DVERSION=\"1.2.0\" -D__STDC_FORMAT_MACROS -Dmesos_1_2_0_EXPORTS -O2 -std=c++11 -g -fPIC -I/mesos/build/include -I/mesos/build/include/mesos -I/mesos/build/src -I/mesos/src -I/mesos/build/3rdparty/protobuf-2.6.1/src/protobuf-2.6.1-lib/lib/include -I/mesos/include -I/mesos/3rdparty/stout/include -I/usr/include/apr-1.0 -I/mesos/build/3rdparty/boost-1.53.0/src/boost-1.53.0 -I/mesos/build/3rdparty/elfio-3.2/src/elfio-3.2 -I/mesos/build/3rdparty/glog-0.3.3/src/glog-0.3.3-lib/lib/include -I/mesos/build/3rdparty/nvml-352.79/src/nvml-352.79 -I/mesos/build/3rdparty/picojson-1.3.0/src/picojson-1.3.0 -I/usr/include/subversion-1 -I/mesos/src/src -I/mesos/3rdparty/libprocess/include -I/mesos/build/3rdparty/http_parser-2.6.2/src/http_parser-2.6.2 -I/mesos/build/3rdparty/libev-4.22/src/libev-4.22 -I/mesos/build/3rdparty/zookeeper-3.4.8/src/zookeeper-3.4.8/src/c/include -I/mesos/build/3rdparty/zookeeper-3.4.8/src/zookeeper-3.4.8/src/c/generated -I/mesos/build/3rdparty/leveldb-1.4/src/leveldb-1.4/include    -o CMakeFiles/mesos-1.2.0.dir/slave/gc.cpp.o -c /mesos/src/slave/gc.cpp
Building CXX object src/CMakeFiles/mesos-1.2.0.dir/slave/http.cpp.o
cd /mesos/build/src && /usr/bin/g++   -DBUILD_DATE="\"2016-3-3 10:20\"" -DBUILD_FLAGS=\"\" -DBUILD_JAVA_JVM_LIBRARY=\"\" -DBUILD_TIME=\"1111100\" -DBUILD_USER=\"frank\" -DHAS_AUTHENTICATION=1 -DLIBDIR=\"/usr/local/libmesos\" -DPICOJSON_USE_INT64 -DPKGDATADIR=\"/usr/local/share/mesos\" -DPKGLIBEXECDIR=\"/usr/local/libexec/mesos\" -DUSE_STATIC_LIB -DVERSION=\"1.2.0\" -D__STDC_FORMAT_MACROS -Dmesos_1_2_0_EXPORTS -O2 -std=c++11 -g -fPIC -I/mesos/build/include -I/mesos/build/include/mesos -I/mesos/build/src -I/mesos/src -I/mesos/build/3rdparty/protobuf-2.6.1/src/protobuf-2.6.1-lib/lib/include -I/mesos/include -I/mesos/3rdparty/stout/include -I/usr/include/apr-1.0 -I/mesos/build/3rdparty/boost-1.53.0/src/boost-1.53.0 -I/mesos/build/3rdparty/elfio-3.2/src/elfio-3.2 -I/mesos/build/3rdparty/glog-0.3.3/src/glog-0.3.3-lib/lib/include -I/mesos/build/3rdparty/nvml-352.79/src/nvml-352.79 -I/mesos/build/3rdparty/picojson-1.3.0/src/picojson-1.3.0 -I/usr/include/subversion-1 -I/mesos/src/src -I/mesos/3rdparty/libprocess/include -I/mesos/build/3rdparty/http_parser-2.6.2/src/http_parser-2.6.2 -I/mesos/build/3rdparty/libev-4.22/src/libev-4.22 -I/mesos/build/3rdparty/zookeeper-3.4.8/src/zookeeper-3.4.8/src/c/include -I/mesos/build/3rdparty/zookeeper-3.4.8/src/zookeeper-3.4.8/src/c/generated -I/mesos/build/3rdparty/leveldb-1.4/src/leveldb-1.4/include    -o CMakeFiles/mesos-1.2.0.dir/slave/http.cpp.o -c /mesos/src/slave/http.cpp
/usr/bin/cmake -E cmake_progress_report /mesos/build/CMakeFiles 12
[ 39%] Building CXX object src/CMakeFiles/mesos-1.2.0.dir/slave/metrics.cpp.o
cd /mesos/build/src && /usr/bin/g++   -DBUILD_DATE="\"2016-3-3 10:20\"" -DBUILD_FLAGS=\"\" -DBUILD_JAVA_JVM_LIBRARY=\"\" -DBUILD_TIME=\"1111100\" -DBUILD_USER=\"frank\" -DHAS_AUTHENTICATION=1 -DLIBDIR=\"/usr/local/libmesos\" -DPICOJSON_USE_INT64 -DPKGDATADIR=\"/usr/local/share/mesos\" -DPKGLIBEXECDIR=\"/usr/local/libexec/mesos\" -DUSE_STATIC_LIB -DVERSION=\"1.2.0\" -D__STDC_FORMAT_MACROS -Dmesos_1_2_0_EXPORTS -O2 -std=c++11 -g -fPIC -I/mesos/build/include -I/mesos/build/include/mesos -I/mesos/build/src -I/mesos/src -I/mesos/build/3rdparty/protobuf-2.6.1/src/protobuf-2.6.1-lib/lib/include -I/mesos/include -I/mesos/3rdparty/stout/include -I/usr/include/apr-1.0 -I/mesos/build/3rdparty/boost-1.53.0/src/boost-1.53.0 -I/mesos/build/3rdparty/elfio-3.2/src/elfio-3.2 -I/mesos/build/3rdparty/glog-0.3.3/src/glog-0.3.3-lib/lib/include -I/mesos/build/3rdparty/nvml-352.79/src/nvml-352.79 -I/mesos/build/3rdparty/picojson-1.3.0/src/picojson-1.3.0 -I/usr/include/subversion-1 -I/mesos/src/src -I/mesos/3rdparty/libprocess/include -I/mesos/build/3rdparty/http_parser-2.6.2/src/http_parser-2.6.2 -I/mesos/build/3rdparty/libev-4.22/src/libev-4.22 -I/mesos/build/3rdparty/zookeeper-3.4.8/src/zookeeper-3.4.8/src/c/include -I/mesos/build/3rdparty/zookeeper-3.4.8/src/zookeeper-3.4.8/src/c/generated -I/mesos/build/3rdparty/leveldb-1.4/src/leveldb-1.4/include    -o CMakeFiles/mesos-1.2.0.dir/slave/metrics.cpp.o -c /mesos/src/slave/metrics.cpp
Linking CXX executable test-linkee
cd /mesos/build/3rdparty/libprocess/src/tests && /usr/bin/cmake -E cmake_link_script CMakeFiles/test-linkee.dir/link.txt --verbose=1
/usr/bin/g++    -O2 -std=c++11 -g    CMakeFiles/test-linkee.dir/test_linkee.cpp.o  -o test-linkee  -L/usr/lib/x86_64-linux-gnu/libapr-1.so  -L/mesos/build/3rdparty/glog-0.3.3/src/glog-0.3.3-lib/lib/lib  -L/mesos/build/3rdparty/protobuf-2.6.1/src/protobuf-2.6.1-lib/lib/lib  -L/usr/lib/x86_64-linux-gnu/libsvn_delta-1.so  -L/usr/lib/x86_64-linux-gnu/libsvn_diff-1.so  -L/usr/lib/x86_64-linux-gnu/libsvn_subr-1.so  -L/mesos/build/3rdparty/http_parser-2.6.2/src/http_parser-2.6.2-build  -L/mesos/build/3rdparty/libev-4.22/src/libev-4.22-build/.libs  -L/mesos/build/3rdparty/libprocess/..  -L/mesos/build/3rdparty/gmock-1.7.0/src/gmock-1.7.0-lib/lib  -L/mesos/build/3rdparty/gmock-1.7.0/src/gmock-1.7.0-build/gtest/lib/.libs -rdynamic ../libprocess-0.0.1.so.0.0.1 -lcurl -lglog -lsvn_delta-1 -lsvn_diff-1 -lsvn_subr-1 -lprotobuf -ldl -lapr-1 -lrt -lhttp_parser -lev -lrt -lz -lpthread -lgmock -lgtest -lhttp_parser -lev -lz -lpthread -Wl,-rpath,/usr/lib/x86_64-linux-gnu/libapr-1.so:/mesos/build/3rdparty/glog-0.3.3/src/glog-0.3.3-lib/lib/lib:/mesos/build/3rdparty/protobuf-2.6.1/src/protobuf-2.6.1-lib/lib/lib:/usr/lib/x86_64-linux-gnu/libsvn_delta-1.so:/usr/lib/x86_64-linux-gnu/libsvn_diff-1.so:/usr/lib/x86_64-linux-gnu/libsvn_subr-1.so:/mesos/build/3rdparty/http_parser-2.6.2/src/http_parser-2.6.2-build:/mesos/build/3rdparty/libev-4.22/src/libev-4.22-build/.libs:/mesos/build/3rdparty/libprocess/..:/mesos/build/3rdparty/gmock-1.7.0/src/gmock-1.7.0-lib/lib:/mesos/build/3rdparty/gmock-1.7.0/src/gmock-1.7.0-build/gtest/lib/.libs:/mesos/build/3rdparty/libprocess/src 
make[3]: Leaving directory `/mesos/build'
/usr/bin/cmake -E cmake_progress_report /mesos/build/CMakeFiles 
[ 39%] Built target test-linkee
/usr/bin/cmake -E cmake_progress_report /mesos/build/CMakeFiles 
[ 39%] Building CXX object src/CMakeFiles/mesos-1.2.0.dir/slave/paths.cpp.o
cd /mesos/build/src && /usr/bin/g++   -DBUILD_DATE="\"2016-3-3 10:20\"" -DBUILD_FLAGS=\"\" -DBUILD_JAVA_JVM_LIBRARY=\"\" -DBUILD_TIME=\"1111100\" -DBUILD_USER=\"frank\" -DHAS_AUTHENTICATION=1 -DLIBDIR=\"/usr/local/libmesos\" -DPICOJSON_USE_INT64 -DPKGDATADIR=\"/usr/local/share/mesos\" -DPKGLIBEXECDIR=\"/usr/local/libexec/mesos\" -DUSE_STATIC_LIB -DVERSION=\"1.2.0\" -D__STDC_FORMAT_MACROS -Dmesos_1_2_0_EXPORTS -O2 -std=c++11 -g -fPIC -I/mesos/build/include -I/mesos/build/include/mesos -I/mesos/build/src -I/mesos/src -I/mesos/build/3rdparty/protobuf-2.6.1/src/protobuf-2.6.1-lib/lib/include -I/mesos/include -I/mesos/3rdparty/stout/include -I/usr/include/apr-1.0 -I/mesos/build/3rdparty/boost-1.53.0/src/boost-1.53.0 -I/mesos/build/3rdparty/elfio-3.2/src/elfio-3.2 -I/mesos/build/3rdparty/glog-0.3.3/src/glog-0.3.3-lib/lib/include -I/mesos/build/3rdparty/nvml-352.79/src/nvml-352.79 -I/mesos/build/3rdparty/picojson-1.3.0/src/picojson-1.3.0 -I/usr/include/subversion-1 -I/mesos/src/src -I/mesos/3rdparty/libprocess/include -I/mesos/build/3rdparty/http_parser-2.6.2/src/http_parser-2.6.2 -I/mesos/build/3rdparty/libev-4.22/src/libev-4.22 -I/mesos/build/3rdparty/zookeeper-3.4.8/src/zookeeper-3.4.8/src/c/include -I/mesos/build/3rdparty/zookeeper-3.4.8/src/zookeeper-3.4.8/src/c/generated -I/mesos/build/3rdparty/leveldb-1.4/src/leveldb-1.4/include    -o CMakeFiles/mesos-1.2.0.dir/slave/paths.cpp.o -c /mesos/src/slave/paths.cpp
make -f 3rdparty/libprocess/src/tests/CMakeFiles/process_tests.dir/build.make 3rdparty/libprocess/src/tests/CMakeFiles/process_tests.dir/depend
make[3]: Entering directory `/mesos/build'
cd /mesos/build && /usr/bin/cmake -E cmake_depends "Unix Makefiles" /mesos /mesos/3rdparty/libprocess/src/tests /mesos/build /mesos/build/3rdparty/libprocess/src/tests /mesos/build/3rdparty/libprocess/src/tests/CMakeFiles/process_tests.dir/DependInfo.cmake --color=
Scanning dependencies of target process_tests
make[3]: Leaving directory `/mesos/build'
make -f 3rdparty/libprocess/src/tests/CMakeFiles/process_tests.dir/build.make 3rdparty/libprocess/src/tests/CMakeFiles/process_tests.dir/build
make[3]: Entering directory `/mesos/build'
/usr/bin/cmake -E cmake_progress_report /mesos/build/CMakeFiles 82
[ 40%] Building CXX object 3rdparty/libprocess/src/tests/CMakeFiles/process_tests.dir/main.cpp.o
cd /mesos/build/3rdparty/libprocess/src/tests && /usr/bin/g++   -DBUILD_DIR=\"/mesos/build/3rdparty/libprocess/src/tests\" -DHAS_AUTHENTICATION=1 -DLIBDIR=\"/usr/local/libmesos\" -DPICOJSON_USE_INT64 -DPKGDATADIR=\"/usr/local/share/mesos\" -DPKGLIBEXECDIR=\"/usr/local/libexec/mesos\" -DVERSION=\"1.2.0\" -D__STDC_FORMAT_MACROS -O2 -std=c++11 -g -fPIE -I/mesos/3rdparty/libprocess/src/tests/.. -I/mesos/3rdparty/stout/include -I/usr/include/apr-1.0 -I/mesos/build/3rdparty/boost-1.53.0/src/boost-1.53.0 -I/mesos/build/3rdparty/elfio-3.2/src/elfio-3.2 -I/mesos/build/3rdparty/glog-0.3.3/src/glog-0.3.3-lib/lib/include -I/mesos/build/3rdparty/nvml-352.79/src/nvml-352.79 -I/mesos/build/3rdparty/picojson-1.3.0/src/picojson-1.3.0 -I/mesos/build/3rdparty/protobuf-2.6.1/src/protobuf-2.6.1-lib/lib/include -I/usr/include/subversion-1 -I/mesos/3rdparty/libprocess/src/tests/src -I/mesos/3rdparty/libprocess/include -I/mesos/build/3rdparty/http_parser-2.6.2/src/http_parser-2.6.2 -I/mesos/build/3rdparty/libev-4.22/src/libev-4.22 -I/mesos/build/3rdparty/gmock-1.7.0/src/gmock-1.7.0/include -I/mesos/build/3rdparty/gmock-1.7.0/src/gmock-1.7.0/gtest/include    -o CMakeFiles/process_tests.dir/main.cpp.o -c /mesos/3rdparty/libprocess/src/tests/main.cpp
/usr/bin/cmake -E cmake_progress_report /mesos/build/CMakeFiles 
[ 40%] Building CXX object 3rdparty/libprocess/src/tests/CMakeFiles/process_tests.dir/collect_tests.cpp.o
cd /mesos/build/3rdparty/libprocess/src/tests && /usr/bin/g++   -DBUILD_DIR=\"/mesos/build/3rdparty/libprocess/src/tests\" -DHAS_AUTHENTICATION=1 -DLIBDIR=\"/usr/local/libmesos\" -DPICOJSON_USE_INT64 -DPKGDATADIR=\"/usr/local/share/mesos\" -DPKGLIBEXECDIR=\"/usr/local/libexec/mesos\" -DVERSION=\"1.2.0\" -D__STDC_FORMAT_MACROS -O2 -std=c++11 -g -fPIE -I/mesos/3rdparty/libprocess/src/tests/.. -I/mesos/3rdparty/stout/include -I/usr/include/apr-1.0 -I/mesos/build/3rdparty/boost-1.53.0/src/boost-1.53.0 -I/mesos/build/3rdparty/elfio-3.2/src/elfio-3.2 -I/mesos/build/3rdparty/glog-0.3.3/src/glog-0.3.3-lib/lib/include -I/mesos/build/3rdparty/nvml-352.79/src/nvml-352.79 -I/mesos/build/3rdparty/picojson-1.3.0/src/picojson-1.3.0 -I/mesos/build/3rdparty/protobuf-2.6.1/src/protobuf-2.6.1-lib/lib/include -I/usr/include/subversion-1 -I/mesos/3rdparty/libprocess/src/tests/src -I/mesos/3rdparty/libprocess/include -I/mesos/build/3rdparty/http_parser-2.6.2/src/http_parser-2.6.2 -I/mesos/build/3rdparty/libev-4.22/src/libev-4.22 -I/mesos/build/3rdparty/gmock-1.7.0/src/gmock-1.7.0/include -I/mesos/build/3rdparty/gmock-1.7.0/src/gmock-1.7.0/gtest/include    -o CMakeFiles/process_tests.dir/collect_tests.cpp.o -c /mesos/3rdparty/libprocess/src/tests/collect_tests.cpp
/usr/bin/cmake -E cmake_progress_report /mesos/build/CMakeFiles 
[ 40%] Building CXX object src/CMakeFiles/mesos-1.2.0.dir/slave/qos_controller.cpp.o
cd /mesos/build/src && /usr/bin/g++   -DBUILD_DATE="\"2016-3-3 10:20\"" -DBUILD_FLAGS=\"\" -DBUILD_JAVA_JVM_LIBRARY=\"\" -DBUILD_TIME=\"1111100\" -DBUILD_USER=\"frank\" -DHAS_AUTHENTICATION=1 -DLIBDIR=\"/usr/local/libmesos\" -DPICOJSON_USE_INT64 -DPKGDATADIR=\"/usr/local/share/mesos\" -DPKGLIBEXECDIR=\"/usr/local/libexec/mesos\" -DUSE_STATIC_LIB -DVERSION=\"1.2.0\" -D__STDC_FORMAT_MACROS -Dmesos_1_2_0_EXPORTS -O2 -std=c++11 -g -fPIC -I/mesos/build/include -I/mesos/build/include/mesos -I/mesos/build/src -I/mesos/src -I/mesos/build/3rdparty/protobuf-2.6.1/src/protobuf-2.6.1-lib/lib/include -I/mesos/include -I/mesos/3rdparty/stout/include -I/usr/include/apr-1.0 -I/mesos/build/3rdparty/boost-1.53.0/src/boost-1.53.0 -I/mesos/build/3rdparty/elfio-3.2/src/elfio-3.2 -I/mesos/build/3rdparty/glog-0.3.3/src/glog-0.3.3-lib/lib/include -I/mesos/build/3rdparty/nvml-352.79/src/nvml-352.79 -I/mesos/build/3rdparty/picojson-1.3.0/src/picojson-1.3.0 -I/usr/include/subversion-1 -I/mesos/src/src -I/mesos/3rdparty/libprocess/include -I/mesos/build/3rdparty/http_parser-2.6.2/src/http_parser-2.6.2 -I/mesos/build/3rdparty/libev-4.22/src/libev-4.22 -I/mesos/build/3rdparty/zookeeper-3.4.8/src/zookeeper-3.4.8/src/c/include -I/mesos/build/3rdparty/zookeeper-3.4.8/src/zookeeper-3.4.8/src/c/generated -I/mesos/build/3rdparty/leveldb-1.4/src/leveldb-1.4/include    -o CMakeFiles/mesos-1.2.0.dir/slave/qos_controller.cpp.o -c /mesos/src/slave/qos_controller.cpp
/usr/bin/cmake -E cmake_progress_report /mesos/build/CMakeFiles 
[ 40%] Building CXX object 3rdparty/libprocess/src/tests/CMakeFiles/process_tests.dir/decoder_tests.cpp.o
cd /mesos/build/3rdparty/libprocess/src/tests && /usr/bin/g++   -DBUILD_DIR=\"/mesos/build/3rdparty/libprocess/src/tests\" -DHAS_AUTHENTICATION=1 -DLIBDIR=\"/usr/local/libmesos\" -DPICOJSON_USE_INT64 -DPKGDATADIR=\"/usr/local/share/mesos\" -DPKGLIBEXECDIR=\"/usr/local/libexec/mesos\" -DVERSION=\"1.2.0\" -D__STDC_FORMAT_MACROS -O2 -std=c++11 -g -fPIE -I/mesos/3rdparty/libprocess/src/tests/.. -I/mesos/3rdparty/stout/include -I/usr/include/apr-1.0 -I/mesos/build/3rdparty/boost-1.53.0/src/boost-1.53.0 -I/mesos/build/3rdparty/elfio-3.2/src/elfio-3.2 -I/mesos/build/3rdparty/glog-0.3.3/src/glog-0.3.3-lib/lib/include -I/mesos/build/3rdparty/nvml-352.79/src/nvml-352.79 -I/mesos/build/3rdparty/picojson-1.3.0/src/picojson-1.3.0 -I/mesos/build/3rdparty/protobuf-2.6.1/src/protobuf-2.6.1-lib/lib/include -I/usr/include/subversion-1 -I/mesos/3rdparty/libprocess/src/tests/src -I/mesos/3rdparty/libprocess/include -I/mesos/build/3rdparty/http_parser-2.6.2/src/http_parser-2.6.2 -I/mesos/build/3rdparty/libev-4.22/src/libev-4.22 -I/mesos/build/3rdparty/gmock-1.7.0/src/gmock-1.7.0/include -I/mesos/build/3rdparty/gmock-1.7.0/src/gmock-1.7.0/gtest/include    -o CMakeFiles/process_tests.dir/decoder_tests.cpp.o -c /mesos/3rdparty/libprocess/src/tests/decoder_tests.cpp
/usr/bin/cmake -E cmake_progress_report /mesos/build/CMakeFiles 
[ 40%] Building CXX object 3rdparty/libprocess/src/tests/CMakeFiles/process_tests.dir/encoder_tests.cpp.o
cd /mesos/build/3rdparty/libprocess/src/tests && /usr/bin/g++   -DBUILD_DIR=\"/mesos/build/3rdparty/libprocess/src/tests\" -DHAS_AUTHENTICATION=1 -DLIBDIR=\"/usr/local/libmesos\" -DPICOJSON_USE_INT64 -DPKGDATADIR=\"/usr/local/share/mesos\" -DPKGLIBEXECDIR=\"/usr/local/libexec/mesos\" -DVERSION=\"1.2.0\" -D__STDC_FORMAT_MACROS -O2 -std=c++11 -g -fPIE -I/mesos/3rdparty/libprocess/src/tests/.. -I/mesos/3rdparty/stout/include -I/usr/include/apr-1.0 -I/mesos/build/3rdparty/boost-1.53.0/src/boost-1.53.0 -I/mesos/build/3rdparty/elfio-3.2/src/elfio-3.2 -I/mesos/build/3rdparty/glog-0.3.3/src/glog-0.3.3-lib/lib/include -I/mesos/build/3rdparty/nvml-352.79/src/nvml-352.79 -I/mesos/build/3rdparty/picojson-1.3.0/src/picojson-1.3.0 -I/mesos/build/3rdparty/protobuf-2.6.1/src/protobuf-2.6.1-lib/lib/include -I/usr/include/subversion-1 -I/mesos/3rdparty/libprocess/src/tests/src -I/mesos/3rdparty/libprocess/include -I/mesos/build/3rdparty/http_parser-2.6.2/src/http_parser-2.6.2 -I/mesos/build/3rdparty/libev-4.22/src/libev-4.22 -I/mesos/build/3rdparty/gmock-1.7.0/src/gmock-1.7.0/include -I/mesos/build/3rdparty/gmock-1.7.0/src/gmock-1.7.0/gtest/include    -o CMakeFiles/process_tests.dir/encoder_tests.cpp.o -c /mesos/3rdparty/libprocess/src/tests/encoder_tests.cpp
/usr/bin/cmake -E cmake_progress_report /mesos/build/CMakeFiles 
[ 40%] Building CXX object src/CMakeFiles/mesos-1.2.0.dir/slave/qos_controllers/noop.cpp.o
cd /mesos/build/src && /usr/bin/g++   -DBUILD_DATE="\"2016-3-3 10:20\"" -DBUILD_FLAGS=\"\" -DBUILD_JAVA_JVM_LIBRARY=\"\" -DBUILD_TIME=\"1111100\" -DBUILD_USER=\"frank\" -DHAS_AUTHENTICATION=1 -DLIBDIR=\"/usr/local/libmesos\" -DPICOJSON_USE_INT64 -DPKGDATADIR=\"/usr/local/share/mesos\" -DPKGLIBEXECDIR=\"/usr/local/libexec/mesos\" -DUSE_STATIC_LIB -DVERSION=\"1.2.0\" -D__STDC_FORMAT_MACROS -Dmesos_1_2_0_EXPORTS -O2 -std=c++11 -g -fPIC -I/mesos/build/include -I/mesos/build/include/mesos -I/mesos/build/src -I/mesos/src -I/mesos/build/3rdparty/protobuf-2.6.1/src/protobuf-2.6.1-lib/lib/include -I/mesos/include -I/mesos/3rdparty/stout/include -I/usr/include/apr-1.0 -I/mesos/build/3rdparty/boost-1.53.0/src/boost-1.53.0 -I/mesos/build/3rdparty/elfio-3.2/src/elfio-3.2 -I/mesos/build/3rdparty/glog-0.3.3/src/glog-0.3.3-lib/lib/include -I/mesos/build/3rdparty/nvml-352.79/src/nvml-352.79 -I/mesos/build/3rdparty/picojson-1.3.0/src/picojson-1.3.0 -I/usr/include/subversion-1 -I/mesos/src/src -I/mesos/3rdparty/libprocess/include -I/mesos/build/3rdparty/http_parser-2.6.2/src/http_parser-2.6.2 -I/mesos/build/3rdparty/libev-4.22/src/libev-4.22 -I/mesos/build/3rdparty/zookeeper-3.4.8/src/zookeeper-3.4.8/src/c/include -I/mesos/build/3rdparty/zookeeper-3.4.8/src/zookeeper-3.4.8/src/c/generated -I/mesos/build/3rdparty/leveldb-1.4/src/leveldb-1.4/include    -o CMakeFiles/mesos-1.2.0.dir/slave/qos_controllers/noop.cpp.o -c /mesos/src/slave/qos_controllers/noop.cpp
/usr/bin/cmake -E cmake_progress_report /mesos/build/CMakeFiles 
[ 40%] Building CXX object src/CMakeFiles/mesos-1.2.0.dir/slave/resource_estimator.cpp.o
cd /mesos/build/src && /usr/bin/g++   -DBUILD_DATE="\"2016-3-3 10:20\"" -DBUILD_FLAGS=\"\" -DBUILD_JAVA_JVM_LIBRARY=\"\" -DBUILD_TIME=\"1111100\" -DBUILD_USER=\"frank\" -DHAS_AUTHENTICATION=1 -DLIBDIR=\"/usr/local/libmesos\" -DPICOJSON_USE_INT64 -DPKGDATADIR=\"/usr/local/share/mesos\" -DPKGLIBEXECDIR=\"/usr/local/libexec/mesos\" -DUSE_STATIC_LIB -DVERSION=\"1.2.0\" -D__STDC_FORMAT_MACROS -Dmesos_1_2_0_EXPORTS -O2 -std=c++11 -g -fPIC -I/mesos/build/include -I/mesos/build/include/mesos -I/mesos/build/src -I/mesos/src -I/mesos/build/3rdparty/protobuf-2.6.1/src/protobuf-2.6.1-lib/lib/include -I/mesos/include -I/mesos/3rdparty/stout/include -I/usr/include/apr-1.0 -I/mesos/build/3rdparty/boost-1.53.0/src/boost-1.53.0 -I/mesos/build/3rdparty/elfio-3.2/src/elfio-3.2 -I/mesos/build/3rdparty/glog-0.3.3/src/glog-0.3.3-lib/lib/include -I/mesos/build/3rdparty/nvml-352.79/src/nvml-352.79 -I/mesos/build/3rdparty/picojson-1.3.0/src/picojson-1.3.0 -I/usr/include/subversion-1 -I/mesos/src/src -I/mesos/3rdparty/libprocess/include -I/mesos/build/3rdparty/http_parser-2.6.2/src/http_parser-2.6.2 -I/mesos/build/3rdparty/libev-4.22/src/libev-4.22 -I/mesos/build/3rdparty/zookeeper-3.4.8/src/zookeeper-3.4.8/src/c/include -I/mesos/build/3rdparty/zookeeper-3.4.8/src/zookeeper-3.4.8/src/c/generated -I/mesos/build/3rdparty/leveldb-1.4/src/leveldb-1.4/include    -o CMakeFiles/mesos-1.2.0.dir/slave/resource_estimator.cpp.o -c /mesos/src/slave/resource_estimator.cpp
/usr/bin/cmake -E cmake_progress_report /mesos/build/CMakeFiles 
[ 40%] Building CXX object src/CMakeFiles/mesos-1.2.0.dir/slave/slave.cpp.o
cd /mesos/build/src && /usr/bin/g++   -DBUILD_DATE="\"2016-3-3 10:20\"" -DBUILD_FLAGS=\"\" -DBUILD_JAVA_JVM_LIBRARY=\"\" -DBUILD_TIME=\"1111100\" -DBUILD_USER=\"frank\" -DHAS_AUTHENTICATION=1 -DLIBDIR=\"/usr/local/libmesos\" -DPICOJSON_USE_INT64 -DPKGDATADIR=\"/usr/local/share/mesos\" -DPKGLIBEXECDIR=\"/usr/local/libexec/mesos\" -DUSE_STATIC_LIB -DVERSION=\"1.2.0\" -D__STDC_FORMAT_MACROS -Dmesos_1_2_0_EXPORTS -O2 -std=c++11 -g -fPIC -I/mesos/build/include -I/mesos/build/include/mesos -I/mesos/build/src -I/mesos/src -I/mesos/build/3rdparty/protobuf-2.6.1/src/protobuf-2.6.1-lib/lib/include -I/mesos/include -I/mesos/3rdparty/stout/include -I/usr/include/apr-1.0 -I/mesos/build/3rdparty/boost-1.53.0/src/boost-1.53.0 -I/mesos/build/3rdparty/elfio-3.2/src/elfio-3.2 -I/mesos/build/3rdparty/glog-0.3.3/src/glog-0.3.3-lib/lib/include -I/mesos/build/3rdparty/nvml-352.79/src/nvml-352.79 -I/mesos/build/3rdparty/picojson-1.3.0/src/picojson-1.3.0 -I/usr/include/subversion-1 -I/mesos/src/src -I/mesos/3rdparty/libprocess/include -I/mesos/build/3rdparty/http_parser-2.6.2/src/http_parser-2.6.2 -I/mesos/build/3rdparty/libev-4.22/src/libev-4.22 -I/mesos/build/3rdparty/zookeeper-3.4.8/src/zookeeper-3.4.8/src/c/include -I/mesos/build/3rdparty/zookeeper-3.4.8/src/zookeeper-3.4.8/src/c/generated -I/mesos/build/3rdparty/leveldb-1.4/src/leveldb-1.4/include    -o CMakeFiles/mesos-1.2.0.dir/slave/slave.cpp.o -c /mesos/src/slave/slave.cpp
/usr/bin/cmake -E cmake_progress_report /mesos/build/CMakeFiles 13
[ 41%] Building CXX object src/CMakeFiles/mesos-1.2.0.dir/slave/state.cpp.o
cd /mesos/build/src && /usr/bin/g++   -DBUILD_DATE="\"2016-3-3 10:20\"" -DBUILD_FLAGS=\"\" -DBUILD_JAVA_JVM_LIBRARY=\"\" -DBUILD_TIME=\"1111100\" -DBUILD_USER=\"frank\" -DHAS_AUTHENTICATION=1 -DLIBDIR=\"/usr/local/libmesos\" -DPICOJSON_USE_INT64 -DPKGDATADIR=\"/usr/local/share/mesos\" -DPKGLIBEXECDIR=\"/usr/local/libexec/mesos\" -DUSE_STATIC_LIB -DVERSION=\"1.2.0\" -D__STDC_FORMAT_MACROS -Dmesos_1_2_0_EXPORTS -O2 -std=c++11 -g -fPIC -I/mesos/build/include -I/mesos/build/include/mesos -I/mesos/build/src -I/mesos/src -I/mesos/build/3rdparty/protobuf-2.6.1/src/protobuf-2.6.1-lib/lib/include -I/mesos/include -I/mesos/3rdparty/stout/include -I/usr/include/apr-1.0 -I/mesos/build/3rdparty/boost-1.53.0/src/boost-1.53.0 -I/mesos/build/3rdparty/elfio-3.2/src/elfio-3.2 -I/mesos/build/3rdparty/glog-0.3.3/src/glog-0.3.3-lib/lib/include -I/mesos/build/3rdparty/nvml-352.79/src/nvml-352.79 -I/mesos/build/3rdparty/picojson-1.3.0/src/picojson-1.3.0 -I/usr/include/subversion-1 -I/mesos/src/src -I/mesos/3rdparty/libprocess/include -I/mesos/build/3rdparty/http_parser-2.6.2/src/http_parser-2.6.2 -I/mesos/build/3rdparty/libev-4.22/src/libev-4.22 -I/mesos/build/3rdparty/zookeeper-3.4.8/src/zookeeper-3.4.8/src/c/include -I/mesos/build/3rdparty/zookeeper-3.4.8/src/zookeeper-3.4.8/src/c/generated -I/mesos/build/3rdparty/leveldb-1.4/src/leveldb-1.4/include    -o CMakeFiles/mesos-1.2.0.dir/slave/state.cpp.o -c /mesos/src/slave/state.cpp
/usr/bin/cmake -E cmake_progress_report /mesos/build/CMakeFiles 
[ 41%] Building CXX object 3rdparty/libprocess/src/tests/CMakeFiles/process_tests.dir/future_tests.cpp.o
cd /mesos/build/3rdparty/libprocess/src/tests && /usr/bin/g++   -DBUILD_DIR=\"/mesos/build/3rdparty/libprocess/src/tests\" -DHAS_AUTHENTICATION=1 -DLIBDIR=\"/usr/local/libmesos\" -DPICOJSON_USE_INT64 -DPKGDATADIR=\"/usr/local/share/mesos\" -DPKGLIBEXECDIR=\"/usr/local/libexec/mesos\" -DVERSION=\"1.2.0\" -D__STDC_FORMAT_MACROS -O2 -std=c++11 -g -fPIE -I/mesos/3rdparty/libprocess/src/tests/.. -I/mesos/3rdparty/stout/include -I/usr/include/apr-1.0 -I/mesos/build/3rdparty/boost-1.53.0/src/boost-1.53.0 -I/mesos/build/3rdparty/elfio-3.2/src/elfio-3.2 -I/mesos/build/3rdparty/glog-0.3.3/src/glog-0.3.3-lib/lib/include -I/mesos/build/3rdparty/nvml-352.79/src/nvml-352.79 -I/mesos/build/3rdparty/picojson-1.3.0/src/picojson-1.3.0 -I/mesos/build/3rdparty/protobuf-2.6.1/src/protobuf-2.6.1-lib/lib/include -I/usr/include/subversion-1 -I/mesos/3rdparty/libprocess/src/tests/src -I/mesos/3rdparty/libprocess/include -I/mesos/build/3rdparty/http_parser-2.6.2/src/http_parser-2.6.2 -I/mesos/build/3rdparty/libev-4.22/src/libev-4.22 -I/mesos/build/3rdparty/gmock-1.7.0/src/gmock-1.7.0/include -I/mesos/build/3rdparty/gmock-1.7.0/src/gmock-1.7.0/gtest/include    -o CMakeFiles/process_tests.dir/future_tests.cpp.o -c /mesos/3rdparty/libprocess/src/tests/future_tests.cpp
/usr/bin/cmake -E cmake_progress_report /mesos/build/CMakeFiles 
[ 41%] Building CXX object 3rdparty/libprocess/src/tests/CMakeFiles/process_tests.dir/http_tests.cpp.o
cd /mesos/build/3rdparty/libprocess/src/tests && /usr/bin/g++   -DBUILD_DIR=\"/mesos/build/3rdparty/libprocess/src/tests\" -DHAS_AUTHENTICATION=1 -DLIBDIR=\"/usr/local/libmesos\" -DPICOJSON_USE_INT64 -DPKGDATADIR=\"/usr/local/share/mesos\" -DPKGLIBEXECDIR=\"/usr/local/libexec/mesos\" -DVERSION=\"1.2.0\" -D__STDC_FORMAT_MACROS -O2 -std=c++11 -g -fPIE -I/mesos/3rdparty/libprocess/src/tests/.. -I/mesos/3rdparty/stout/include -I/usr/include/apr-1.0 -I/mesos/build/3rdparty/boost-1.53.0/src/boost-1.53.0 -I/mesos/build/3rdparty/elfio-3.2/src/elfio-3.2 -I/mesos/build/3rdparty/glog-0.3.3/src/glog-0.3.3-lib/lib/include -I/mesos/build/3rdparty/nvml-352.79/src/nvml-352.79 -I/mesos/build/3rdparty/picojson-1.3.0/src/picojson-1.3.0 -I/mesos/build/3rdparty/protobuf-2.6.1/src/protobuf-2.6.1-lib/lib/include -I/usr/include/subversion-1 -I/mesos/3rdparty/libprocess/src/tests/src -I/mesos/3rdparty/libprocess/include -I/mesos/build/3rdparty/http_parser-2.6.2/src/http_parser-2.6.2 -I/mesos/build/3rdparty/libev-4.22/src/libev-4.22 -I/mesos/build/3rdparty/gmock-1.7.0/src/gmock-1.7.0/include -I/mesos/build/3rdparty/gmock-1.7.0/src/gmock-1.7.0/gtest/include    -o CMakeFiles/process_tests.dir/http_tests.cpp.o -c /mesos/3rdparty/libprocess/src/tests/http_tests.cpp
/usr/bin/cmake -E cmake_progress_report /mesos/build/CMakeFiles 
[ 41%] Building CXX object src/CMakeFiles/mesos-1.2.0.dir/slave/status_update_manager.cpp.o
cd /mesos/build/src && /usr/bin/g++   -DBUILD_DATE="\"2016-3-3 10:20\"" -DBUILD_FLAGS=\"\" -DBUILD_JAVA_JVM_LIBRARY=\"\" -DBUILD_TIME=\"1111100\" -DBUILD_USER=\"frank\" -DHAS_AUTHENTICATION=1 -DLIBDIR=\"/usr/local/libmesos\" -DPICOJSON_USE_INT64 -DPKGDATADIR=\"/usr/local/share/mesos\" -DPKGLIBEXECDIR=\"/usr/local/libexec/mesos\" -DUSE_STATIC_LIB -DVERSION=\"1.2.0\" -D__STDC_FORMAT_MACROS -Dmesos_1_2_0_EXPORTS -O2 -std=c++11 -g -fPIC -I/mesos/build/include -I/mesos/build/include/mesos -I/mesos/build/src -I/mesos/src -I/mesos/build/3rdparty/protobuf-2.6.1/src/protobuf-2.6.1-lib/lib/include -I/mesos/include -I/mesos/3rdparty/stout/include -I/usr/include/apr-1.0 -I/mesos/build/3rdparty/boost-1.53.0/src/boost-1.53.0 -I/mesos/build/3rdparty/elfio-3.2/src/elfio-3.2 -I/mesos/build/3rdparty/glog-0.3.3/src/glog-0.3.3-lib/lib/include -I/mesos/build/3rdparty/nvml-352.79/src/nvml-352.79 -I/mesos/build/3rdparty/picojson-1.3.0/src/picojson-1.3.0 -I/usr/include/subversion-1 -I/mesos/src/src -I/mesos/3rdparty/libprocess/include -I/mesos/build/3rdparty/http_parser-2.6.2/src/http_parser-2.6.2 -I/mesos/build/3rdparty/libev-4.22/src/libev-4.22 -I/mesos/build/3rdparty/zookeeper-3.4.8/src/zookeeper-3.4.8/src/c/include -I/mesos/build/3rdparty/zookeeper-3.4.8/src/zookeeper-3.4.8/src/c/generated -I/mesos/build/3rdparty/leveldb-1.4/src/leveldb-1.4/include    -o CMakeFiles/mesos-1.2.0.dir/slave/status_update_manager.cpp.o -c /mesos/src/slave/status_update_manager.cpp
/usr/bin/cmake -E cmake_progress_report /mesos/build/CMakeFiles 
[ 41%] Building CXX object src/CMakeFiles/mesos-1.2.0.dir/slave/validation.cpp.o
cd /mesos/build/src && /usr/bin/g++   -DBUILD_DATE="\"2016-3-3 10:20\"" -DBUILD_FLAGS=\"\" -DBUILD_JAVA_JVM_LIBRARY=\"\" -DBUILD_TIME=\"1111100\" -DBUILD_USER=\"frank\" -DHAS_AUTHENTICATION=1 -DLIBDIR=\"/usr/local/libmesos\" -DPICOJSON_USE_INT64 -DPKGDATADIR=\"/usr/local/share/mesos\" -DPKGLIBEXECDIR=\"/usr/local/libexec/mesos\" -DUSE_STATIC_LIB -DVERSION=\"1.2.0\" -D__STDC_FORMAT_MACROS -Dmesos_1_2_0_EXPORTS -O2 -std=c++11 -g -fPIC -I/mesos/build/include -I/mesos/build/include/mesos -I/mesos/build/src -I/mesos/src -I/mesos/build/3rdparty/protobuf-2.6.1/src/protobuf-2.6.1-lib/lib/include -I/mesos/include -I/mesos/3rdparty/stout/include -I/usr/include/apr-1.0 -I/mesos/build/3rdparty/boost-1.53.0/src/boost-1.53.0 -I/mesos/build/3rdparty/elfio-3.2/src/elfio-3.2 -I/mesos/build/3rdparty/glog-0.3.3/src/glog-0.3.3-lib/lib/include -I/mesos/build/3rdparty/nvml-352.79/src/nvml-352.79 -I/mesos/build/3rdparty/picojson-1.3.0/src/picojson-1.3.0 -I/usr/include/subversion-1 -I/mesos/src/src -I/mesos/3rdparty/libprocess/include -I/mesos/build/3rdparty/http_parser-2.6.2/src/http_parser-2.6.2 -I/mesos/build/3rdparty/libev-4.22/src/libev-4.22 -I/mesos/build/3rdparty/zookeeper-3.4.8/src/zookeeper-3.4.8/src/c/include -I/mesos/build/3rdparty/zookeeper-3.4.8/src/zookeeper-3.4.8/src/c/generated -I/mesos/build/3rdparty/leveldb-1.4/src/leveldb-1.4/include    -o CMakeFiles/mesos-1.2.0.dir/slave/validation.cpp.o -c /mesos/src/slave/validation.cpp
/usr/bin/cmake -E cmake_progress_report /mesos/build/CMakeFiles 
[ 41%] Building CXX object src/CMakeFiles/mesos-1.2.0.dir/slave/container_loggers/sandbox.cpp.o
cd /mesos/build/src && /usr/bin/g++   -DBUILD_DATE="\"2016-3-3 10:20\"" -DBUILD_FLAGS=\"\" -DBUILD_JAVA_JVM_LIBRARY=\"\" -DBUILD_TIME=\"1111100\" -DBUILD_USER=\"frank\" -DHAS_AUTHENTICATION=1 -DLIBDIR=\"/usr/local/libmesos\" -DPICOJSON_USE_INT64 -DPKGDATADIR=\"/usr/local/share/mesos\" -DPKGLIBEXECDIR=\"/usr/local/libexec/mesos\" -DUSE_STATIC_LIB -DVERSION=\"1.2.0\" -D__STDC_FORMAT_MACROS -Dmesos_1_2_0_EXPORTS -O2 -std=c++11 -g -fPIC -I/mesos/build/include -I/mesos/build/include/mesos -I/mesos/build/src -I/mesos/src -I/mesos/build/3rdparty/protobuf-2.6.1/src/protobuf-2.6.1-lib/lib/include -I/mesos/include -I/mesos/3rdparty/stout/include -I/usr/include/apr-1.0 -I/mesos/build/3rdparty/boost-1.53.0/src/boost-1.53.0 -I/mesos/build/3rdparty/elfio-3.2/src/elfio-3.2 -I/mesos/build/3rdparty/glog-0.3.3/src/glog-0.3.3-lib/lib/include -I/mesos/build/3rdparty/nvml-352.79/src/nvml-352.79 -I/mesos/build/3rdparty/picojson-1.3.0/src/picojson-1.3.0 -I/usr/include/subversion-1 -I/mesos/src/src -I/mesos/3rdparty/libprocess/include -I/mesos/build/3rdparty/http_parser-2.6.2/src/http_parser-2.6.2 -I/mesos/build/3rdparty/libev-4.22/src/libev-4.22 -I/mesos/build/3rdparty/zookeeper-3.4.8/src/zookeeper-3.4.8/src/c/include -I/mesos/build/3rdparty/zookeeper-3.4.8/src/zookeeper-3.4.8/src/c/generated -I/mesos/build/3rdparty/leveldb-1.4/src/leveldb-1.4/include    -o CMakeFiles/mesos-1.2.0.dir/slave/container_loggers/sandbox.cpp.o -c /mesos/src/slave/container_loggers/sandbox.cpp
/usr/bin/cmake -E cmake_progress_report /mesos/build/CMakeFiles 
[ 41%] Building CXX object src/CMakeFiles/mesos-1.2.0.dir/slave/containerizer/composing.cpp.o
cd /mesos/build/src && /usr/bin/g++   -DBUILD_DATE="\"2016-3-3 10:20\"" -DBUILD_FLAGS=\"\" -DBUILD_JAVA_JVM_LIBRARY=\"\" -DBUILD_TIME=\"1111100\" -DBUILD_USER=\"frank\" -DHAS_AUTHENTICATION=1 -DLIBDIR=\"/usr/local/libmesos\" -DPICOJSON_USE_INT64 -DPKGDATADIR=\"/usr/local/share/mesos\" -DPKGLIBEXECDIR=\"/usr/local/libexec/mesos\" -DUSE_STATIC_LIB -DVERSION=\"1.2.0\" -D__STDC_FORMAT_MACROS -Dmesos_1_2_0_EXPORTS -O2 -std=c++11 -g -fPIC -I/mesos/build/include -I/mesos/build/include/mesos -I/mesos/build/src -I/mesos/src -I/mesos/build/3rdparty/protobuf-2.6.1/src/protobuf-2.6.1-lib/lib/include -I/mesos/include -I/mesos/3rdparty/stout/include -I/usr/include/apr-1.0 -I/mesos/build/3rdparty/boost-1.53.0/src/boost-1.53.0 -I/mesos/build/3rdparty/elfio-3.2/src/elfio-3.2 -I/mesos/build/3rdparty/glog-0.3.3/src/glog-0.3.3-lib/lib/include -I/mesos/build/3rdparty/nvml-352.79/src/nvml-352.79 -I/mesos/build/3rdparty/picojson-1.3.0/src/picojson-1.3.0 -I/usr/include/subversion-1 -I/mesos/src/src -I/mesos/3rdparty/libprocess/include -I/mesos/build/3rdparty/http_parser-2.6.2/src/http_parser-2.6.2 -I/mesos/build/3rdparty/libev-4.22/src/libev-4.22 -I/mesos/build/3rdparty/zookeeper-3.4.8/src/zookeeper-3.4.8/src/c/include -I/mesos/build/3rdparty/zookeeper-3.4.8/src/zookeeper-3.4.8/src/c/generated -I/mesos/build/3rdparty/leveldb-1.4/src/leveldb-1.4/include    -o CMakeFiles/mesos-1.2.0.dir/slave/containerizer/composing.cpp.o -c /mesos/src/slave/containerizer/composing.cpp
/usr/bin/cmake -E cmake_progress_report /mesos/build/CMakeFiles 
[ 41%] Building CXX object src/CMakeFiles/mesos-1.2.0.dir/slave/containerizer/containerizer.cpp.o
cd /mesos/build/src && /usr/bin/g++   -DBUILD_DATE="\"2016-3-3 10:20\"" -DBUILD_FLAGS=\"\" -DBUILD_JAVA_JVM_LIBRARY=\"\" -DBUILD_TIME=\"1111100\" -DBUILD_USER=\"frank\" -DHAS_AUTHENTICATION=1 -DLIBDIR=\"/usr/local/libmesos\" -DPICOJSON_USE_INT64 -DPKGDATADIR=\"/usr/local/share/mesos\" -DPKGLIBEXECDIR=\"/usr/local/libexec/mesos\" -DUSE_STATIC_LIB -DVERSION=\"1.2.0\" -D__STDC_FORMAT_MACROS -Dmesos_1_2_0_EXPORTS -O2 -std=c++11 -g -fPIC -I/mesos/build/include -I/mesos/build/include/mesos -I/mesos/build/src -I/mesos/src -I/mesos/build/3rdparty/protobuf-2.6.1/src/protobuf-2.6.1-lib/lib/include -I/mesos/include -I/mesos/3rdparty/stout/include -I/usr/include/apr-1.0 -I/mesos/build/3rdparty/boost-1.53.0/src/boost-1.53.0 -I/mesos/build/3rdparty/elfio-3.2/src/elfio-3.2 -I/mesos/build/3rdparty/glog-0.3.3/src/glog-0.3.3-lib/lib/include -I/mesos/build/3rdparty/nvml-352.79/src/nvml-352.79 -I/mesos/build/3rdparty/picojson-1.3.0/src/picojson-1.3.0 -I/usr/include/subversion-1 -I/mesos/src/src -I/mesos/3rdparty/libprocess/include -I/mesos/build/3rdparty/http_parser-2.6.2/src/http_parser-2.6.2 -I/mesos/build/3rdparty/libev-4.22/src/libev-4.22 -I/mesos/build/3rdparty/zookeeper-3.4.8/src/zookeeper-3.4.8/src/c/include -I/mesos/build/3rdparty/zookeeper-3.4.8/src/zookeeper-3.4.8/src/c/generated -I/mesos/build/3rdparty/leveldb-1.4/src/leveldb-1.4/include    -o CMakeFiles/mesos-1.2.0.dir/slave/containerizer/containerizer.cpp.o -c /mesos/src/slave/containerizer/containerizer.cpp
/usr/bin/cmake -E cmake_progress_report /mesos/build/CMakeFiles 14
[ 42%] Building CXX object src/CMakeFiles/mesos-1.2.0.dir/slave/containerizer/docker.cpp.o
cd /mesos/build/src && /usr/bin/g++   -DBUILD_DATE="\"2016-3-3 10:20\"" -DBUILD_FLAGS=\"\" -DBUILD_JAVA_JVM_LIBRARY=\"\" -DBUILD_TIME=\"1111100\" -DBUILD_USER=\"frank\" -DHAS_AUTHENTICATION=1 -DLIBDIR=\"/usr/local/libmesos\" -DPICOJSON_USE_INT64 -DPKGDATADIR=\"/usr/local/share/mesos\" -DPKGLIBEXECDIR=\"/usr/local/libexec/mesos\" -DUSE_STATIC_LIB -DVERSION=\"1.2.0\" -D__STDC_FORMAT_MACROS -Dmesos_1_2_0_EXPORTS -O2 -std=c++11 -g -fPIC -I/mesos/build/include -I/mesos/build/include/mesos -I/mesos/build/src -I/mesos/src -I/mesos/build/3rdparty/protobuf-2.6.1/src/protobuf-2.6.1-lib/lib/include -I/mesos/include -I/mesos/3rdparty/stout/include -I/usr/include/apr-1.0 -I/mesos/build/3rdparty/boost-1.53.0/src/boost-1.53.0 -I/mesos/build/3rdparty/elfio-3.2/src/elfio-3.2 -I/mesos/build/3rdparty/glog-0.3.3/src/glog-0.3.3-lib/lib/include -I/mesos/build/3rdparty/nvml-352.79/src/nvml-352.79 -I/mesos/build/3rdparty/picojson-1.3.0/src/picojson-1.3.0 -I/usr/include/subversion-1 -I/mesos/src/src -I/mesos/3rdparty/libprocess/include -I/mesos/build/3rdparty/http_parser-2.6.2/src/http_parser-2.6.2 -I/mesos/build/3rdparty/libev-4.22/src/libev-4.22 -I/mesos/build/3rdparty/zookeeper-3.4.8/src/zookeeper-3.4.8/src/c/include -I/mesos/build/3rdparty/zookeeper-3.4.8/src/zookeeper-3.4.8/src/c/generated -I/mesos/build/3rdparty/leveldb-1.4/src/leveldb-1.4/include    -o CMakeFiles/mesos-1.2.0.dir/slave/containerizer/docker.cpp.o -c /mesos/src/slave/containerizer/docker.cpp
/usr/bin/cmake -E cmake_progress_report /mesos/build/CMakeFiles 83
[ 43%] Building CXX object 3rdparty/libprocess/src/tests/CMakeFiles/process_tests.dir/limiter_tests.cpp.o
cd /mesos/build/3rdparty/libprocess/src/tests && /usr/bin/g++   -DBUILD_DIR=\"/mesos/build/3rdparty/libprocess/src/tests\" -DHAS_AUTHENTICATION=1 -DLIBDIR=\"/usr/local/libmesos\" -DPICOJSON_USE_INT64 -DPKGDATADIR=\"/usr/local/share/mesos\" -DPKGLIBEXECDIR=\"/usr/local/libexec/mesos\" -DVERSION=\"1.2.0\" -D__STDC_FORMAT_MACROS -O2 -std=c++11 -g -fPIE -I/mesos/3rdparty/libprocess/src/tests/.. -I/mesos/3rdparty/stout/include -I/usr/include/apr-1.0 -I/mesos/build/3rdparty/boost-1.53.0/src/boost-1.53.0 -I/mesos/build/3rdparty/elfio-3.2/src/elfio-3.2 -I/mesos/build/3rdparty/glog-0.3.3/src/glog-0.3.3-lib/lib/include -I/mesos/build/3rdparty/nvml-352.79/src/nvml-352.79 -I/mesos/build/3rdparty/picojson-1.3.0/src/picojson-1.3.0 -I/mesos/build/3rdparty/protobuf-2.6.1/src/protobuf-2.6.1-lib/lib/include -I/usr/include/subversion-1 -I/mesos/3rdparty/libprocess/src/tests/src -I/mesos/3rdparty/libprocess/include -I/mesos/build/3rdparty/http_parser-2.6.2/src/http_parser-2.6.2 -I/mesos/build/3rdparty/libev-4.22/src/libev-4.22 -I/mesos/build/3rdparty/gmock-1.7.0/src/gmock-1.7.0/include -I/mesos/build/3rdparty/gmock-1.7.0/src/gmock-1.7.0/gtest/include    -o CMakeFiles/process_tests.dir/limiter_tests.cpp.o -c /mesos/3rdparty/libprocess/src/tests/limiter_tests.cpp
/usr/bin/cmake -E cmake_progress_report /mesos/build/CMakeFiles 
[ 43%] Building CXX object 3rdparty/libprocess/src/tests/CMakeFiles/process_tests.dir/loop_tests.cpp.o
cd /mesos/build/3rdparty/libprocess/src/tests && /usr/bin/g++   -DBUILD_DIR=\"/mesos/build/3rdparty/libprocess/src/tests\" -DHAS_AUTHENTICATION=1 -DLIBDIR=\"/usr/local/libmesos\" -DPICOJSON_USE_INT64 -DPKGDATADIR=\"/usr/local/share/mesos\" -DPKGLIBEXECDIR=\"/usr/local/libexec/mesos\" -DVERSION=\"1.2.0\" -D__STDC_FORMAT_MACROS -O2 -std=c++11 -g -fPIE -I/mesos/3rdparty/libprocess/src/tests/.. -I/mesos/3rdparty/stout/include -I/usr/include/apr-1.0 -I/mesos/build/3rdparty/boost-1.53.0/src/boost-1.53.0 -I/mesos/build/3rdparty/elfio-3.2/src/elfio-3.2 -I/mesos/build/3rdparty/glog-0.3.3/src/glog-0.3.3-lib/lib/include -I/mesos/build/3rdparty/nvml-352.79/src/nvml-352.79 -I/mesos/build/3rdparty/picojson-1.3.0/src/picojson-1.3.0 -I/mesos/build/3rdparty/protobuf-2.6.1/src/protobuf-2.6.1-lib/lib/include -I/usr/include/subversion-1 -I/mesos/3rdparty/libprocess/src/tests/src -I/mesos/3rdparty/libprocess/include -I/mesos/build/3rdparty/http_parser-2.6.2/src/http_parser-2.6.2 -I/mesos/build/3rdparty/libev-4.22/src/libev-4.22 -I/mesos/build/3rdparty/gmock-1.7.0/src/gmock-1.7.0/include -I/mesos/build/3rdparty/gmock-1.7.0/src/gmock-1.7.0/gtest/include    -o CMakeFiles/process_tests.dir/loop_tests.cpp.o -c /mesos/3rdparty/libprocess/src/tests/loop_tests.cpp
/usr/bin/cmake -E cmake_progress_report /mesos/build/CMakeFiles 
[ 43%] Building CXX object src/CMakeFiles/mesos-1.2.0.dir/slave/containerizer/fetcher.cpp.o
cd /mesos/build/src && /usr/bin/g++   -DBUILD_DATE="\"2016-3-3 10:20\"" -DBUILD_FLAGS=\"\" -DBUILD_JAVA_JVM_LIBRARY=\"\" -DBUILD_TIME=\"1111100\" -DBUILD_USER=\"frank\" -DHAS_AUTHENTICATION=1 -DLIBDIR=\"/usr/local/libmesos\" -DPICOJSON_USE_INT64 -DPKGDATADIR=\"/usr/local/share/mesos\" -DPKGLIBEXECDIR=\"/usr/local/libexec/mesos\" -DUSE_STATIC_LIB -DVERSION=\"1.2.0\" -D__STDC_FORMAT_MACROS -Dmesos_1_2_0_EXPORTS -O2 -std=c++11 -g -fPIC -I/mesos/build/include -I/mesos/build/include/mesos -I/mesos/build/src -I/mesos/src -I/mesos/build/3rdparty/protobuf-2.6.1/src/protobuf-2.6.1-lib/lib/include -I/mesos/include -I/mesos/3rdparty/stout/include -I/usr/include/apr-1.0 -I/mesos/build/3rdparty/boost-1.53.0/src/boost-1.53.0 -I/mesos/build/3rdparty/elfio-3.2/src/elfio-3.2 -I/mesos/build/3rdparty/glog-0.3.3/src/glog-0.3.3-lib/lib/include -I/mesos/build/3rdparty/nvml-352.79/src/nvml-352.79 -I/mesos/build/3rdparty/picojson-1.3.0/src/picojson-1.3.0 -I/usr/include/subversion-1 -I/mesos/src/src -I/mesos/3rdparty/libprocess/include -I/mesos/build/3rdparty/http_parser-2.6.2/src/http_parser-2.6.2 -I/mesos/build/3rdparty/libev-4.22/src/libev-4.22 -I/mesos/build/3rdparty/zookeeper-3.4.8/src/zookeeper-3.4.8/src/c/include -I/mesos/build/3rdparty/zookeeper-3.4.8/src/zookeeper-3.4.8/src/c/generated -I/mesos/build/3rdparty/leveldb-1.4/src/leveldb-1.4/include    -o CMakeFiles/mesos-1.2.0.dir/slave/containerizer/fetcher.cpp.o -c /mesos/src/slave/containerizer/fetcher.cpp
/usr/bin/cmake -E cmake_progress_report /mesos/build/CMakeFiles 
[ 43%] Building CXX object src/CMakeFiles/mesos-1.2.0.dir/slave/containerizer/mesos/containerizer.cpp.o
cd /mesos/build/src && /usr/bin/g++   -DBUILD_DATE="\"2016-3-3 10:20\"" -DBUILD_FLAGS=\"\" -DBUILD_JAVA_JVM_LIBRARY=\"\" -DBUILD_TIME=\"1111100\" -DBUILD_USER=\"frank\" -DHAS_AUTHENTICATION=1 -DLIBDIR=\"/usr/local/libmesos\" -DPICOJSON_USE_INT64 -DPKGDATADIR=\"/usr/local/share/mesos\" -DPKGLIBEXECDIR=\"/usr/local/libexec/mesos\" -DUSE_STATIC_LIB -DVERSION=\"1.2.0\" -D__STDC_FORMAT_MACROS -Dmesos_1_2_0_EXPORTS -O2 -std=c++11 -g -fPIC -I/mesos/build/include -I/mesos/build/include/mesos -I/mesos/build/src -I/mesos/src -I/mesos/build/3rdparty/protobuf-2.6.1/src/protobuf-2.6.1-lib/lib/include -I/mesos/include -I/mesos/3rdparty/stout/include -I/usr/include/apr-1.0 -I/mesos/build/3rdparty/boost-1.53.0/src/boost-1.53.0 -I/mesos/build/3rdparty/elfio-3.2/src/elfio-3.2 -I/mesos/build/3rdparty/glog-0.3.3/src/glog-0.3.3-lib/lib/include -I/mesos/build/3rdparty/nvml-352.79/src/nvml-352.79 -I/mesos/build/3rdparty/picojson-1.3.0/src/picojson-1.3.0 -I/usr/include/subversion-1 -I/mesos/src/src -I/mesos/3rdparty/libprocess/include -I/mesos/build/3rdparty/http_parser-2.6.2/src/http_parser-2.6.2 -I/mesos/build/3rdparty/libev-4.22/src/libev-4.22 -I/mesos/build/3rdparty/zookeeper-3.4.8/src/zookeeper-3.4.8/src/c/include -I/mesos/build/3rdparty/zookeeper-3.4.8/src/zookeeper-3.4.8/src/c/generated -I/mesos/build/3rdparty/leveldb-1.4/src/leveldb-1.4/include    -o CMakeFiles/mesos-1.2.0.dir/slave/containerizer/mesos/containerizer.cpp.o -c /mesos/src/slave/containerizer/mesos/containerizer.cpp
/usr/bin/cmake -E cmake_progress_report /mesos/build/CMakeFiles 
[ 43%] Building CXX object 3rdparty/libprocess/src/tests/CMakeFiles/process_tests.dir/metrics_tests.cpp.o
cd /mesos/build/3rdparty/libprocess/src/tests && /usr/bin/g++   -DBUILD_DIR=\"/mesos/build/3rdparty/libprocess/src/tests\" -DHAS_AUTHENTICATION=1 -DLIBDIR=\"/usr/local/libmesos\" -DPICOJSON_USE_INT64 -DPKGDATADIR=\"/usr/local/share/mesos\" -DPKGLIBEXECDIR=\"/usr/local/libexec/mesos\" -DVERSION=\"1.2.0\" -D__STDC_FORMAT_MACROS -O2 -std=c++11 -g -fPIE -I/mesos/3rdparty/libprocess/src/tests/.. -I/mesos/3rdparty/stout/include -I/usr/include/apr-1.0 -I/mesos/build/3rdparty/boost-1.53.0/src/boost-1.53.0 -I/mesos/build/3rdparty/elfio-3.2/src/elfio-3.2 -I/mesos/build/3rdparty/glog-0.3.3/src/glog-0.3.3-lib/lib/include -I/mesos/build/3rdparty/nvml-352.79/src/nvml-352.79 -I/mesos/build/3rdparty/picojson-1.3.0/src/picojson-1.3.0 -I/mesos/build/3rdparty/protobuf-2.6.1/src/protobuf-2.6.1-lib/lib/include -I/usr/include/subversion-1 -I/mesos/3rdparty/libprocess/src/tests/src -I/mesos/3rdparty/libprocess/include -I/mesos/build/3rdparty/http_parser-2.6.2/src/http_parser-2.6.2 -I/mesos/build/3rdparty/libev-4.22/src/libev-4.22 -I/mesos/build/3rdparty/gmock-1.7.0/src/gmock-1.7.0/include -I/mesos/build/3rdparty/gmock-1.7.0/src/gmock-1.7.0/gtest/include    -o CMakeFiles/process_tests.dir/metrics_tests.cpp.o -c /mesos/3rdparty/libprocess/src/tests/metrics_tests.cpp
/usr/bin/cmake -E cmake_progress_report /mesos/build/CMakeFiles 
[ 43%] Building CXX object 3rdparty/libprocess/src/tests/CMakeFiles/process_tests.dir/mutex_tests.cpp.o
cd /mesos/build/3rdparty/libprocess/src/tests && /usr/bin/g++   -DBUILD_DIR=\"/mesos/build/3rdparty/libprocess/src/tests\" -DHAS_AUTHENTICATION=1 -DLIBDIR=\"/usr/local/libmesos\" -DPICOJSON_USE_INT64 -DPKGDATADIR=\"/usr/local/share/mesos\" -DPKGLIBEXECDIR=\"/usr/local/libexec/mesos\" -DVERSION=\"1.2.0\" -D__STDC_FORMAT_MACROS -O2 -std=c++11 -g -fPIE -I/mesos/3rdparty/libprocess/src/tests/.. -I/mesos/3rdparty/stout/include -I/usr/include/apr-1.0 -I/mesos/build/3rdparty/boost-1.53.0/src/boost-1.53.0 -I/mesos/build/3rdparty/elfio-3.2/src/elfio-3.2 -I/mesos/build/3rdparty/glog-0.3.3/src/glog-0.3.3-lib/lib/include -I/mesos/build/3rdparty/nvml-352.79/src/nvml-352.79 -I/mesos/build/3rdparty/picojson-1.3.0/src/picojson-1.3.0 -I/mesos/build/3rdparty/protobuf-2.6.1/src/protobuf-2.6.1-lib/lib/include -I/usr/include/subversion-1 -I/mesos/3rdparty/libprocess/src/tests/src -I/mesos/3rdparty/libprocess/include -I/mesos/build/3rdparty/http_parser-2.6.2/src/http_parser-2.6.2 -I/mesos/build/3rdparty/libev-4.22/src/libev-4.22 -I/mesos/build/3rdparty/gmock-1.7.0/src/gmock-1.7.0/include -I/mesos/build/3rdparty/gmock-1.7.0/src/gmock-1.7.0/gtest/include    -o CMakeFiles/process_tests.dir/mutex_tests.cpp.o -c /mesos/3rdparty/libprocess/src/tests/mutex_tests.cpp
/usr/bin/cmake -E cmake_progress_report /mesos/build/CMakeFiles 
[ 43%] Building CXX object 3rdparty/libprocess/src/tests/CMakeFiles/process_tests.dir/owned_tests.cpp.o
cd /mesos/build/3rdparty/libprocess/src/tests && /usr/bin/g++   -DBUILD_DIR=\"/mesos/build/3rdparty/libprocess/src/tests\" -DHAS_AUTHENTICATION=1 -DLIBDIR=\"/usr/local/libmesos\" -DPICOJSON_USE_INT64 -DPKGDATADIR=\"/usr/local/share/mesos\" -DPKGLIBEXECDIR=\"/usr/local/libexec/mesos\" -DVERSION=\"1.2.0\" -D__STDC_FORMAT_MACROS -O2 -std=c++11 -g -fPIE -I/mesos/3rdparty/libprocess/src/tests/.. -I/mesos/3rdparty/stout/include -I/usr/include/apr-1.0 -I/mesos/build/3rdparty/boost-1.53.0/src/boost-1.53.0 -I/mesos/build/3rdparty/elfio-3.2/src/elfio-3.2 -I/mesos/build/3rdparty/glog-0.3.3/src/glog-0.3.3-lib/lib/include -I/mesos/build/3rdparty/nvml-352.79/src/nvml-352.79 -I/mesos/build/3rdparty/picojson-1.3.0/src/picojson-1.3.0 -I/mesos/build/3rdparty/protobuf-2.6.1/src/protobuf-2.6.1-lib/lib/include -I/usr/include/subversion-1 -I/mesos/3rdparty/libprocess/src/tests/src -I/mesos/3rdparty/libprocess/include -I/mesos/build/3rdparty/http_parser-2.6.2/src/http_parser-2.6.2 -I/mesos/build/3rdparty/libev-4.22/src/libev-4.22 -I/mesos/build/3rdparty/gmock-1.7.0/src/gmock-1.7.0/include -I/mesos/build/3rdparty/gmock-1.7.0/src/gmock-1.7.0/gtest/include    -o CMakeFiles/process_tests.dir/owned_tests.cpp.o -c /mesos/3rdparty/libprocess/src/tests/owned_tests.cpp
/usr/bin/cmake -E cmake_progress_report /mesos/build/CMakeFiles 
[ 43%] Building CXX object src/CMakeFiles/mesos-1.2.0.dir/slave/containerizer/mesos/isolator.cpp.o
cd /mesos/build/src && /usr/bin/g++   -DBUILD_DATE="\"2016-3-3 10:20\"" -DBUILD_FLAGS=\"\" -DBUILD_JAVA_JVM_LIBRARY=\"\" -DBUILD_TIME=\"1111100\" -DBUILD_USER=\"frank\" -DHAS_AUTHENTICATION=1 -DLIBDIR=\"/usr/local/libmesos\" -DPICOJSON_USE_INT64 -DPKGDATADIR=\"/usr/local/share/mesos\" -DPKGLIBEXECDIR=\"/usr/local/libexec/mesos\" -DUSE_STATIC_LIB -DVERSION=\"1.2.0\" -D__STDC_FORMAT_MACROS -Dmesos_1_2_0_EXPORTS -O2 -std=c++11 -g -fPIC -I/mesos/build/include -I/mesos/build/include/mesos -I/mesos/build/src -I/mesos/src -I/mesos/build/3rdparty/protobuf-2.6.1/src/protobuf-2.6.1-lib/lib/include -I/mesos/include -I/mesos/3rdparty/stout/include -I/usr/include/apr-1.0 -I/mesos/build/3rdparty/boost-1.53.0/src/boost-1.53.0 -I/mesos/build/3rdparty/elfio-3.2/src/elfio-3.2 -I/mesos/build/3rdparty/glog-0.3.3/src/glog-0.3.3-lib/lib/include -I/mesos/build/3rdparty/nvml-352.79/src/nvml-352.79 -I/mesos/build/3rdparty/picojson-1.3.0/src/picojson-1.3.0 -I/usr/include/subversion-1 -I/mesos/src/src -I/mesos/3rdparty/libprocess/include -I/mesos/build/3rdparty/http_parser-2.6.2/src/http_parser-2.6.2 -I/mesos/build/3rdparty/libev-4.22/src/libev-4.22 -I/mesos/build/3rdparty/zookeeper-3.4.8/src/zookeeper-3.4.8/src/c/include -I/mesos/build/3rdparty/zookeeper-3.4.8/src/zookeeper-3.4.8/src/c/generated -I/mesos/build/3rdparty/leveldb-1.4/src/leveldb-1.4/include    -o CMakeFiles/mesos-1.2.0.dir/slave/containerizer/mesos/isolator.cpp.o -c /mesos/src/slave/containerizer/mesos/isolator.cpp
/usr/bin/cmake -E cmake_progress_report /mesos/build/CMakeFiles 
[ 43%] Building CXX object 3rdparty/libprocess/src/tests/CMakeFiles/process_tests.dir/process_tests.cpp.o
cd /mesos/build/3rdparty/libprocess/src/tests && /usr/bin/g++   -DBUILD_DIR=\"/mesos/build/3rdparty/libprocess/src/tests\" -DHAS_AUTHENTICATION=1 -DLIBDIR=\"/usr/local/libmesos\" -DPICOJSON_USE_INT64 -DPKGDATADIR=\"/usr/local/share/mesos\" -DPKGLIBEXECDIR=\"/usr/local/libexec/mesos\" -DVERSION=\"1.2.0\" -D__STDC_FORMAT_MACROS -O2 -std=c++11 -g -fPIE -I/mesos/3rdparty/libprocess/src/tests/.. -I/mesos/3rdparty/stout/include -I/usr/include/apr-1.0 -I/mesos/build/3rdparty/boost-1.53.0/src/boost-1.53.0 -I/mesos/build/3rdparty/elfio-3.2/src/elfio-3.2 -I/mesos/build/3rdparty/glog-0.3.3/src/glog-0.3.3-lib/lib/include -I/mesos/build/3rdparty/nvml-352.79/src/nvml-352.79 -I/mesos/build/3rdparty/picojson-1.3.0/src/picojson-1.3.0 -I/mesos/build/3rdparty/protobuf-2.6.1/src/protobuf-2.6.1-lib/lib/include -I/usr/include/subversion-1 -I/mesos/3rdparty/libprocess/src/tests/src -I/mesos/3rdparty/libprocess/include -I/mesos/build/3rdparty/http_parser-2.6.2/src/http_parser-2.6.2 -I/mesos/build/3rdparty/libev-4.22/src/libev-4.22 -I/mesos/build/3rdparty/gmock-1.7.0/src/gmock-1.7.0/include -I/mesos/build/3rdparty/gmock-1.7.0/src/gmock-1.7.0/gtest/include    -o CMakeFiles/process_tests.dir/process_tests.cpp.o -c /mesos/3rdparty/libprocess/src/tests/process_tests.cpp
/usr/bin/cmake -E cmake_progress_report /mesos/build/CMakeFiles 84
[ 44%] Building CXX object 3rdparty/libprocess/src/tests/CMakeFiles/process_tests.dir/queue_tests.cpp.o
cd /mesos/build/3rdparty/libprocess/src/tests && /usr/bin/g++   -DBUILD_DIR=\"/mesos/build/3rdparty/libprocess/src/tests\" -DHAS_AUTHENTICATION=1 -DLIBDIR=\"/usr/local/libmesos\" -DPICOJSON_USE_INT64 -DPKGDATADIR=\"/usr/local/share/mesos\" -DPKGLIBEXECDIR=\"/usr/local/libexec/mesos\" -DVERSION=\"1.2.0\" -D__STDC_FORMAT_MACROS -O2 -std=c++11 -g -fPIE -I/mesos/3rdparty/libprocess/src/tests/.. -I/mesos/3rdparty/stout/include -I/usr/include/apr-1.0 -I/mesos/build/3rdparty/boost-1.53.0/src/boost-1.53.0 -I/mesos/build/3rdparty/elfio-3.2/src/elfio-3.2 -I/mesos/build/3rdparty/glog-0.3.3/src/glog-0.3.3-lib/lib/include -I/mesos/build/3rdparty/nvml-352.79/src/nvml-352.79 -I/mesos/build/3rdparty/picojson-1.3.0/src/picojson-1.3.0 -I/mesos/build/3rdparty/protobuf-2.6.1/src/protobuf-2.6.1-lib/lib/include -I/usr/include/subversion-1 -I/mesos/3rdparty/libprocess/src/tests/src -I/mesos/3rdparty/libprocess/include -I/mesos/build/3rdparty/http_parser-2.6.2/src/http_parser-2.6.2 -I/mesos/build/3rdparty/libev-4.22/src/libev-4.22 -I/mesos/build/3rdparty/gmock-1.7.0/src/gmock-1.7.0/include -I/mesos/build/3rdparty/gmock-1.7.0/src/gmock-1.7.0/gtest/include    -o CMakeFiles/process_tests.dir/queue_tests.cpp.o -c /mesos/3rdparty/libprocess/src/tests/queue_tests.cpp
/usr/bin/cmake -E cmake_progress_report /mesos/build/CMakeFiles 
[ 44%] Building CXX object 3rdparty/libprocess/src/tests/CMakeFiles/process_tests.dir/sequence_tests.cpp.o
cd /mesos/build/3rdparty/libprocess/src/tests && /usr/bin/g++   -DBUILD_DIR=\"/mesos/build/3rdparty/libprocess/src/tests\" -DHAS_AUTHENTICATION=1 -DLIBDIR=\"/usr/local/libmesos\" -DPICOJSON_USE_INT64 -DPKGDATADIR=\"/usr/local/share/mesos\" -DPKGLIBEXECDIR=\"/usr/local/libexec/mesos\" -DVERSION=\"1.2.0\" -D__STDC_FORMAT_MACROS -O2 -std=c++11 -g -fPIE -I/mesos/3rdparty/libprocess/src/tests/.. -I/mesos/3rdparty/stout/include -I/usr/include/apr-1.0 -I/mesos/build/3rdparty/boost-1.53.0/src/boost-1.53.0 -I/mesos/build/3rdparty/elfio-3.2/src/elfio-3.2 -I/mesos/build/3rdparty/glog-0.3.3/src/glog-0.3.3-lib/lib/include -I/mesos/build/3rdparty/nvml-352.79/src/nvml-352.79 -I/mesos/build/3rdparty/picojson-1.3.0/src/picojson-1.3.0 -I/mesos/build/3rdparty/protobuf-2.6.1/src/protobuf-2.6.1-lib/lib/include -I/usr/include/subversion-1 -I/mesos/3rdparty/libprocess/src/tests/src -I/mesos/3rdparty/libprocess/include -I/mesos/build/3rdparty/http_parser-2.6.2/src/http_parser-2.6.2 -I/mesos/build/3rdparty/libev-4.22/src/libev-4.22 -I/mesos/build/3rdparty/gmock-1.7.0/src/gmock-1.7.0/include -I/mesos/build/3rdparty/gmock-1.7.0/src/gmock-1.7.0/gtest/include    -o CMakeFiles/process_tests.dir/sequence_tests.cpp.o -c /mesos/3rdparty/libprocess/src/tests/sequence_tests.cpp
/usr/bin/cmake -E cmake_progress_report /mesos/build/CMakeFiles 
[ 44%] Building CXX object 3rdparty/libprocess/src/tests/CMakeFiles/process_tests.dir/shared_tests.cpp.o
cd /mesos/build/3rdparty/libprocess/src/tests && /usr/bin/g++   -DBUILD_DIR=\"/mesos/build/3rdparty/libprocess/src/tests\" -DHAS_AUTHENTICATION=1 -DLIBDIR=\"/usr/local/libmesos\" -DPICOJSON_USE_INT64 -DPKGDATADIR=\"/usr/local/share/mesos\" -DPKGLIBEXECDIR=\"/usr/local/libexec/mesos\" -DVERSION=\"1.2.0\" -D__STDC_FORMAT_MACROS -O2 -std=c++11 -g -fPIE -I/mesos/3rdparty/libprocess/src/tests/.. -I/mesos/3rdparty/stout/include -I/usr/include/apr-1.0 -I/mesos/build/3rdparty/boost-1.53.0/src/boost-1.53.0 -I/mesos/build/3rdparty/elfio-3.2/src/elfio-3.2 -I/mesos/build/3rdparty/glog-0.3.3/src/glog-0.3.3-lib/lib/include -I/mesos/build/3rdparty/nvml-352.79/src/nvml-352.79 -I/mesos/build/3rdparty/picojson-1.3.0/src/picojson-1.3.0 -I/mesos/build/3rdparty/protobuf-2.6.1/src/protobuf-2.6.1-lib/lib/include -I/usr/include/subversion-1 -I/mesos/3rdparty/libprocess/src/tests/src -I/mesos/3rdparty/libprocess/include -I/mesos/build/3rdparty/http_parser-2.6.2/src/http_parser-2.6.2 -I/mesos/build/3rdparty/libev-4.22/src/libev-4.22 -I/mesos/build/3rdparty/gmock-1.7.0/src/gmock-1.7.0/include -I/mesos/build/3rdparty/gmock-1.7.0/src/gmock-1.7.0/gtest/include    -o CMakeFiles/process_tests.dir/shared_tests.cpp.o -c /mesos/3rdparty/libprocess/src/tests/shared_tests.cpp
/usr/bin/cmake -E cmake_progress_report /mesos/build/CMakeFiles 
[ 44%] Building CXX object src/CMakeFiles/mesos-1.2.0.dir/slave/containerizer/mesos/launch.cpp.o
cd /mesos/build/src && /usr/bin/g++   -DBUILD_DATE="\"2016-3-3 10:20\"" -DBUILD_FLAGS=\"\" -DBUILD_JAVA_JVM_LIBRARY=\"\" -DBUILD_TIME=\"1111100\" -DBUILD_USER=\"frank\" -DHAS_AUTHENTICATION=1 -DLIBDIR=\"/usr/local/libmesos\" -DPICOJSON_USE_INT64 -DPKGDATADIR=\"/usr/local/share/mesos\" -DPKGLIBEXECDIR=\"/usr/local/libexec/mesos\" -DUSE_STATIC_LIB -DVERSION=\"1.2.0\" -D__STDC_FORMAT_MACROS -Dmesos_1_2_0_EXPORTS -O2 -std=c++11 -g -fPIC -I/mesos/build/include -I/mesos/build/include/mesos -I/mesos/build/src -I/mesos/src -I/mesos/build/3rdparty/protobuf-2.6.1/src/protobuf-2.6.1-lib/lib/include -I/mesos/include -I/mesos/3rdparty/stout/include -I/usr/include/apr-1.0 -I/mesos/build/3rdparty/boost-1.53.0/src/boost-1.53.0 -I/mesos/build/3rdparty/elfio-3.2/src/elfio-3.2 -I/mesos/build/3rdparty/glog-0.3.3/src/glog-0.3.3-lib/lib/include -I/mesos/build/3rdparty/nvml-352.79/src/nvml-352.79 -I/mesos/build/3rdparty/picojson-1.3.0/src/picojson-1.3.0 -I/usr/include/subversion-1 -I/mesos/src/src -I/mesos/3rdparty/libprocess/include -I/mesos/build/3rdparty/http_parser-2.6.2/src/http_parser-2.6.2 -I/mesos/build/3rdparty/libev-4.22/src/libev-4.22 -I/mesos/build/3rdparty/zookeeper-3.4.8/src/zookeeper-3.4.8/src/c/include -I/mesos/build/3rdparty/zookeeper-3.4.8/src/zookeeper-3.4.8/src/c/generated -I/mesos/build/3rdparty/leveldb-1.4/src/leveldb-1.4/include    -o CMakeFiles/mesos-1.2.0.dir/slave/containerizer/mesos/launch.cpp.o -c /mesos/src/slave/containerizer/mesos/launch.cpp
/usr/bin/cmake -E cmake_progress_report /mesos/build/CMakeFiles 
[ 44%] Building CXX object src/CMakeFiles/mesos-1.2.0.dir/slave/containerizer/mesos/launcher.cpp.o
cd /mesos/build/src && /usr/bin/g++   -DBUILD_DATE="\"2016-3-3 10:20\"" -DBUILD_FLAGS=\"\" -DBUILD_JAVA_JVM_LIBRARY=\"\" -DBUILD_TIME=\"1111100\" -DBUILD_USER=\"frank\" -DHAS_AUTHENTICATION=1 -DLIBDIR=\"/usr/local/libmesos\" -DPICOJSON_USE_INT64 -DPKGDATADIR=\"/usr/local/share/mesos\" -DPKGLIBEXECDIR=\"/usr/local/libexec/mesos\" -DUSE_STATIC_LIB -DVERSION=\"1.2.0\" -D__STDC_FORMAT_MACROS -Dmesos_1_2_0_EXPORTS -O2 -std=c++11 -g -fPIC -I/mesos/build/include -I/mesos/build/include/mesos -I/mesos/build/src -I/mesos/src -I/mesos/build/3rdparty/protobuf-2.6.1/src/protobuf-2.6.1-lib/lib/include -I/mesos/include -I/mesos/3rdparty/stout/include -I/usr/include/apr-1.0 -I/mesos/build/3rdparty/boost-1.53.0/src/boost-1.53.0 -I/mesos/build/3rdparty/elfio-3.2/src/elfio-3.2 -I/mesos/build/3rdparty/glog-0.3.3/src/glog-0.3.3-lib/lib/include -I/mesos/build/3rdparty/nvml-352.79/src/nvml-352.79 -I/mesos/build/3rdparty/picojson-1.3.0/src/picojson-1.3.0 -I/usr/include/subversion-1 -I/mesos/src/src -I/mesos/3rdparty/libprocess/include -I/mesos/build/3rdparty/http_parser-2.6.2/src/http_parser-2.6.2 -I/mesos/build/3rdparty/libev-4.22/src/libev-4.22 -I/mesos/build/3rdparty/zookeeper-3.4.8/src/zookeeper-3.4.8/src/c/include -I/mesos/build/3rdparty/zookeeper-3.4.8/src/zookeeper-3.4.8/src/c/generated -I/mesos/build/3rdparty/leveldb-1.4/src/leveldb-1.4/include    -o CMakeFiles/mesos-1.2.0.dir/slave/containerizer/mesos/launcher.cpp.o -c /mesos/src/slave/containerizer/mesos/launcher.cpp
/usr/bin/cmake -E cmake_progress_report /mesos/build/CMakeFiles 
[ 44%] Building CXX object 3rdparty/libprocess/src/tests/CMakeFiles/process_tests.dir/socket_tests.cpp.o
cd /mesos/build/3rdparty/libprocess/src/tests && /usr/bin/g++   -DBUILD_DIR=\"/mesos/build/3rdparty/libprocess/src/tests\" -DHAS_AUTHENTICATION=1 -DLIBDIR=\"/usr/local/libmesos\" -DPICOJSON_USE_INT64 -DPKGDATADIR=\"/usr/local/share/mesos\" -DPKGLIBEXECDIR=\"/usr/local/libexec/mesos\" -DVERSION=\"1.2.0\" -D__STDC_FORMAT_MACROS -O2 -std=c++11 -g -fPIE -I/mesos/3rdparty/libprocess/src/tests/.. -I/mesos/3rdparty/stout/include -I/usr/include/apr-1.0 -I/mesos/build/3rdparty/boost-1.53.0/src/boost-1.53.0 -I/mesos/build/3rdparty/elfio-3.2/src/elfio-3.2 -I/mesos/build/3rdparty/glog-0.3.3/src/glog-0.3.3-lib/lib/include -I/mesos/build/3rdparty/nvml-352.79/src/nvml-352.79 -I/mesos/build/3rdparty/picojson-1.3.0/src/picojson-1.3.0 -I/mesos/build/3rdparty/protobuf-2.6.1/src/protobuf-2.6.1-lib/lib/include -I/usr/include/subversion-1 -I/mesos/3rdparty/libprocess/src/tests/src -I/mesos/3rdparty/libprocess/include -I/mesos/build/3rdparty/http_parser-2.6.2/src/http_parser-2.6.2 -I/mesos/build/3rdparty/libev-4.22/src/libev-4.22 -I/mesos/build/3rdparty/gmock-1.7.0/src/gmock-1.7.0/include -I/mesos/build/3rdparty/gmock-1.7.0/src/gmock-1.7.0/gtest/include    -o CMakeFiles/process_tests.dir/socket_tests.cpp.o -c /mesos/3rdparty/libprocess/src/tests/socket_tests.cpp
/usr/bin/cmake -E cmake_progress_report /mesos/build/CMakeFiles 
[ 44%] Building CXX object 3rdparty/libprocess/src/tests/CMakeFiles/process_tests.dir/statistics_tests.cpp.o
cd /mesos/build/3rdparty/libprocess/src/tests && /usr/bin/g++   -DBUILD_DIR=\"/mesos/build/3rdparty/libprocess/src/tests\" -DHAS_AUTHENTICATION=1 -DLIBDIR=\"/usr/local/libmesos\" -DPICOJSON_USE_INT64 -DPKGDATADIR=\"/usr/local/share/mesos\" -DPKGLIBEXECDIR=\"/usr/local/libexec/mesos\" -DVERSION=\"1.2.0\" -D__STDC_FORMAT_MACROS -O2 -std=c++11 -g -fPIE -I/mesos/3rdparty/libprocess/src/tests/.. -I/mesos/3rdparty/stout/include -I/usr/include/apr-1.0 -I/mesos/build/3rdparty/boost-1.53.0/src/boost-1.53.0 -I/mesos/build/3rdparty/elfio-3.2/src/elfio-3.2 -I/mesos/build/3rdparty/glog-0.3.3/src/glog-0.3.3-lib/lib/include -I/mesos/build/3rdparty/nvml-352.79/src/nvml-352.79 -I/mesos/build/3rdparty/picojson-1.3.0/src/picojson-1.3.0 -I/mesos/build/3rdparty/protobuf-2.6.1/src/protobuf-2.6.1-lib/lib/include -I/usr/include/subversion-1 -I/mesos/3rdparty/libprocess/src/tests/src -I/mesos/3rdparty/libprocess/include -I/mesos/build/3rdparty/http_parser-2.6.2/src/http_parser-2.6.2 -I/mesos/build/3rdparty/libev-4.22/src/libev-4.22 -I/mesos/build/3rdparty/gmock-1.7.0/src/gmock-1.7.0/include -I/mesos/build/3rdparty/gmock-1.7.0/src/gmock-1.7.0/gtest/include    -o CMakeFiles/process_tests.dir/statistics_tests.cpp.o -c /mesos/3rdparty/libprocess/src/tests/statistics_tests.cpp
/usr/bin/cmake -E cmake_progress_report /mesos/build/CMakeFiles 
[ 44%] Building CXX object 3rdparty/libprocess/src/tests/CMakeFiles/process_tests.dir/subprocess_tests.cpp.o
cd /mesos/build/3rdparty/libprocess/src/tests && /usr/bin/g++   -DBUILD_DIR=\"/mesos/build/3rdparty/libprocess/src/tests\" -DHAS_AUTHENTICATION=1 -DLIBDIR=\"/usr/local/libmesos\" -DPICOJSON_USE_INT64 -DPKGDATADIR=\"/usr/local/share/mesos\" -DPKGLIBEXECDIR=\"/usr/local/libexec/mesos\" -DVERSION=\"1.2.0\" -D__STDC_FORMAT_MACROS -O2 -std=c++11 -g -fPIE -I/mesos/3rdparty/libprocess/src/tests/.. -I/mesos/3rdparty/stout/include -I/usr/include/apr-1.0 -I/mesos/build/3rdparty/boost-1.53.0/src/boost-1.53.0 -I/mesos/build/3rdparty/elfio-3.2/src/elfio-3.2 -I/mesos/build/3rdparty/glog-0.3.3/src/glog-0.3.3-lib/lib/include -I/mesos/build/3rdparty/nvml-352.79/src/nvml-352.79 -I/mesos/build/3rdparty/picojson-1.3.0/src/picojson-1.3.0 -I/mesos/build/3rdparty/protobuf-2.6.1/src/protobuf-2.6.1-lib/lib/include -I/usr/include/subversion-1 -I/mesos/3rdparty/libprocess/src/tests/src -I/mesos/3rdparty/libprocess/include -I/mesos/build/3rdparty/http_parser-2.6.2/src/http_parser-2.6.2 -I/mesos/build/3rdparty/libev-4.22/src/libev-4.22 -I/mesos/build/3rdparty/gmock-1.7.0/src/gmock-1.7.0/include -I/mesos/build/3rdparty/gmock-1.7.0/src/gmock-1.7.0/gtest/include    -o CMakeFiles/process_tests.dir/subprocess_tests.cpp.o -c /mesos/3rdparty/libprocess/src/tests/subprocess_tests.cpp
/usr/bin/cmake -E cmake_progress_report /mesos/build/CMakeFiles 15
[ 45%] Building CXX object src/CMakeFiles/mesos-1.2.0.dir/slave/containerizer/mesos/mount.cpp.o
cd /mesos/build/src && /usr/bin/g++   -DBUILD_DATE="\"2016-3-3 10:20\"" -DBUILD_FLAGS=\"\" -DBUILD_JAVA_JVM_LIBRARY=\"\" -DBUILD_TIME=\"1111100\" -DBUILD_USER=\"frank\" -DHAS_AUTHENTICATION=1 -DLIBDIR=\"/usr/local/libmesos\" -DPICOJSON_USE_INT64 -DPKGDATADIR=\"/usr/local/share/mesos\" -DPKGLIBEXECDIR=\"/usr/local/libexec/mesos\" -DUSE_STATIC_LIB -DVERSION=\"1.2.0\" -D__STDC_FORMAT_MACROS -Dmesos_1_2_0_EXPORTS -O2 -std=c++11 -g -fPIC -I/mesos/build/include -I/mesos/build/include/mesos -I/mesos/build/src -I/mesos/src -I/mesos/build/3rdparty/protobuf-2.6.1/src/protobuf-2.6.1-lib/lib/include -I/mesos/include -I/mesos/3rdparty/stout/include -I/usr/include/apr-1.0 -I/mesos/build/3rdparty/boost-1.53.0/src/boost-1.53.0 -I/mesos/build/3rdparty/elfio-3.2/src/elfio-3.2 -I/mesos/build/3rdparty/glog-0.3.3/src/glog-0.3.3-lib/lib/include -I/mesos/build/3rdparty/nvml-352.79/src/nvml-352.79 -I/mesos/build/3rdparty/picojson-1.3.0/src/picojson-1.3.0 -I/usr/include/subversion-1 -I/mesos/src/src -I/mesos/3rdparty/libprocess/include -I/mesos/build/3rdparty/http_parser-2.6.2/src/http_parser-2.6.2 -I/mesos/build/3rdparty/libev-4.22/src/libev-4.22 -I/mesos/build/3rdparty/zookeeper-3.4.8/src/zookeeper-3.4.8/src/c/include -I/mesos/build/3rdparty/zookeeper-3.4.8/src/zookeeper-3.4.8/src/c/generated -I/mesos/build/3rdparty/leveldb-1.4/src/leveldb-1.4/include    -o CMakeFiles/mesos-1.2.0.dir/slave/containerizer/mesos/mount.cpp.o -c /mesos/src/slave/containerizer/mesos/mount.cpp
/usr/bin/cmake -E cmake_progress_report /mesos/build/CMakeFiles 
[ 45%] Building CXX object src/CMakeFiles/mesos-1.2.0.dir/slave/containerizer/mesos/paths.cpp.o
cd /mesos/build/src && /usr/bin/g++   -DBUILD_DATE="\"2016-3-3 10:20\"" -DBUILD_FLAGS=\"\" -DBUILD_JAVA_JVM_LIBRARY=\"\" -DBUILD_TIME=\"1111100\" -DBUILD_USER=\"frank\" -DHAS_AUTHENTICATION=1 -DLIBDIR=\"/usr/local/libmesos\" -DPICOJSON_USE_INT64 -DPKGDATADIR=\"/usr/local/share/mesos\" -DPKGLIBEXECDIR=\"/usr/local/libexec/mesos\" -DUSE_STATIC_LIB -DVERSION=\"1.2.0\" -D__STDC_FORMAT_MACROS -Dmesos_1_2_0_EXPORTS -O2 -std=c++11 -g -fPIC -I/mesos/build/include -I/mesos/build/include/mesos -I/mesos/build/src -I/mesos/src -I/mesos/build/3rdparty/protobuf-2.6.1/src/protobuf-2.6.1-lib/lib/include -I/mesos/include -I/mesos/3rdparty/stout/include -I/usr/include/apr-1.0 -I/mesos/build/3rdparty/boost-1.53.0/src/boost-1.53.0 -I/mesos/build/3rdparty/elfio-3.2/src/elfio-3.2 -I/mesos/build/3rdparty/glog-0.3.3/src/glog-0.3.3-lib/lib/include -I/mesos/build/3rdparty/nvml-352.79/src/nvml-352.79 -I/mesos/build/3rdparty/picojson-1.3.0/src/picojson-1.3.0 -I/usr/include/subversion-1 -I/mesos/src/src -I/mesos/3rdparty/libprocess/include -I/mesos/build/3rdparty/http_parser-2.6.2/src/http_parser-2.6.2 -I/mesos/build/3rdparty/libev-4.22/src/libev-4.22 -I/mesos/build/3rdparty/zookeeper-3.4.8/src/zookeeper-3.4.8/src/c/include -I/mesos/build/3rdparty/zookeeper-3.4.8/src/zookeeper-3.4.8/src/c/generated -I/mesos/build/3rdparty/leveldb-1.4/src/leveldb-1.4/include    -o CMakeFiles/mesos-1.2.0.dir/slave/containerizer/mesos/paths.cpp.o -c /mesos/src/slave/containerizer/mesos/paths.cpp
/usr/bin/cmake -E cmake_progress_report /mesos/build/CMakeFiles 
[ 45%] Building CXX object 3rdparty/libprocess/src/tests/CMakeFiles/process_tests.dir/system_tests.cpp.o
cd /mesos/build/3rdparty/libprocess/src/tests && /usr/bin/g++   -DBUILD_DIR=\"/mesos/build/3rdparty/libprocess/src/tests\" -DHAS_AUTHENTICATION=1 -DLIBDIR=\"/usr/local/libmesos\" -DPICOJSON_USE_INT64 -DPKGDATADIR=\"/usr/local/share/mesos\" -DPKGLIBEXECDIR=\"/usr/local/libexec/mesos\" -DVERSION=\"1.2.0\" -D__STDC_FORMAT_MACROS -O2 -std=c++11 -g -fPIE -I/mesos/3rdparty/libprocess/src/tests/.. -I/mesos/3rdparty/stout/include -I/usr/include/apr-1.0 -I/mesos/build/3rdparty/boost-1.53.0/src/boost-1.53.0 -I/mesos/build/3rdparty/elfio-3.2/src/elfio-3.2 -I/mesos/build/3rdparty/glog-0.3.3/src/glog-0.3.3-lib/lib/include -I/mesos/build/3rdparty/nvml-352.79/src/nvml-352.79 -I/mesos/build/3rdparty/picojson-1.3.0/src/picojson-1.3.0 -I/mesos/build/3rdparty/protobuf-2.6.1/src/protobuf-2.6.1-lib/lib/include -I/usr/include/subversion-1 -I/mesos/3rdparty/libprocess/src/tests/src -I/mesos/3rdparty/libprocess/include -I/mesos/build/3rdparty/http_parser-2.6.2/src/http_parser-2.6.2 -I/mesos/build/3rdparty/libev-4.22/src/libev-4.22 -I/mesos/build/3rdparty/gmock-1.7.0/src/gmock-1.7.0/include -I/mesos/build/3rdparty/gmock-1.7.0/src/gmock-1.7.0/gtest/include    -o CMakeFiles/process_tests.dir/system_tests.cpp.o -c /mesos/3rdparty/libprocess/src/tests/system_tests.cpp
/usr/bin/cmake -E cmake_progress_report /mesos/build/CMakeFiles 85
[ 46%] Building CXX object 3rdparty/libprocess/src/tests/CMakeFiles/process_tests.dir/time_tests.cpp.o
cd /mesos/build/3rdparty/libprocess/src/tests && /usr/bin/g++   -DBUILD_DIR=\"/mesos/build/3rdparty/libprocess/src/tests\" -DHAS_AUTHENTICATION=1 -DLIBDIR=\"/usr/local/libmesos\" -DPICOJSON_USE_INT64 -DPKGDATADIR=\"/usr/local/share/mesos\" -DPKGLIBEXECDIR=\"/usr/local/libexec/mesos\" -DVERSION=\"1.2.0\" -D__STDC_FORMAT_MACROS -O2 -std=c++11 -g -fPIE -I/mesos/3rdparty/libprocess/src/tests/.. -I/mesos/3rdparty/stout/include -I/usr/include/apr-1.0 -I/mesos/build/3rdparty/boost-1.53.0/src/boost-1.53.0 -I/mesos/build/3rdparty/elfio-3.2/src/elfio-3.2 -I/mesos/build/3rdparty/glog-0.3.3/src/glog-0.3.3-lib/lib/include -I/mesos/build/3rdparty/nvml-352.79/src/nvml-352.79 -I/mesos/build/3rdparty/picojson-1.3.0/src/picojson-1.3.0 -I/mesos/build/3rdparty/protobuf-2.6.1/src/protobuf-2.6.1-lib/lib/include -I/usr/include/subversion-1 -I/mesos/3rdparty/libprocess/src/tests/src -I/mesos/3rdparty/libprocess/include -I/mesos/build/3rdparty/http_parser-2.6.2/src/http_parser-2.6.2 -I/mesos/build/3rdparty/libev-4.22/src/libev-4.22 -I/mesos/build/3rdparty/gmock-1.7.0/src/gmock-1.7.0/include -I/mesos/build/3rdparty/gmock-1.7.0/src/gmock-1.7.0/gtest/include    -o CMakeFiles/process_tests.dir/time_tests.cpp.o -c /mesos/3rdparty/libprocess/src/tests/time_tests.cpp
/usr/bin/cmake -E cmake_progress_report /mesos/build/CMakeFiles 
[ 46%] Building CXX object src/CMakeFiles/mesos-1.2.0.dir/slave/containerizer/mesos/utils.cpp.o
cd /mesos/build/src && /usr/bin/g++   -DBUILD_DATE="\"2016-3-3 10:20\"" -DBUILD_FLAGS=\"\" -DBUILD_JAVA_JVM_LIBRARY=\"\" -DBUILD_TIME=\"1111100\" -DBUILD_USER=\"frank\" -DHAS_AUTHENTICATION=1 -DLIBDIR=\"/usr/local/libmesos\" -DPICOJSON_USE_INT64 -DPKGDATADIR=\"/usr/local/share/mesos\" -DPKGLIBEXECDIR=\"/usr/local/libexec/mesos\" -DUSE_STATIC_LIB -DVERSION=\"1.2.0\" -D__STDC_FORMAT_MACROS -Dmesos_1_2_0_EXPORTS -O2 -std=c++11 -g -fPIC -I/mesos/build/include -I/mesos/build/include/mesos -I/mesos/build/src -I/mesos/src -I/mesos/build/3rdparty/protobuf-2.6.1/src/protobuf-2.6.1-lib/lib/include -I/mesos/include -I/mesos/3rdparty/stout/include -I/usr/include/apr-1.0 -I/mesos/build/3rdparty/boost-1.53.0/src/boost-1.53.0 -I/mesos/build/3rdparty/elfio-3.2/src/elfio-3.2 -I/mesos/build/3rdparty/glog-0.3.3/src/glog-0.3.3-lib/lib/include -I/mesos/build/3rdparty/nvml-352.79/src/nvml-352.79 -I/mesos/build/3rdparty/picojson-1.3.0/src/picojson-1.3.0 -I/usr/include/subversion-1 -I/mesos/src/src -I/mesos/3rdparty/libprocess/include -I/mesos/build/3rdparty/http_parser-2.6.2/src/http_parser-2.6.2 -I/mesos/build/3rdparty/libev-4.22/src/libev-4.22 -I/mesos/build/3rdparty/zookeeper-3.4.8/src/zookeeper-3.4.8/src/c/include -I/mesos/build/3rdparty/zookeeper-3.4.8/src/zookeeper-3.4.8/src/c/generated -I/mesos/build/3rdparty/leveldb-1.4/src/leveldb-1.4/include    -o CMakeFiles/mesos-1.2.0.dir/slave/containerizer/mesos/utils.cpp.o -c /mesos/src/slave/containerizer/mesos/utils.cpp
/usr/bin/cmake -E cmake_progress_report /mesos/build/CMakeFiles 
[ 46%] Building CXX object src/CMakeFiles/mesos-1.2.0.dir/slave/containerizer/mesos/io/switchboard.cpp.o
cd /mesos/build/src && /usr/bin/g++   -DBUILD_DATE="\"2016-3-3 10:20\"" -DBUILD_FLAGS=\"\" -DBUILD_JAVA_JVM_LIBRARY=\"\" -DBUILD_TIME=\"1111100\" -DBUILD_USER=\"frank\" -DHAS_AUTHENTICATION=1 -DLIBDIR=\"/usr/local/libmesos\" -DPICOJSON_USE_INT64 -DPKGDATADIR=\"/usr/local/share/mesos\" -DPKGLIBEXECDIR=\"/usr/local/libexec/mesos\" -DUSE_STATIC_LIB -DVERSION=\"1.2.0\" -D__STDC_FORMAT_MACROS -Dmesos_1_2_0_EXPORTS -O2 -std=c++11 -g -fPIC -I/mesos/build/include -I/mesos/build/include/mesos -I/mesos/build/src -I/mesos/src -I/mesos/build/3rdparty/protobuf-2.6.1/src/protobuf-2.6.1-lib/lib/include -I/mesos/include -I/mesos/3rdparty/stout/include -I/usr/include/apr-1.0 -I/mesos/build/3rdparty/boost-1.53.0/src/boost-1.53.0 -I/mesos/build/3rdparty/elfio-3.2/src/elfio-3.2 -I/mesos/build/3rdparty/glog-0.3.3/src/glog-0.3.3-lib/lib/include -I/mesos/build/3rdparty/nvml-352.79/src/nvml-352.79 -I/mesos/build/3rdparty/picojson-1.3.0/src/picojson-1.3.0 -I/usr/include/subversion-1 -I/mesos/src/src -I/mesos/3rdparty/libprocess/include -I/mesos/build/3rdparty/http_parser-2.6.2/src/http_parser-2.6.2 -I/mesos/build/3rdparty/libev-4.22/src/libev-4.22 -I/mesos/build/3rdparty/zookeeper-3.4.8/src/zookeeper-3.4.8/src/c/include -I/mesos/build/3rdparty/zookeeper-3.4.8/src/zookeeper-3.4.8/src/c/generated -I/mesos/build/3rdparty/leveldb-1.4/src/leveldb-1.4/include    -o CMakeFiles/mesos-1.2.0.dir/slave/containerizer/mesos/io/switchboard.cpp.o -c /mesos/src/slave/containerizer/mesos/io/switchboard.cpp
/usr/bin/cmake -E cmake_progress_report /mesos/build/CMakeFiles 
[ 46%] Building CXX object 3rdparty/libprocess/src/tests/CMakeFiles/process_tests.dir/timeseries_tests.cpp.o
cd /mesos/build/3rdparty/libprocess/src/tests && /usr/bin/g++   -DBUILD_DIR=\"/mesos/build/3rdparty/libprocess/src/tests\" -DHAS_AUTHENTICATION=1 -DLIBDIR=\"/usr/local/libmesos\" -DPICOJSON_USE_INT64 -DPKGDATADIR=\"/usr/local/share/mesos\" -DPKGLIBEXECDIR=\"/usr/local/libexec/mesos\" -DVERSION=\"1.2.0\" -D__STDC_FORMAT_MACROS -O2 -std=c++11 -g -fPIE -I/mesos/3rdparty/libprocess/src/tests/.. -I/mesos/3rdparty/stout/include -I/usr/include/apr-1.0 -I/mesos/build/3rdparty/boost-1.53.0/src/boost-1.53.0 -I/mesos/build/3rdparty/elfio-3.2/src/elfio-3.2 -I/mesos/build/3rdparty/glog-0.3.3/src/glog-0.3.3-lib/lib/include -I/mesos/build/3rdparty/nvml-352.79/src/nvml-352.79 -I/mesos/build/3rdparty/picojson-1.3.0/src/picojson-1.3.0 -I/mesos/build/3rdparty/protobuf-2.6.1/src/protobuf-2.6.1-lib/lib/include -I/usr/include/subversion-1 -I/mesos/3rdparty/libprocess/src/tests/src -I/mesos/3rdparty/libprocess/include -I/mesos/build/3rdparty/http_parser-2.6.2/src/http_parser-2.6.2 -I/mesos/build/3rdparty/libev-4.22/src/libev-4.22 -I/mesos/build/3rdparty/gmock-1.7.0/src/gmock-1.7.0/include -I/mesos/build/3rdparty/gmock-1.7.0/src/gmock-1.7.0/gtest/include    -o CMakeFiles/process_tests.dir/timeseries_tests.cpp.o -c /mesos/3rdparty/libprocess/src/tests/timeseries_tests.cpp
/usr/bin/cmake -E cmake_progress_report /mesos/build/CMakeFiles 
[ 46%] Building CXX object 3rdparty/libprocess/src/tests/CMakeFiles/process_tests.dir/io_tests.cpp.o
cd /mesos/build/3rdparty/libprocess/src/tests && /usr/bin/g++   -DBUILD_DIR=\"/mesos/build/3rdparty/libprocess/src/tests\" -DHAS_AUTHENTICATION=1 -DLIBDIR=\"/usr/local/libmesos\" -DPICOJSON_USE_INT64 -DPKGDATADIR=\"/usr/local/share/mesos\" -DPKGLIBEXECDIR=\"/usr/local/libexec/mesos\" -DVERSION=\"1.2.0\" -D__STDC_FORMAT_MACROS -O2 -std=c++11 -g -fPIE -I/mesos/3rdparty/libprocess/src/tests/.. -I/mesos/3rdparty/stout/include -I/usr/include/apr-1.0 -I/mesos/build/3rdparty/boost-1.53.0/src/boost-1.53.0 -I/mesos/build/3rdparty/elfio-3.2/src/elfio-3.2 -I/mesos/build/3rdparty/glog-0.3.3/src/glog-0.3.3-lib/lib/include -I/mesos/build/3rdparty/nvml-352.79/src/nvml-352.79 -I/mesos/build/3rdparty/picojson-1.3.0/src/picojson-1.3.0 -I/mesos/build/3rdparty/protobuf-2.6.1/src/protobuf-2.6.1-lib/lib/include -I/usr/include/subversion-1 -I/mesos/3rdparty/libprocess/src/tests/src -I/mesos/3rdparty/libprocess/include -I/mesos/build/3rdparty/http_parser-2.6.2/src/http_parser-2.6.2 -I/mesos/build/3rdparty/libev-4.22/src/libev-4.22 -I/mesos/build/3rdparty/gmock-1.7.0/src/gmock-1.7.0/include -I/mesos/build/3rdparty/gmock-1.7.0/src/gmock-1.7.0/gtest/include    -o CMakeFiles/process_tests.dir/io_tests.cpp.o -c /mesos/3rdparty/libprocess/src/tests/io_tests.cpp
/usr/bin/cmake -E cmake_progress_report /mesos/build/CMakeFiles 
[ 46%] Building CXX object 3rdparty/libprocess/src/tests/CMakeFiles/process_tests.dir/reap_tests.cpp.o
cd /mesos/build/3rdparty/libprocess/src/tests && /usr/bin/g++   -DBUILD_DIR=\"/mesos/build/3rdparty/libprocess/src/tests\" -DHAS_AUTHENTICATION=1 -DLIBDIR=\"/usr/local/libmesos\" -DPICOJSON_USE_INT64 -DPKGDATADIR=\"/usr/local/share/mesos\" -DPKGLIBEXECDIR=\"/usr/local/libexec/mesos\" -DVERSION=\"1.2.0\" -D__STDC_FORMAT_MACROS -O2 -std=c++11 -g -fPIE -I/mesos/3rdparty/libprocess/src/tests/.. -I/mesos/3rdparty/stout/include -I/usr/include/apr-1.0 -I/mesos/build/3rdparty/boost-1.53.0/src/boost-1.53.0 -I/mesos/build/3rdparty/elfio-3.2/src/elfio-3.2 -I/mesos/build/3rdparty/glog-0.3.3/src/glog-0.3.3-lib/lib/include -I/mesos/build/3rdparty/nvml-352.79/src/nvml-352.79 -I/mesos/build/3rdparty/picojson-1.3.0/src/picojson-1.3.0 -I/mesos/build/3rdparty/protobuf-2.6.1/src/protobuf-2.6.1-lib/lib/include -I/usr/include/subversion-1 -I/mesos/3rdparty/libprocess/src/tests/src -I/mesos/3rdparty/libprocess/include -I/mesos/build/3rdparty/http_parser-2.6.2/src/http_parser-2.6.2 -I/mesos/build/3rdparty/libev-4.22/src/libev-4.22 -I/mesos/build/3rdparty/gmock-1.7.0/src/gmock-1.7.0/include -I/mesos/build/3rdparty/gmock-1.7.0/src/gmock-1.7.0/gtest/include    -o CMakeFiles/process_tests.dir/reap_tests.cpp.o -c /mesos/3rdparty/libprocess/src/tests/reap_tests.cpp
/mesos/src/slave/containerizer/mesos/io/switchboard.cpp: In member function 'virtual process::Future<Nothing> mesos::internal::slave::IOSwitchboard::cleanup(const mesos::ContainerID&)':
/mesos/src/slave/containerizer/mesos/io/switchboard.cpp:539:11: error: 'defer' was not declared in this scope
     .then(defer, self(), [this, containerId]() {
           ^
/mesos/src/slave/containerizer/mesos/io/switchboard.cpp:539:11: note: suggested alternative:
In file included from /mesos/3rdparty/libprocess/include/process/collect.hpp:21:0,
                 from /mesos/src/slave/containerizer/mesos/io/switchboard.cpp:26:
/mesos/3rdparty/libprocess/include/process/defer.hpp:245:14: note:   'process::defer'
 _Deferred<F> defer(F&& f)
              ^
/usr/bin/cmake -E cmake_progress_report /mesos/build/CMakeFiles 
[ 46%] Building CXX object src/CMakeFiles/mesos-1.2.0.dir/slave/containerizer/mesos/provisioner/backend.cpp.o
cd /mesos/build/src && /usr/bin/g++   -DBUILD_DATE="\"2016-3-3 10:20\"" -DBUILD_FLAGS=\"\" -DBUILD_JAVA_JVM_LIBRARY=\"\" -DBUILD_TIME=\"1111100\" -DBUILD_USER=\"frank\" -DHAS_AUTHENTICATION=1 -DLIBDIR=\"/usr/local/libmesos\" -DPICOJSON_USE_INT64 -DPKGDATADIR=\"/usr/local/share/mesos\" -DPKGLIBEXECDIR=\"/usr/local/libexec/mesos\" -DUSE_STATIC_LIB -DVERSION=\"1.2.0\" -D__STDC_FORMAT_MACROS -Dmesos_1_2_0_EXPORTS -O2 -std=c++11 -g -fPIC -I/mesos/build/include -I/mesos/build/include/mesos -I/mesos/build/src -I/mesos/src -I/mesos/build/3rdparty/protobuf-2.6.1/src/protobuf-2.6.1-lib/lib/include -I/mesos/include -I/mesos/3rdparty/stout/include -I/usr/include/apr-1.0 -I/mesos/build/3rdparty/boost-1.53.0/src/boost-1.53.0 -I/mesos/build/3rdparty/elfio-3.2/src/elfio-3.2 -I/mesos/build/3rdparty/glog-0.3.3/src/glog-0.3.3-lib/lib/include -I/mesos/build/3rdparty/nvml-352.79/src/nvml-352.79 -I/mesos/build/3rdparty/picojson-1.3.0/src/picojson-1.3.0 -I/usr/include/subversion-1 -I/mesos/src/src -I/mesos/3rdparty/libprocess/include -I/mesos/build/3rdparty/http_parser-2.6.2/src/http_parser-2.6.2 -I/mesos/build/3rdparty/libev-4.22/src/libev-4.22 -I/mesos/build/3rdparty/zookeeper-3.4.8/src/zookeeper-3.4.8/src/c/include -I/mesos/build/3rdparty/zookeeper-3.4.8/src/zookeeper-3.4.8/src/c/generated -I/mesos/build/3rdparty/leveldb-1.4/src/leveldb-1.4/include    -o CMakeFiles/mesos-1.2.0.dir/slave/containerizer/mesos/provisioner/backend.cpp.o -c /mesos/src/slave/containerizer/mesos/provisioner/backend.cpp
/usr/bin/cmake -E cmake_progress_report /mesos/build/CMakeFiles 
[ 46%] Building CXX object src/CMakeFiles/mesos-1.2.0.dir/slave/containerizer/mesos/provisioner/paths.cpp.o
cd /mesos/build/src && /usr/bin/g++   -DBUILD_DATE="\"2016-3-3 10:20\"" -DBUILD_FLAGS=\"\" -DBUILD_JAVA_JVM_LIBRARY=\"\" -DBUILD_TIME=\"1111100\" -DBUILD_USER=\"frank\" -DHAS_AUTHENTICATION=1 -DLIBDIR=\"/usr/local/libmesos\" -DPICOJSON_USE_INT64 -DPKGDATADIR=\"/usr/local/share/mesos\" -DPKGLIBEXECDIR=\"/usr/local/libexec/mesos\" -DUSE_STATIC_LIB -DVERSION=\"1.2.0\" -D__STDC_FORMAT_MACROS -Dmesos_1_2_0_EXPORTS -O2 -std=c++11 -g -fPIC -I/mesos/build/include -I/mesos/build/include/mesos -I/mesos/build/src -I/mesos/src -I/mesos/build/3rdparty/protobuf-2.6.1/src/protobuf-2.6.1-lib/lib/include -I/mesos/include -I/mesos/3rdparty/stout/include -I/usr/include/apr-1.0 -I/mesos/build/3rdparty/boost-1.53.0/src/boost-1.53.0 -I/mesos/build/3rdparty/elfio-3.2/src/elfio-3.2 -I/mesos/build/3rdparty/glog-0.3.3/src/glog-0.3.3-lib/lib/include -I/mesos/build/3rdparty/nvml-352.79/src/nvml-352.79 -I/mesos/build/3rdparty/picojson-1.3.0/src/picojson-1.3.0 -I/usr/include/subversion-1 -I/mesos/src/src -I/mesos/3rdparty/libprocess/include -I/mesos/build/3rdparty/http_parser-2.6.2/src/http_parser-2.6.2 -I/mesos/build/3rdparty/libev-4.22/src/libev-4.22 -I/mesos/build/3rdparty/zookeeper-3.4.8/src/zookeeper-3.4.8/src/c/include -I/mesos/build/3rdparty/zookeeper-3.4.8/src/zookeeper-3.4.8/src/c/generated -I/mesos/build/3rdparty/leveldb-1.4/src/leveldb-1.4/include    -o CMakeFiles/mesos-1.2.0.dir/slave/containerizer/mesos/provisioner/paths.cpp.o -c /mesos/src/slave/containerizer/mesos/provisioner/paths.cpp
/usr/bin/cmake -E cmake_progress_report /mesos/build/CMakeFiles 
[ 46%] Building CXX object src/CMakeFiles/mesos-1.2.0.dir/slave/containerizer/mesos/provisioner/provisioner.cpp.o
cd /mesos/build/src && /usr/bin/g++   -DBUILD_DATE="\"2016-3-3 10:20\"" -DBUILD_FLAGS=\"\" -DBUILD_JAVA_JVM_LIBRARY=\"\" -DBUILD_TIME=\"1111100\" -DBUILD_USER=\"frank\" -DHAS_AUTHENTICATION=1 -DLIBDIR=\"/usr/local/libmesos\" -DPICOJSON_USE_INT64 -DPKGDATADIR=\"/usr/local/share/mesos\" -DPKGLIBEXECDIR=\"/usr/local/libexec/mesos\" -DUSE_STATIC_LIB -DVERSION=\"1.2.0\" -D__STDC_FORMAT_MACROS -Dmesos_1_2_0_EXPORTS -O2 -std=c++11 -g -fPIC -I/mesos/build/include -I/mesos/build/include/mesos -I/mesos/build/src -I/mesos/src -I/mesos/build/3rdparty/protobuf-2.6.1/src/protobuf-2.6.1-lib/lib/include -I/mesos/include -I/mesos/3rdparty/stout/include -I/usr/include/apr-1.0 -I/mesos/build/3rdparty/boost-1.53.0/src/boost-1.53.0 -I/mesos/build/3rdparty/elfio-3.2/src/elfio-3.2 -I/mesos/build/3rdparty/glog-0.3.3/src/glog-0.3.3-lib/lib/include -I/mesos/build/3rdparty/nvml-352.79/src/nvml-352.79 -I/mesos/build/3rdparty/picojson-1.3.0/src/picojson-1.3.0 -I/usr/include/subversion-1 -I/mesos/src/src -I/mesos/3rdparty/libprocess/include -I/mesos/build/3rdparty/http_parser-2.6.2/src/http_parser-2.6.2 -I/mesos/build/3rdparty/libev-4.22/src/libev-4.22 -I/mesos/build/3rdparty/zookeeper-3.4.8/src/zookeeper-3.4.8/src/c/include -I/mesos/build/3rdparty/zookeeper-3.4.8/src/zookeeper-3.4.8/src/c/generated -I/mesos/build/3rdparty/leveldb-1.4/src/leveldb-1.4/include    -o CMakeFiles/mesos-1.2.0.dir/slave/containerizer/mesos/provisioner/provisioner.cpp.o -c /mesos/src/slave/containerizer/mesos/provisioner/provisioner.cpp
make[3]: *** [src/CMakeFiles/mesos-1.2.0.dir/slave/containerizer/mesos/io/switchboard.cpp.o] Error 1
make[3]: *** Waiting for unfinished jobs....
Linking CXX executable process_tests
cd /mesos/build/3rdparty/libprocess/src/tests && /usr/bin/cmake -E cmake_link_script CMakeFiles/process_tests.dir/link.txt --verbose=1
/usr/bin/g++    -O2 -std=c++11 -g    CMakeFiles/process_tests.dir/main.cpp.o CMakeFiles/process_tests.dir/collect_tests.cpp.o CMakeFiles/process_tests.dir/decoder_tests.cpp.o CMakeFiles/process_tests.dir/encoder_tests.cpp.o CMakeFiles/process_tests.dir/future_tests.cpp.o CMakeFiles/process_tests.dir/http_tests.cpp.o CMakeFiles/process_tests.dir/limiter_tests.cpp.o CMakeFiles/process_tests.dir/loop_tests.cpp.o CMakeFiles/process_tests.dir/metrics_tests.cpp.o CMakeFiles/process_tests.dir/mutex_tests.cpp.o CMakeFiles/process_tests.dir/owned_tests.cpp.o CMakeFiles/process_tests.dir/process_tests.cpp.o CMakeFiles/process_tests.dir/queue_tests.cpp.o CMakeFiles/process_tests.dir/sequence_tests.cpp.o CMakeFiles/process_tests.dir/shared_tests.cpp.o CMakeFiles/process_tests.dir/socket_tests.cpp.o CMakeFiles/process_tests.dir/statistics_tests.cpp.o CMakeFiles/process_tests.dir/subprocess_tests.cpp.o CMakeFiles/process_tests.dir/system_tests.cpp.o CMakeFiles/process_tests.dir/time_tests.cpp.o CMakeFiles/process_tests.dir/timeseries_tests.cpp.o CMakeFiles/process_tests.dir/io_tests.cpp.o CMakeFiles/process_tests.dir/reap_tests.cpp.o  -o process_tests  -L/usr/lib/x86_64-linux-gnu/libapr-1.so  -L/mesos/build/3rdparty/glog-0.3.3/src/glog-0.3.3-lib/lib/lib  -L/mesos/build/3rdparty/protobuf-2.6.1/src/protobuf-2.6.1-lib/lib/lib  -L/usr/lib/x86_64-linux-gnu/libsvn_delta-1.so  -L/usr/lib/x86_64-linux-gnu/libsvn_diff-1.so  -L/usr/lib/x86_64-linux-gnu/libsvn_subr-1.so  -L/mesos/build/3rdparty/http_parser-2.6.2/src/http_parser-2.6.2-build  -L/mesos/build/3rdparty/libev-4.22/src/libev-4.22-build/.libs  -L/mesos/build/3rdparty/libprocess/..  -L/mesos/build/3rdparty/gmock-1.7.0/src/gmock-1.7.0-lib/lib  -L/mesos/build/3rdparty/gmock-1.7.0/src/gmock-1.7.0-build/gtest/lib/.libs -rdynamic ../libprocess-0.0.1.so.0.0.1 -lcurl -lglog -lsvn_delta-1 -lsvn_diff-1 -lsvn_subr-1 -lprotobuf -ldl -lapr-1 -lrt -lhttp_parser -lev -lrt -lz -lpthread -lgmock -lgtest -lhttp_parser -lev -lz -lpthread -Wl,-rpath,/usr/lib/x86_64-linux-gnu/libapr-1.so:/mesos/build/3rdparty/glog-0.3.3/src/glog-0.3.3-lib/lib/lib:/mesos/build/3rdparty/protobuf-2.6.1/src/protobuf-2.6.1-lib/lib/lib:/usr/lib/x86_64-linux-gnu/libsvn_delta-1.so:/usr/lib/x86_64-linux-gnu/libsvn_diff-1.so:/usr/lib/x86_64-linux-gnu/libsvn_subr-1.so:/mesos/build/3rdparty/http_parser-2.6.2/src/http_parser-2.6.2-build:/mesos/build/3rdparty/libev-4.22/src/libev-4.22-build/.libs:/mesos/build/3rdparty/libprocess/..:/mesos/build/3rdparty/gmock-1.7.0/src/gmock-1.7.0-lib/lib:/mesos/build/3rdparty/gmock-1.7.0/src/gmock-1.7.0-build/gtest/lib/.libs:/mesos/build/3rdparty/libprocess/src 
make[3]: Leaving directory `/mesos/build'
/usr/bin/cmake -E cmake_progress_report /mesos/build/CMakeFiles  82 83 84 85
[ 46%] Built target process_tests
make[3]: Leaving directory `/mesos/build'
make[2]: Leaving directory `/mesos/build'
make[2]: *** [src/CMakeFiles/mesos-1.2.0.dir/all] Error 2
make[1]: *** [CMakeFiles/check.dir/rule] Error 2
make[1]: Leaving directory `/mesos/build'
make: *** [check] Error 2
+ docker rmi mesos-1480974608-13987
Untagged: mesos-1480974608-13987:latest
Deleted: sha256:7c2baf22f8d0e60bbc48186e0620b5c6ded200ff8a9feb9013ef904aeaa879f0
Deleted: sha256:20836c1abf2249e17415dd7d83b01f21bc64206d56628fb83323c747005b1cca
Deleted: sha256:15f093f00225f19d24717174753154f2a1d82e181ba09cb09f64f5d685c8f1d9
Deleted: sha256:f3a72100540d7e6db8f65adf83f5c694f4390c58eadabe6d667d5902a2e879bb
Deleted: sha256:c949fd79d442db2778c2f29c5bca98f743a0b8be32022cae3e485a8f8d4deb2a
Deleted: sha256:8560e1fa04467a1ceaa8b8ea9378412e9551365874772c0eeec7457667eabfce
Deleted: sha256:cb54d005e2e8e9cbce87e64fd8cfdc48029c162eac6a1260c48eeb741c0f6f85
Deleted: sha256:2840550d82fa49d408cf5020dbbacd7dd472c0605f867dc79a62fa839cb716f9
Deleted: sha256:f72554269db5c07362f6585d520d53e60c5ed3f7df99143084b8a6426d412739
Deleted: sha256:2785755aa68b063bee3bd7a2f9d232bcd5cfb5f37b2e785e82aa1e164e23a282
Deleted: sha256:bf4005ea214b2443c5004ea6cde2b07d4ad00de3a2bdf81cc7dd0bf8a0a40abd
Deleted: sha256:55a3718fd769213d9b4cfc32d1e0b75927643ae88584c5bdd70b616e2ef8159d
Deleted: sha256:87aaaba9914c104da08882177a3007634623682ad59b72ccfe318a03bac029e6
Deleted: sha256:b11b68578a3bba81f35c2b58a3f5a8975283e624a78984392a68dfc0eb184036
Deleted: sha256:4d1ca0c352374aa6bd9834dd5e9b747e4b80bf9c5bed66f6ca3b22c6e3aa8678
Deleted: sha256:b2847bcb394020013ba7ffd2cb02ad0b6d26c8c0d51e595173b94cb35795bc92
Deleted: sha256:a9b597b20ad6f63dbc1005b448094592c69ab4d4e2e29bce5ab3533bbc85d1b8
Deleted: sha256:0c1326d1b821880eec83a53e2aaf3b1a002092d5e0c623f8a6ab77ca95353aa5
Deleted: sha256:7c3d781a8db37d01779f791e2bc46722db1cd47622235ae690b19aa2adcd9150
Deleted: sha256:ceef057959be2eb0bb03d2ad3aa3d73f674880ee20610375f78a9d66353c9973
Deleted: sha256:d21f7fe3288ffb7366c3fcbae0b5d45821c9f436fbd67f494926cb8fc84eb83f
Deleted: sha256:dd49a079c14b838532409dfe5fdf5d07c63792ddda51c7cf56dccf72c07e777f
Deleted: sha256:50d71b71a7cfd4b0e23c8f88fb7bd62c190a2ed7c783126de1503e233591def6
Deleted: sha256:a84695e274b6695219d6462331d532fd884dc3f57d9dbae2d458142ad5c4faf8
Build step 'Execute shell' marked build as failure

Mime
View raw message