mesos-builds mailing list archives

Site index · List index
Message view « Date » · « Thread »
Top « Date » · « Thread »
From Apache Jenkins Server <jenk...@builds.apache.org>
Subject Build failed in Jenkins: Mesos » cmake,gcc,--verbose --enable-libevent --enable-ssl,GLOG_v=1 MESOS_VERBOSE=1,centos:7,(docker||Hadoop)&&(!ubuntu-us1)&&(!ubuntu-6)&&(!ubuntu-eu2) #3037
Date Thu, 15 Dec 2016 19:53:42 GMT
See <https://builds.apache.org/job/Mesos/BUILDTOOL=cmake,COMPILER=gcc,CONFIGURATION=--verbose%20--enable-libevent%20--enable-ssl,ENVIRONMENT=GLOG_v=1%20MESOS_VERBOSE=1,OS=centos%3A7,label_exp=(docker%7C%7CHadoop)&&(!ubuntu-us1)&&(!ubuntu-6)&&(!ubuntu-eu2)/3037/changes>

Changes:

[toenshoff] Used correct shell string comparison operator in test.

[benjamin.hindman] Added a synchronous version of loop for io::read/write/redirect.

[benjamin.hindman] Used process::loop in infinitely recursive functions.

[yujie.jay] Kept the listening socket while accept is in flight.

[yujie.jay] Fixed overlay backend symlink error message.

[vinodkone] Updated contributors.yaml.

[vinodkone] Added tests for IOSwitchboard heartbeat.

[mpark] Fixed a few places to use `foreachkey` / `foreachvalue`.

[mpark] Changed implementation of `LinkedHashMap`.

[mpark] Enhanced `LinkedHashMap` to support `foreachpair` and friends.

[mpark] Modernized code to use `foreachpair` with `LinkedHashMap`.

[mpark] Updated stout's `README`.

[mpark] Removed unused header include from stout's `hashmap`.

[mpark] Updated the Windows doc to refer to `.\support\windows-build.bat`.

------------------------------------------
[...truncated 172115 lines...]
[ RUN      ] Endpoint/SlaveEndpointTest.AuthorizedRequest/1
I1215 19:51:53.526558 26075 containerizer.cpp:220] Using isolation: posix/cpu,posix/mem,filesystem/posix,network/cni
W1215 19:51:53.526862 26075 backend.cpp:76] Failed to create 'aufs' backend: AufsBackend requires
root privileges, but is running as user mesos
W1215 19:51:53.526943 26075 backend.cpp:76] Failed to create 'bind' backend: BindBackend requires
root privileges
I1215 19:51:53.527832 26082 slave.cpp:209] Mesos agent started on (664)@172.17.0.2:45151
I1215 19:51:53.527847 26082 slave.cpp:210] Flags at startup: --acls="" --appc_simple_discovery_uri_prefix="http://"
--appc_store_dir="/tmp/mesos/store/appc" --authenticate_http_readonly="true" --authenticate_http_readwrite="true"
--authenticatee="crammd5" --authentication_backoff_factor="1secs" --authorizer="local" --cgroups_cpu_enable_pids_and_tids_count="false"
--cgroups_enable_cfs="false" --cgroups_hierarchy="/sys/fs/cgroup" --cgroups_limit_swap="false"
--cgroups_root="mesos" --container_disk_watch_interval="15secs" --containerizers="mesos" --credential="/tmp/Endpoint_SlaveEndpointTest_AuthorizedRequest_1_lKUgdB/credential"
--default_role="*" --disk_watch_interval="1mins" --docker="docker" --docker_kill_orphans="true"
--docker_registry="https://registry-1.docker.io" --docker_remove_delay="6hrs" --docker_socket="/var/run/docker.sock"
--docker_stop_timeout="0ns" --docker_store_dir="/tmp/mesos/store/docker" --docker_volume_checkpoint_dir="/var/run/mesos/isolators/docker/volume"
--enforce_container_disk_quota="false" --executor_registration_timeout="1mins" --executor_shutdown_grace_period="5secs"
--fetcher_cache_dir="/tmp/Endpoint_SlaveEndpointTest_AuthorizedRequest_1_lKUgdB/fetch" --fetcher_cache_size="2GB"
--frameworks_home="" --gc_delay="1weeks" --gc_disk_headroom="0.1" --hadoop_home="" --help="false"
--hostname_lookup="true" --http_authenticators="basic" --http_command_executor="false" --http_credentials="/tmp/Endpoint_SlaveEndpointTest_AuthorizedRequest_1_lKUgdB/http_credentials"
--http_heartbeat_interval="30secs" --image_provisioner_backend="copy" --initialize_driver_logging="true"
--isolation="posix/cpu,posix/mem" --launcher="posix" --launcher_dir="/mesos/build/src" --logbufsecs="0"
--logging_level="INFO" --max_completed_executors_per_framework="150" --oversubscribed_resources_interval="15secs"
--perf_duration="10secs" --perf_interval="1mins" --qos_correction_interval_min="0ns" --quiet="false"
--recover="reconnect" --recovery_timeout="15mins" --registration_backoff_factor="10ms" --resources="cpus:2;gpus:0;mem:1024;disk:1024;ports:[31000-32000]"
--revocable_cpu_low_priority="true" --runtime_dir="/tmp/Endpoint_SlaveEndpointTest_AuthorizedRequest_1_lKUgdB"
--sandbox_directory="/mnt/mesos/sandbox" --strict="true" --switch_user="true" --systemd_enable_support="true"
--systemd_runtime_directory="/run/systemd/system" --version="false" --work_dir="/tmp/Endpoint_SlaveEndpointTest_AuthorizedRequest_1_ixAj3e"
I1215 19:51:53.528148 26082 credentials.hpp:86] Loading credential for authentication from
'/tmp/Endpoint_SlaveEndpointTest_AuthorizedRequest_1_lKUgdB/credential'
I1215 19:51:53.528224 26082 slave.cpp:352] Agent using credential for: test-principal
I1215 19:51:53.528275 26082 credentials.hpp:37] Loading credentials for authentication from
'/tmp/Endpoint_SlaveEndpointTest_AuthorizedRequest_1_lKUgdB/http_credentials'
I1215 19:51:53.528388 26082 http.cpp:922] Using default 'basic' HTTP authenticator for realm
'mesos-agent-readonly'
I1215 19:51:53.528434 26082 http.cpp:922] Using default 'basic' HTTP authenticator for realm
'mesos-agent-readwrite'
I1215 19:51:53.528748 26082 slave.cpp:539] Agent resources: cpus(*):2; mem(*):1024; disk(*):1024;
ports(*):[31000-32000]
I1215 19:51:53.528782 26082 slave.cpp:547] Agent attributes: [  ]
I1215 19:51:53.528789 26082 slave.cpp:552] Agent hostname: db5c24bc8e30
I1215 19:51:53.529136 26090 state.cpp:57] Recovering state from '/tmp/Endpoint_SlaveEndpointTest_AuthorizedRequest_1_ixAj3e/meta'
I1215 19:51:53.529289 26082 status_update_manager.cpp:203] Recovering status update manager
I1215 19:51:53.529462 26081 containerizer.cpp:594] Recovering containerizer
I1215 19:51:53.529934 26078 provisioner.cpp:253] Provisioner recovery complete
I1215 19:51:53.530122 26078 slave.cpp:5408] Finished recovery
I1215 19:51:53.530524 26078 slave.cpp:5582] Querying resource estimator for oversubscribable
resources
I1215 19:51:53.530642 26083 slave.cpp:5596] Received oversubscribable resources {} from the
resource estimator
I1215 19:51:53.531213 26083 process.cpp:3679] Handling HTTP event for process 'slave(664)'
with path: '/slave(664)/monitor/statistics.json'
I1215 19:51:53.531585 26079 http.cpp:874] Authorizing principal 'test-principal' to GET the
'/monitor/statistics.json' endpoint
I1215 19:51:53.532786 26076 slave.cpp:796] Agent terminating
[       OK ] Endpoint/SlaveEndpointTest.AuthorizedRequest/1 (10 ms)
[ RUN      ] Endpoint/SlaveEndpointTest.AuthorizedRequest/2
I1215 19:51:53.549335 26075 containerizer.cpp:220] Using isolation: posix/cpu,posix/mem,filesystem/posix,network/cni
W1215 19:51:53.549600 26075 backend.cpp:76] Failed to create 'aufs' backend: AufsBackend requires
root privileges, but is running as user mesos
W1215 19:51:53.549691 26075 backend.cpp:76] Failed to create 'bind' backend: BindBackend requires
root privileges
I1215 19:51:53.551046 26076 slave.cpp:209] Mesos agent started on (665)@172.17.0.2:45151
I1215 19:51:53.551071 26076 slave.cpp:210] Flags at startup: --acls="" --appc_simple_discovery_uri_prefix="http://"
--appc_store_dir="/tmp/mesos/store/appc" --authenticate_http_readonly="true" --authenticate_http_readwrite="true"
--authenticatee="crammd5" --authentication_backoff_factor="1secs" --authorizer="local" --cgroups_cpu_enable_pids_and_tids_count="false"
--cgroups_enable_cfs="false" --cgroups_hierarchy="/sys/fs/cgroup" --cgroups_limit_swap="false"
--cgroups_root="mesos" --container_disk_watch_interval="15secs" --containerizers="mesos" --credential="/tmp/Endpoint_SlaveEndpointTest_AuthorizedRequest_2_ZQnQ21/credential"
--default_role="*" --disk_watch_interval="1mins" --docker="docker" --docker_kill_orphans="true"
--docker_registry="https://registry-1.docker.io" --docker_remove_delay="6hrs" --docker_socket="/var/run/docker.sock"
--docker_stop_timeout="0ns" --docker_store_dir="/tmp/mesos/store/docker" --docker_volume_checkpoint_dir="/var/run/mesos/isolators/docker/volume"
--enforce_container_disk_quota="false" --executor_registration_timeout="1mins" --executor_shutdown_grace_period="5secs"
--fetcher_cache_dir="/tmp/Endpoint_SlaveEndpointTest_AuthorizedRequest_2_ZQnQ21/fetch" --fetcher_cache_size="2GB"
--frameworks_home="" --gc_delay="1weeks" --gc_disk_headroom="0.1" --hadoop_home="" --help="false"
--hostname_lookup="true" --http_authenticators="basic" --http_command_executor="false" --http_credentials="/tmp/Endpoint_SlaveEndpointTest_AuthorizedRequest_2_ZQnQ21/http_credentials"
--http_heartbeat_interval="30secs" --image_provisioner_backend="copy" --initialize_driver_logging="true"
--isolation="posix/cpu,posix/mem" --launcher="posix" --launcher_dir="/mesos/build/src" --logbufsecs="0"
--logging_level="INFO" --max_completed_executors_per_framework="150" --oversubscribed_resources_interval="15secs"
--perf_duration="10secs" --perf_interval="1mins" --qos_correction_interval_min="0ns" --quiet="false"
--recover="reconnect" --recovery_timeout="15mins" --registration_backoff_factor="10ms" --resources="cpus:2;gpus:0;mem:1024;disk:1024;ports:[31000-32000]"
--revocable_cpu_low_priority="true" --runtime_dir="/tmp/Endpoint_SlaveEndpointTest_AuthorizedRequest_2_ZQnQ21"
--sandbox_directory="/mnt/mesos/sandbox" --strict="true" --switch_user="true" --systemd_enable_support="true"
--systemd_runtime_directory="/run/systemd/system" --version="false" --work_dir="/tmp/Endpoint_SlaveEndpointTest_AuthorizedRequest_2_CtUbPF"
I1215 19:51:53.551457 26076 credentials.hpp:86] Loading credential for authentication from
'/tmp/Endpoint_SlaveEndpointTest_AuthorizedRequest_2_ZQnQ21/credential'
I1215 19:51:53.551565 26076 slave.cpp:352] Agent using credential for: test-principal
I1215 19:51:53.551584 26076 credentials.hpp:37] Loading credentials for authentication from
'/tmp/Endpoint_SlaveEndpointTest_AuthorizedRequest_2_ZQnQ21/http_credentials'
I1215 19:51:53.551705 26076 http.cpp:922] Using default 'basic' HTTP authenticator for realm
'mesos-agent-readonly'
I1215 19:51:53.551770 26076 http.cpp:922] Using default 'basic' HTTP authenticator for realm
'mesos-agent-readwrite'
I1215 19:51:53.552225 26076 slave.cpp:539] Agent resources: cpus(*):2; mem(*):1024; disk(*):1024;
ports(*):[31000-32000]
I1215 19:51:53.552304 26076 slave.cpp:547] Agent attributes: [  ]
I1215 19:51:53.552312 26076 slave.cpp:552] Agent hostname: db5c24bc8e30
I1215 19:51:53.552738 26076 state.cpp:57] Recovering state from '/tmp/Endpoint_SlaveEndpointTest_AuthorizedRequest_2_CtUbPF/meta'
I1215 19:51:53.552971 26088 status_update_manager.cpp:203] Recovering status update manager
I1215 19:51:53.553061 26076 containerizer.cpp:594] Recovering containerizer
I1215 19:51:53.553647 26090 provisioner.cpp:253] Provisioner recovery complete
I1215 19:51:53.553845 26088 slave.cpp:5408] Finished recovery
I1215 19:51:53.554278 26088 slave.cpp:5582] Querying resource estimator for oversubscribable
resources
I1215 19:51:53.554412 26081 slave.cpp:5596] Received oversubscribable resources {} from the
resource estimator
I1215 19:51:53.555058 26084 process.cpp:3679] Handling HTTP event for process 'slave(665)'
with path: '/slave(665)/containers'
I1215 19:51:53.555524 26084 http.cpp:874] Authorizing principal 'test-principal' to GET the
'/containers' endpoint
I1215 19:51:53.556947 26088 slave.cpp:796] Agent terminating
[       OK ] Endpoint/SlaveEndpointTest.AuthorizedRequest/2 (12 ms)
[ RUN      ] Endpoint/SlaveEndpointTest.UnauthorizedRequest/0
I1215 19:51:53.571004 26075 containerizer.cpp:220] Using isolation: posix/cpu,posix/mem,filesystem/posix,network/cni
W1215 19:51:53.571368 26075 backend.cpp:76] Failed to create 'aufs' backend: AufsBackend requires
root privileges, but is running as user mesos
W1215 19:51:53.571460 26075 backend.cpp:76] Failed to create 'bind' backend: BindBackend requires
root privileges
I1215 19:51:53.572580 26083 slave.cpp:209] Mesos agent started on (666)@172.17.0.2:45151
I1215 19:51:53.572597 26083 slave.cpp:210] Flags at startup: --acls="" --appc_simple_discovery_uri_prefix="http://"
--appc_store_dir="/tmp/mesos/store/appc" --authenticate_http_readonly="true" --authenticate_http_readwrite="true"
--authenticatee="crammd5" --authentication_backoff_factor="1secs" --authorizer="local" --cgroups_cpu_enable_pids_and_tids_count="false"
--cgroups_enable_cfs="false" --cgroups_hierarchy="/sys/fs/cgroup" --cgroups_limit_swap="false"
--cgroups_root="mesos" --container_disk_watch_interval="15secs" --containerizers="mesos" --credential="/tmp/Endpoint_SlaveEndpointTest_UnauthorizedRequest_0_TEBD6s/credential"
--default_role="*" --disk_watch_interval="1mins" --docker="docker" --docker_kill_orphans="true"
--docker_registry="https://registry-1.docker.io" --docker_remove_delay="6hrs" --docker_socket="/var/run/docker.sock"
--docker_stop_timeout="0ns" --docker_store_dir="/tmp/mesos/store/docker" --docker_volume_checkpoint_dir="/var/run/mesos/isolators/docker/volume"
--enforce_container_disk_quota="false" --executor_registration_timeout="1mins" --executor_shutdown_grace_period="5secs"
--fetcher_cache_dir="/tmp/Endpoint_SlaveEndpointTest_UnauthorizedRequest_0_TEBD6s/fetch" --fetcher_cache_size="2GB"
--frameworks_home="" --gc_delay="1weeks" --gc_disk_headroom="0.1" --hadoop_home="" --help="false"
--hostname_lookup="true" --http_authenticators="basic" --http_command_executor="false" --http_credentials="/tmp/Endpoint_SlaveEndpointTest_UnauthorizedRequest_0_TEBD6s/http_credentials"
--http_heartbeat_interval="30secs" --image_provisioner_backend="copy" --initialize_driver_logging="true"
--isolation="posix/cpu,posix/mem" --launcher="posix" --launcher_dir="/mesos/build/src" --logbufsecs="0"
--logging_level="INFO" --max_completed_executors_per_framework="150" --oversubscribed_resources_interval="15secs"
--perf_duration="10secs" --perf_interval="1mins" --qos_correction_interval_min="0ns" --quiet="false"
--recover="reconnect" --recovery_timeout="15mins" --registration_backoff_factor="10ms" --resources="cpus:2;gpus:0;mem:1024;disk:1024;ports:[31000-32000]"
--revocable_cpu_low_priority="true" --runtime_dir="/tmp/Endpoint_SlaveEndpointTest_UnauthorizedRequest_0_TEBD6s"
--sandbox_directory="/mnt/mesos/sandbox" --strict="true" --switch_user="true" --systemd_enable_support="true"
--systemd_runtime_directory="/run/systemd/system" --version="false" --work_dir="/tmp/Endpoint_SlaveEndpointTest_UnauthorizedRequest_0_2hMvP6"
I1215 19:51:53.572960 26083 credentials.hpp:86] Loading credential for authentication from
'/tmp/Endpoint_SlaveEndpointTest_UnauthorizedRequest_0_TEBD6s/credential'
I1215 19:51:53.573057 26083 slave.cpp:352] Agent using credential for: test-principal
I1215 19:51:53.573073 26083 credentials.hpp:37] Loading credentials for authentication from
'/tmp/Endpoint_SlaveEndpointTest_UnauthorizedRequest_0_TEBD6s/http_credentials'
I1215 19:51:53.573186 26083 http.cpp:922] Using default 'basic' HTTP authenticator for realm
'mesos-agent-readonly'
I1215 19:51:53.573228 26083 http.cpp:922] Using default 'basic' HTTP authenticator for realm
'mesos-agent-readwrite'
I1215 19:51:53.573561 26083 slave.cpp:539] Agent resources: cpus(*):2; mem(*):1024; disk(*):1024;
ports(*):[31000-32000]
I1215 19:51:53.573595 26083 slave.cpp:547] Agent attributes: [  ]
I1215 19:51:53.573603 26083 slave.cpp:552] Agent hostname: db5c24bc8e30
I1215 19:51:53.574029 26078 state.cpp:57] Recovering state from '/tmp/Endpoint_SlaveEndpointTest_UnauthorizedRequest_0_2hMvP6/meta'
I1215 19:51:53.574301 26090 status_update_manager.cpp:203] Recovering status update manager
I1215 19:51:53.574398 26081 containerizer.cpp:594] Recovering containerizer
I1215 19:51:53.575264 26087 provisioner.cpp:253] Provisioner recovery complete
I1215 19:51:53.575489 26091 slave.cpp:5408] Finished recovery
I1215 19:51:53.575958 26091 slave.cpp:5582] Querying resource estimator for oversubscribable
resources
I1215 19:51:53.576056 26076 slave.cpp:5596] Received oversubscribable resources {} from the
resource estimator
I1215 19:51:53.576655 26081 process.cpp:3679] Handling HTTP event for process 'slave(666)'
with path: '/slave(666)/monitor/statistics'
I1215 19:51:53.577039 26082 http.cpp:874] Authorizing principal 'test-principal' to GET the
'/monitor/statistics' endpoint
I1215 19:51:53.577767 26077 slave.cpp:796] Agent terminating
[       OK ] Endpoint/SlaveEndpointTest.UnauthorizedRequest/0 (11 ms)
[ RUN      ] Endpoint/SlaveEndpointTest.UnauthorizedRequest/1
I1215 19:51:53.586745 26075 containerizer.cpp:220] Using isolation: posix/cpu,posix/mem,filesystem/posix,network/cni
W1215 19:51:53.587064 26075 backend.cpp:76] Failed to create 'aufs' backend: AufsBackend requires
root privileges, but is running as user mesos
W1215 19:51:53.587199 26075 backend.cpp:76] Failed to create 'bind' backend: BindBackend requires
root privileges
I1215 19:51:53.587983 26085 slave.cpp:209] Mesos agent started on (667)@172.17.0.2:45151
I1215 19:51:53.588014 26085 slave.cpp:210] Flags at startup: --acls="" --appc_simple_discovery_uri_prefix="http://"
--appc_store_dir="/tmp/mesos/store/appc" --authenticate_http_readonly="true" --authenticate_http_readwrite="true"
--authenticatee="crammd5" --authentication_backoff_factor="1secs" --authorizer="local" --cgroups_cpu_enable_pids_and_tids_count="false"
--cgroups_enable_cfs="false" --cgroups_hierarchy="/sys/fs/cgroup" --cgroups_limit_swap="false"
--cgroups_root="mesos" --container_disk_watch_interval="15secs" --containerizers="mesos" --credential="/tmp/Endpoint_SlaveEndpointTest_UnauthorizedRequest_1_ZnhRlU/credential"
--default_role="*" --disk_watch_interval="1mins" --docker="docker" --docker_kill_orphans="true"
--docker_registry="https://registry-1.docker.io" --docker_remove_delay="6hrs" --docker_socket="/var/run/docker.sock"
--docker_stop_timeout="0ns" --docker_store_dir="/tmp/mesos/store/docker" --docker_volume_checkpoint_dir="/var/run/mesos/isolators/docker/volume"
--enforce_container_disk_quota="false" --executor_registration_timeout="1mins" --executor_shutdown_grace_period="5secs"
--fetcher_cache_dir="/tmp/Endpoint_SlaveEndpointTest_UnauthorizedRequest_1_ZnhRlU/fetch" --fetcher_cache_size="2GB"
--frameworks_home="" --gc_delay="1weeks" --gc_disk_headroom="0.1" --hadoop_home="" --help="false"
--hostname_lookup="true" --http_authenticators="basic" --http_command_executor="false" --http_credentials="/tmp/Endpoint_SlaveEndpointTest_UnauthorizedRequest_1_ZnhRlU/http_credentials"
--http_heartbeat_interval="30secs" --image_provisioner_backend="copy" --initialize_driver_logging="true"
--isolation="posix/cpu,posix/mem" --launcher="posix" --launcher_dir="/mesos/build/src" --logbufsecs="0"
--logging_level="INFO" --max_completed_executors_per_framework="150" --oversubscribed_resources_interval="15secs"
--perf_duration="10secs" --perf_interval="1mins" --qos_correction_interval_min="0ns" --quiet="false"
--recover="reconnect" --recovery_timeout="15mins" --registration_backoff_factor="10ms" --resources="cpus:2;gpus:0;mem:1024;disk:1024;ports:[31000-32000]"
--revocable_cpu_low_priority="true" --runtime_dir="/tmp/Endpoint_SlaveEndpointTest_UnauthorizedRequest_1_ZnhRlU"
--sandbox_directory="/mnt/mesos/sandbox" --strict="true" --switch_user="true" --systemd_enable_support="true"
--systemd_runtime_directory="/run/systemd/system" --version="false" --work_dir="/tmp/Endpoint_SlaveEndpointTest_UnauthorizedRequest_1_CS261x"
I1215 19:51:53.588307 26085 credentials.hpp:86] Loading credential for authentication from
'/tmp/Endpoint_SlaveEndpointTest_UnauthorizedRequest_1_ZnhRlU/credential'
I1215 19:51:53.588379 26085 slave.cpp:352] Agent using credential for: test-principal
I1215 19:51:53.588415 26085 credentials.hpp:37] Loading credentials for authentication from
'/tmp/Endpoint_SlaveEndpointTest_UnauthorizedRequest_1_ZnhRlU/http_credentials'
I1215 19:51:53.588512 26085 http.cpp:922] Using default 'basic' HTTP authenticator for realm
'mesos-agent-readonly'
I1215 19:51:53.588563 26085 http.cpp:922] Using default 'basic' HTTP authenticator for realm
'mesos-agent-readwrite'
I1215 19:51:53.588953 26085 slave.cpp:539] Agent resources: cpus(*):2; mem(*):1024; disk(*):1024;
ports(*):[31000-32000]
I1215 19:51:53.588987 26085 slave.cpp:547] Agent attributes: [  ]
I1215 19:51:53.588992 26085 slave.cpp:552] Agent hostname: db5c24bc8e30
I1215 19:51:53.589474 26082 state.cpp:57] Recovering state from '/tmp/Endpoint_SlaveEndpointTest_UnauthorizedRequest_1_CS261x/meta'
I1215 19:51:53.589646 26090 status_update_manager.cpp:203] Recovering status update manager
I1215 19:51:53.589735 26087 containerizer.cpp:594] Recovering containerizer
I1215 19:51:53.590251 26077 provisioner.cpp:253] Provisioner recovery complete
I1215 19:51:53.590389 26086 slave.cpp:5408] Finished recovery
I1215 19:51:53.590680 26086 slave.cpp:5582] Querying resource estimator for oversubscribable
resources
I1215 19:51:53.590790 26077 slave.cpp:5596] Received oversubscribable resources {} from the
resource estimator
I1215 19:51:53.591352 26091 process.cpp:3679] Handling HTTP event for process 'slave(667)'
with path: '/slave(667)/monitor/statistics.json'
I1215 19:51:53.591714 26081 http.cpp:874] Authorizing principal 'test-principal' to GET the
'/monitor/statistics.json' endpoint
I1215 19:51:53.592543 26085 slave.cpp:796] Agent terminating
[       OK ] Endpoint/SlaveEndpointTest.UnauthorizedRequest/1 (11 ms)
[ RUN      ] Endpoint/SlaveEndpointTest.UnauthorizedRequest/2
I1215 19:51:53.598932 26075 containerizer.cpp:220] Using isolation: posix/cpu,posix/mem,filesystem/posix,network/cni
W1215 19:51:53.599347 26075 backend.cpp:76] Failed to create 'aufs' backend: AufsBackend requires
root privileges, but is running as user mesos
W1215 19:51:53.599439 26075 backend.cpp:76] Failed to create 'bind' backend: BindBackend requires
root privileges
I1215 19:51:53.600651 26084 slave.cpp:209] Mesos agent started on (668)@172.17.0.2:45151
I1215 19:51:53.600716 26084 slave.cpp:210] Flags at startup: --acls="" --appc_simple_discovery_uri_prefix="http://"
--appc_store_dir="/tmp/mesos/store/appc" --authenticate_http_readonly="true" --authenticate_http_readwrite="true"
--authenticatee="crammd5" --authentication_backoff_factor="1secs" --authorizer="local" --cgroups_cpu_enable_pids_and_tids_count="false"
--cgroups_enable_cfs="false" --cgroups_hierarchy="/sys/fs/cgroup" --cgroups_limit_swap="false"
--cgroups_root="mesos" --container_disk_watch_interval="15secs" --containerizers="mesos" --credential="/tmp/Endpoint_SlaveEndpointTest_UnauthorizedRequest_2_BJzbJl/credential"
--default_role="*" --disk_watch_interval="1mins" --docker="docker" --docker_kill_orphans="true"
--docker_registry="https://registry-1.docker.io" --docker_remove_delay="6hrs" --docker_socket="/var/run/docker.sock"
--docker_stop_timeout="0ns" --docker_store_dir="/tmp/mesos/store/docker" --docker_volume_checkpoint_dir="/var/run/mesos/isolators/docker/volume"
--enforce_container_disk_quota="false" --executor_registration_timeout="1mins" --executor_shutdown_grace_period="5secs"
--fetcher_cache_dir="/tmp/Endpoint_SlaveEndpointTest_UnauthorizedRequest_2_BJzbJl/fetch" --fetcher_cache_size="2GB"
--frameworks_home="" --gc_delay="1weeks" --gc_disk_headroom="0.1" --hadoop_home="" --help="false"
--hostname_lookup="true" --http_authenticators="basic" --http_command_executor="false" --http_credentials="/tmp/Endpoint_SlaveEndpointTest_UnauthorizedRequest_2_BJzbJl/http_credentials"
--http_heartbeat_interval="30secs" --image_provisioner_backend="copy" --initialize_driver_logging="true"
--isolation="posix/cpu,posix/mem" --launcher="posix" --launcher_dir="/mesos/build/src" --logbufsecs="0"
--logging_level="INFO" --max_completed_executors_per_framework="150" --oversubscribed_resources_interval="15secs"
--perf_duration="10secs" --perf_interval="1mins" --qos_correction_interval_min="0ns" --quiet="false"
--recover="reconnect" --recovery_timeout="15mins" --registration_backoff_factor="10ms" --resources="cpus:2;gpus:0;mem:1024;disk:1024;ports:[31000-32000]"
--revocable_cpu_low_priority="true" --runtime_dir="/tmp/Endpoint_SlaveEndpointTest_UnauthorizedRequest_2_BJzbJl"
--sandbox_directory="/mnt/mesos/sandbox" --strict="true" --switch_user="true" --systemd_enable_support="true"
--systemd_runtime_directory="/run/systemd/system" --version="false" --work_dir="/tmp/Endpoint_SlaveEndpointTest_UnauthorizedRequest_2_YtzwnZ"
I1215 19:51:53.601107 26084 credentials.hpp:86] Loading credential for authentication from
'/tmp/Endpoint_SlaveEndpointTest_UnauthorizedRequest_2_BJzbJl/credential'
I1215 19:51:53.601236 26084 slave.cpp:352] Agent using credential for: test-principal
I1215 19:51:53.601259 26084 credentials.hpp:37] Loading credentials for authentication from
'/tmp/Endpoint_SlaveEndpointTest_UnauthorizedRequest_2_BJzbJl/http_credentials'
I1215 19:51:53.601395 26084 http.cpp:922] Using default 'basic' HTTP authenticator for realm
'mesos-agent-readonly'
I1215 19:51:53.601457 26084 http.cpp:922] Using default 'basic' HTTP authenticator for realm
'mesos-agent-readwrite'
I1215 19:51:53.601940 26084 slave.cpp:539] Agent resources: cpus(*):2; mem(*):1024; disk(*):1024;
ports(*):[31000-32000]
I1215 19:51:53.601984 26084 slave.cpp:547] Agent attributes: [  ]
I1215 19:51:53.601992 26084 slave.cpp:552] Agent hostname: db5c24bc8e30
I1215 19:51:53.602437 26083 state.cpp:57] Recovering state from '/tmp/Endpoint_SlaveEndpointTest_UnauthorizedRequest_2_YtzwnZ/meta'
I1215 19:51:53.602574 26079 status_update_manager.cpp:203] Recovering status update manager
I1215 19:51:53.602766 26079 containerizer.cpp:594] Recovering containerizer
I1215 19:51:53.603476 26089 provisioner.cpp:253] Provisioner recovery complete
I1215 19:51:53.603684 26089 slave.cpp:5408] Finished recovery
I1215 19:51:53.604107 26089 slave.cpp:5582] Querying resource estimator for oversubscribable
resources
I1215 19:51:53.604334 26079 slave.cpp:5596] Received oversubscribable resources {} from the
resource estimator
I1215 19:51:53.604990 26091 process.cpp:3679] Handling HTTP event for process 'slave(668)'
with path: '/slave(668)/containers'
I1215 19:51:53.605459 26081 http.cpp:874] Authorizing principal 'test-principal' to GET the
'/containers' endpoint
I1215 19:51:53.606632 26078 slave.cpp:796] Agent terminating
[       OK ] Endpoint/SlaveEndpointTest.UnauthorizedRequest/2 (12 ms)
[ RUN      ] Endpoint/SlaveEndpointTest.NoAuthorizer/0
I1215 19:51:53.615386 26075 containerizer.cpp:220] Using isolation: posix/cpu,posix/mem,filesystem/posix,network/cni
W1215 19:51:53.615738 26075 backend.cpp:76] Failed to create 'aufs' backend: AufsBackend requires
root privileges, but is running as user mesos
W1215 19:51:53.615829 26075 backend.cpp:76] Failed to create 'bind' backend: BindBackend requires
root privileges
I1215 19:51:53.616487 26075 cluster.cpp:446] Creating default 'local' authorizer
I1215 19:51:53.617007 26082 slave.cpp:209] Mesos agent started on (669)@172.17.0.2:45151
I1215 19:51:53.617025 26082 slave.cpp:210] Flags at startup: --acls="" --appc_simple_discovery_uri_prefix="http://"
--appc_store_dir="/tmp/mesos/store/appc" --authenticate_http_readonly="true" --authenticate_http_readwrite="true"
--authenticatee="crammd5" --authentication_backoff_factor="1secs" --authorizer="local" --cgroups_cpu_enable_pids_and_tids_count="false"
--cgroups_enable_cfs="false" --cgroups_hierarchy="/sys/fs/cgroup" --cgroups_limit_swap="false"
--cgroups_root="mesos" --container_disk_watch_interval="15secs" --containerizers="mesos" --credential="/tmp/Endpoint_SlaveEndpointTest_NoAuthorizer_0_5j9IgN/credential"
--default_role="*" --disk_watch_interval="1mins" --docker="docker" --docker_kill_orphans="true"
--docker_registry="https://registry-1.docker.io" --docker_remove_delay="6hrs" --docker_socket="/var/run/docker.sock"
--docker_stop_timeout="0ns" --docker_store_dir="/tmp/mesos/store/docker" --docker_volume_checkpoint_dir="/var/run/mesos/isolators/docker/volume"
--enforce_container_disk_quota="false" --executor_registration_timeout="1mins" --executor_shutdown_grace_period="5secs"
--fetcher_cache_dir="/tmp/Endpoint_SlaveEndpointTest_NoAuthorizer_0_5j9IgN/fetch" --fetcher_cache_size="2GB"
--frameworks_home="" --gc_delay="1weeks" --gc_disk_headroom="0.1" --hadoop_home="" --help="false"
--hostname_lookup="true" --http_authenticators="basic" --http_command_executor="false" --http_credentials="/tmp/Endpoint_SlaveEndpointTest_NoAuthorizer_0_5j9IgN/http_credentials"
--http_heartbeat_interval="30secs" --image_provisioner_backend="copy" --initialize_driver_logging="true"
--isolation="posix/cpu,posix/mem" --launcher="posix" --launcher_dir="/mesos/build/src" --logbufsecs="0"
--logging_level="INFO" --max_completed_executors_per_framework="150" --oversubscribed_resources_interval="15secs"
--perf_duration="10secs" --perf_interval="1mins" --qos_correction_interval_min="0ns" --quiet="false"
--recover="reconnect" --recovery_timeout="15mins" --registration_backoff_factor="10ms" --resources="cpus:2;gpus:0;mem:1024;disk:1024;ports:[31000-32000]"
--revocable_cpu_low_priority="true" --runtime_dir="/tmp/Endpoint_SlaveEndpointTest_NoAuthorizer_0_5j9IgN"
--sandbox_directory="/mnt/mesos/sandbox" --strict="true" --switch_user="true" --systemd_enable_support="true"
--systemd_runtime_directory="/run/systemd/system" --version="false" --work_dir="/tmp/Endpoint_SlaveEndpointTest_NoAuthorizer_0_kXpoSq"
I1215 19:51:53.617369 26082 credentials.hpp:86] Loading credential for authentication from
'/tmp/Endpoint_SlaveEndpointTest_NoAuthorizer_0_5j9IgN/credential'
I1215 19:51:53.617461 26082 slave.cpp:352] Agent using credential for: test-principal
I1215 19:51:53.617476 26082 credentials.hpp:37] Loading credentials for authentication from
'/tmp/Endpoint_SlaveEndpointTest_NoAuthorizer_0_5j9IgN/http_credentials'
I1215 19:51:53.617620 26082 http.cpp:922] Using default 'basic' HTTP authenticator for realm
'mesos-agent-readonly'
I1215 19:51:53.617674 26082 http.cpp:922] Using default 'basic' HTTP authenticator for realm
'mesos-agent-readwrite'
I1215 19:51:53.618149 26082 slave.cpp:539] Agent resources: cpus(*):2; mem(*):1024; disk(*):1024;
ports(*):[31000-32000]
I1215 19:51:53.618186 26082 slave.cpp:547] Agent attributes: [  ]
I1215 19:51:53.618192 26082 slave.cpp:552] Agent hostname: db5c24bc8e30
I1215 19:51:53.618612 26076 state.cpp:57] Recovering state from '/tmp/Endpoint_SlaveEndpointTest_NoAuthorizer_0_kXpoSq/meta'
I1215 19:51:53.618805 26083 status_update_manager.cpp:203] Recovering status update manager
I1215 19:51:53.618896 26078 containerizer.cpp:594] Recovering containerizer
I1215 19:51:53.619386 26089 provisioner.cpp:253] Provisioner recovery complete
I1215 19:51:53.619544 26089 slave.cpp:5408] Finished recovery
I1215 19:51:53.619875 26089 slave.cpp:5582] Querying resource estimator for oversubscribable
resources
I1215 19:51:53.620005 26084 slave.cpp:5596] Received oversubscribable resources {} from the
resource estimator
I1215 19:51:53.620805 26089 process.cpp:3679] Handling HTTP event for process 'slave(669)'
with path: '/slave(669)/monitor/statistics'
I1215 19:51:53.621167 26076 http.cpp:874] Authorizing principal 'test-principal' to GET the
'/monitor/statistics' endpoint
I1215 19:51:53.622506 26075 slave.cpp:796] Agent terminating
[       OK ] Endpoint/SlaveEndpointTest.NoAuthorizer/0 (12 ms)
[ RUN      ] Endpoint/SlaveEndpointTest.NoAuthorizer/1
I1215 19:51:53.627488 26075 containerizer.cpp:220] Using isolation: posix/cpu,posix/mem,filesystem/posix,network/cni
W1215 19:51:53.627771 26075 backend.cpp:76] Failed to create 'aufs' backend: AufsBackend requires
root privileges, but is running as user mesos
W1215 19:51:53.627849 26075 backend.cpp:76] Failed to create 'bind' backend: BindBackend requires
root privileges
I1215 19:51:53.628664 26075 cluster.cpp:446] Creating default 'local' authorizer
I1215 19:51:53.629281 26083 slave.cpp:209] Mesos agent started on (670)@172.17.0.2:45151
I1215 19:51:53.629300 26083 slave.cpp:210] Flags at startup: --acls="" --appc_simple_discovery_uri_prefix="http://"
--appc_store_dir="/tmp/mesos/store/appc" --authenticate_http_readonly="true" --authenticate_http_readwrite="true"
--authenticatee="crammd5" --authentication_backoff_factor="1secs" --authorizer="local" --cgroups_cpu_enable_pids_and_tids_count="false"
--cgroups_enable_cfs="false" --cgroups_hierarchy="/sys/fs/cgroup" --cgroups_limit_swap="false"
--cgroups_root="mesos" --container_disk_watch_interval="15secs" --containerizers="mesos" --credential="/tmp/Endpoint_SlaveEndpointTest_NoAuthorizer_1_VKkSWe/credential"
--default_role="*" --disk_watch_interval="1mins" --docker="docker" --docker_kill_orphans="true"
--docker_registry="https://registry-1.docker.io" --docker_remove_delay="6hrs" --docker_socket="/var/run/docker.sock"
--docker_stop_timeout="0ns" --docker_store_dir="/tmp/mesos/store/docker" --docker_volume_checkpoint_dir="/var/run/mesos/isolators/docker/volume"
--enforce_container_disk_quota="false" --executor_registration_timeout="1mins" --executor_shutdown_grace_period="5secs"
--fetcher_cache_dir="/tmp/Endpoint_SlaveEndpointTest_NoAuthorizer_1_VKkSWe/fetch" --fetcher_cache_size="2GB"
--frameworks_home="" --gc_delay="1weeks" --gc_disk_headroom="0.1" --hadoop_home="" --help="false"
--hostname_lookup="true" --http_authenticators="basic" --http_command_executor="false" --http_credentials="/tmp/Endpoint_SlaveEndpointTest_NoAuthorizer_1_VKkSWe/http_credentials"
--http_heartbeat_interval="30secs" --image_provisioner_backend="copy" --initialize_driver_logging="true"
--isolation="posix/cpu,posix/mem" --launcher="posix" --launcher_dir="/mesos/build/src" --logbufsecs="0"
--logging_level="INFO" --max_completed_executors_per_framework="150" --oversubscribed_resources_interval="15secs"
--perf_duration="10secs" --perf_interval="1mins" --qos_correction_interval_min="0ns" --quiet="false"
--recover="reconnect" --recovery_timeout="15mins" --registration_backoff_factor="10ms" --resources="cpus:2;gpus:0;mem:1024;disk:1024;ports:[31000-32000]"
--revocable_cpu_low_priority="true" --runtime_dir="/tmp/Endpoint_SlaveEndpointTest_NoAuthorizer_1_VKkSWe"
--sandbox_directory="/mnt/mesos/sandbox" --strict="true" --switch_user="true" --systemd_enable_support="true"
--systemd_runtime_directory="/run/systemd/system" --version="false" --work_dir="/tmp/Endpoint_SlaveEndpointTest_NoAuthorizer_1_k8bxwS"
I1215 19:51:53.629737 26083 credentials.hpp:86] Loading credential for authentication from
'/tmp/Endpoint_SlaveEndpointTest_NoAuthorizer_1_VKkSWe/credential'
I1215 19:51:53.629829 26083 slave.cpp:352] Agent using credential for: test-principal
I1215 19:51:53.629845 26083 credentials.hpp:37] Loading credentials for authentication from
'/tmp/Endpoint_SlaveEndpointTest_NoAuthorizer_1_VKkSWe/http_credentials'
I1215 19:51:53.629956 26083 http.cpp:922] Using default 'basic' HTTP authenticator for realm
'mesos-agent-readonly'
I1215 19:51:53.630007 26083 http.cpp:922] Using default 'basic' HTTP authenticator for realm
'mesos-agent-readwrite'
I1215 19:51:53.630456 26083 slave.cpp:539] Agent resources: cpus(*):2; mem(*):1024; disk(*):1024;
ports(*):[31000-32000]
I1215 19:51:53.630502 26083 slave.cpp:547] Agent attributes: [  ]
I1215 19:51:53.630514 26083 slave.cpp:552] Agent hostname: db5c24bc8e30
I1215 19:51:53.631070 26082 state.cpp:57] Recovering state from '/tmp/Endpoint_SlaveEndpointTest_NoAuthorizer_1_k8bxwS/meta'
I1215 19:51:53.631207 26080 status_update_manager.cpp:203] Recovering status update manager
I1215 19:51:53.631467 26089 containerizer.cpp:594] Recovering containerizer
I1215 19:51:53.632215 26079 provisioner.cpp:253] Provisioner recovery complete
I1215 19:51:53.632529 26090 slave.cpp:5408] Finished recovery
I1215 19:51:53.632930 26090 slave.cpp:5582] Querying resource estimator for oversubscribable
resources
I1215 19:51:53.633035 26091 slave.cpp:5596] Received oversubscribable resources {} from the
resource estimator
I1215 19:51:53.633765 26084 process.cpp:3679] Handling HTTP event for process 'slave(670)'
with path: '/slave(670)/monitor/statistics.json'
I1215 19:51:53.634348 26086 http.cpp:874] Authorizing principal 'test-principal' to GET the
'/monitor/statistics.json' endpoint
I1215 19:51:53.636317 26078 slave.cpp:796] Agent terminating
[       OK ] Endpoint/SlaveEndpointTest.NoAuthorizer/1 (14 ms)
[ RUN      ] Endpoint/SlaveEndpointTest.NoAuthorizer/2
I1215 19:51:53.641372 26075 containerizer.cpp:220] Using isolation: posix/cpu,posix/mem,filesystem/posix,network/cni
W1215 19:51:53.641640 26075 backend.cpp:76] Failed to create 'aufs' backend: AufsBackend requires
root privileges, but is running as user mesos
W1215 19:51:53.641772 26075 backend.cpp:76] Failed to create 'bind' backend: BindBackend requires
root privileges
I1215 19:51:53.642498 26075 cluster.cpp:446] Creating default 'local' authorizer
I1215 19:51:53.642905 26081 slave.cpp:209] Mesos agent started on (671)@172.17.0.2:45151
I1215 19:51:53.642917 26081 slave.cpp:210] Flags at startup: --acls="" --appc_simple_discovery_uri_prefix="http://"
--appc_store_dir="/tmp/mesos/store/appc" --authenticate_http_readonly="true" --authenticate_http_readwrite="true"
--authenticatee="crammd5" --authentication_backoff_factor="1secs" --authorizer="local" --cgroups_cpu_enable_pids_and_tids_count="false"
--cgroups_enable_cfs="false" --cgroups_hierarchy="/sys/fs/cgroup" --cgroups_limit_swap="false"
--cgroups_root="mesos" --container_disk_watch_interval="15secs" --containerizers="mesos" --credential="/tmp/Endpoint_SlaveEndpointTest_NoAuthorizer_2_5ZuTLG/credential"
--default_role="*" --disk_watch_interval="1mins" --docker="docker" --docker_kill_orphans="true"
--docker_registry="https://registry-1.docker.io" --docker_remove_delay="6hrs" --docker_socket="/var/run/docker.sock"
--docker_stop_timeout="0ns" --docker_store_dir="/tmp/mesos/store/docker" --docker_volume_checkpoint_dir="/var/run/mesos/isolators/docker/volume"
--enforce_container_disk_quota="false" --executor_registration_timeout="1mins" --executor_shutdown_grace_period="5secs"
--fetcher_cache_dir="/tmp/Endpoint_SlaveEndpointTest_NoAuthorizer_2_5ZuTLG/fetch" --fetcher_cache_size="2GB"
--frameworks_home="" --gc_delay="1weeks" --gc_disk_headroom="0.1" --hadoop_home="" --help="false"
--hostname_lookup="true" --http_authenticators="basic" --http_command_executor="false" --http_credentials="/tmp/Endpoint_SlaveEndpointTest_NoAuthorizer_2_5ZuTLG/http_credentials"
--http_heartbeat_interval="30secs" --image_provisioner_backend="copy" --initialize_driver_logging="true"
--isolation="posix/cpu,posix/mem" --launcher="posix" --launcher_dir="/mesos/build/src" --logbufsecs="0"
--logging_level="INFO" --max_completed_executors_per_framework="150" --oversubscribed_resources_interval="15secs"
--perf_duration="10secs" --perf_interval="1mins" --qos_correction_interval_min="0ns" --quiet="false"
--recover="reconnect" --recovery_timeout="15mins" --registration_backoff_factor="10ms" --resources="cpus:2;gpus:0;mem:1024;disk:1024;ports:[31000-32000]"
--revocable_cpu_low_priority="true" --runtime_dir="/tmp/Endpoint_SlaveEndpointTest_NoAuthorizer_2_5ZuTLG"
--sandbox_directory="/mnt/mesos/sandbox" --strict="true" --switch_user="true" --systemd_enable_support="true"
--systemd_runtime_directory="/run/systemd/system" --version="false" --work_dir="/tmp/Endpoint_SlaveEndpointTest_NoAuthorizer_2_y5Xijk"
I1215 19:51:53.643211 26081 credentials.hpp:86] Loading credential for authentication from
'/tmp/Endpoint_SlaveEndpointTest_NoAuthorizer_2_5ZuTLG/credential'
I1215 19:51:53.643307 26081 slave.cpp:352] Agent using credential for: test-principal
I1215 19:51:53.643324 26081 credentials.hpp:37] Loading credentials for authentication from
'/tmp/Endpoint_SlaveEndpointTest_NoAuthorizer_2_5ZuTLG/http_credentials'
I1215 19:51:53.643452 26081 http.cpp:922] Using default 'basic' HTTP authenticator for realm
'mesos-agent-readonly'
I1215 19:51:53.643496 26081 http.cpp:922] Using default 'basic' HTTP authenticator for realm
'mesos-agent-readwrite'
I1215 19:51:53.643828 26081 slave.cpp:539] Agent resources: cpus(*):2; mem(*):1024; disk(*):1024;
ports(*):[31000-32000]
I1215 19:51:53.643862 26081 slave.cpp:547] Agent attributes: [  ]
I1215 19:51:53.643867 26081 slave.cpp:552] Agent hostname: db5c24bc8e30
I1215 19:51:53.644258 26091 state.cpp:57] Recovering state from '/tmp/Endpoint_SlaveEndpointTest_NoAuthorizer_2_y5Xijk/meta'
I1215 19:51:53.644420 26090 status_update_manager.cpp:203] Recovering status update manager
I1215 19:51:53.644544 26084 containerizer.cpp:594] Recovering containerizer
I1215 19:51:53.645014 26089 provisioner.cpp:253] Provisioner recovery complete
I1215 19:51:53.645248 26077 slave.cpp:5408] Finished recovery
I1215 19:51:53.645838 26077 slave.cpp:5582] Querying resource estimator for oversubscribable
resources
I1215 19:51:53.646023 26085 slave.cpp:5596] Received oversubscribable resources {} from the
resource estimator
I1215 19:51:53.646525 26083 process.cpp:3679] Handling HTTP event for process 'slave(671)'
with path: '/slave(671)/containers'
I1215 19:51:53.646869 26085 http.cpp:874] Authorizing principal 'test-principal' to GET the
'/containers' endpoint
I1215 19:51:53.647737 26078 slave.cpp:796] Agent terminating
[       OK ] Endpoint/SlaveEndpointTest.NoAuthorizer/2 (10 ms)
[----------] 9 tests from Endpoint/SlaveEndpointTest (146 ms total)

[----------] Global test environment tear-down
[==========] 1383 tests from 157 test cases ran. (281760 ms total)
[  PASSED  ] 1382 tests.
[  FAILED  ] 1 test, listed below:
[  FAILED  ] IOSwitchboardTest.KillSwitchboardContainerDestroyed

 1 FAILED TEST
  YOU HAVE 9 DISABLED TESTS

make[3]: *** [CMakeFiles/check] Error 1
make[3]: Leaving directory `/mesos/build'
make[2]: *** [CMakeFiles/check.dir/all] Error 2
make[2]: Leaving directory `/mesos/build'
make[1]: *** [CMakeFiles/check.dir/rule] Error 2
make[1]: Leaving directory `/mesos/build'
make: *** [check] Error 2
+ docker rmi mesos-1481828395-11508
Untagged: mesos-1481828395-11508:latest
Deleted: sha256:7067c21d1f84c052aa6ca51eb4d1df90fcf404ddfa5571124e47b010839f6e2d
Deleted: sha256:ab1b0741fa4f85aa5dd5dd62639d72398faf559a923e3e9caf73841de31a3beb
Deleted: sha256:40583aca54409b21ab2bac3cd0790010d573662e3c2f7d5914e1aa34c9d5cfdf
Deleted: sha256:066d5de188944fcf2e17de98a602cd833706e591b9566b3a97ba26970e53a62a
Deleted: sha256:26fbf051b97a9394f8c5c02d9e719d292cc071b5872de9511714c5f9f9373dc1
Deleted: sha256:75b7795c8bb7b1d7e530f54b94509d686c85066a4349310d5a814e6dff15949c
Deleted: sha256:54ea49708b98c715a3b535cfc2029116d6b29708c37949e9f60d11431f7cdd97
Deleted: sha256:0a6b33eceaf229217231a05c6ddce1821928e0f428017f6c8d4b473bbf512ce8
Deleted: sha256:5d216278f3bdc31ee10a4f63476cdb7378055183af95a594adfa4f07679b91da
Deleted: sha256:6afd8398d9ed3ec8b39b2f2b973fb5292ad5f139af34cb3c2b584a01aaa3bbdc
Deleted: sha256:cd8ad6b6cce523dd3d840d754587e277714ea8efd98e3562fc2c338e3183e43d
Deleted: sha256:88ab26b07a4008fdb92d3ab68f483797a8ab0813a2ec20d528f8544a60ae02fa
Deleted: sha256:ac3bdb3016f0c285781e7b932e917ec32d22b7d012cd836e2c7f19238741c5d2
Deleted: sha256:ea76d1025937cea17116c963c51692d92b6466b81fb3a1f389a1c458ac05767f
Deleted: sha256:9cba0e5941b9e7ae5fe1dc464a4f8a1abdfa2fb32130f8ec3df0adb90e714927
Deleted: sha256:7cda31f1c8a7f35119bc6fa9a613ea16145a9fe824443c6daa0f1064ea4a827f
Deleted: sha256:75b1eb9da15cab53f214e1537eca3e667fe320914510f7fda82a3667f4635fb9
Deleted: sha256:13bb247da4f4f47f8eda74f7de63a41d4a15fb9d6e935f79153f1e2a966b81b7
Deleted: sha256:1fe3a9c3e7ef0522fee0b2f96b10c17a7a142fb0fd97f2b6bdd07e8581abcc62
Deleted: sha256:bffc805711add1e3d7b877218fd746ba060e31a0f5e5a85ed4139bdb9f486155
Deleted: sha256:d81d42d2f096f6eea626490b33f995d3393895dcbc965bc55f16ea8e2cea79a4
Deleted: sha256:3965c5be57837367e94dd8e41c0c629f7e9d7765feeeaf3902bc1f656d0339fe
Deleted: sha256:e15eec8d067c36699a475e8168e058c45f9df5356572f641416c97e3a0d9a879
Deleted: sha256:778674fe289b5a694102fa8fa8ca132593efda37cdaec73c13ba43690d331020
Deleted: sha256:523cd91b5b6c406fc86ec6d0296f146fa731f5d536b0423f3645c0b0dc55e277
Build step 'Execute shell' marked build as failure

Mime
View raw message