mesos-builds mailing list archives

Site index · List index
Message view « Date » · « Thread »
Top « Date » · « Thread »
From Apache Jenkins Server <jenk...@builds.apache.org>
Subject Build failed in Jenkins: Mesos » autotools,clang,--verbose,GLOG_v=1 MESOS_VERBOSE=1,ubuntu:14.04,(docker||Hadoop)&&(!ubuntu-us1)&&(!ubuntu-6)&&(!ubuntu-eu2) #3036
Date Wed, 14 Dec 2016 12:09:14 GMT
See <https://builds.apache.org/job/Mesos/BUILDTOOL=autotools,COMPILER=clang,CONFIGURATION=--verbose,ENVIRONMENT=GLOG_v=1%20MESOS_VERBOSE=1,OS=ubuntu%3A14.04,label_exp=(docker%7C%7CHadoop)&&(!ubuntu-us1)&&(!ubuntu-6)&&(!ubuntu-eu2)/3036/>

------------------------------------------
[...truncated 170197 lines...]
I1214 12:08:38.306285 28152 containerizer.cpp:220] Using isolation: posix/cpu,posix/mem,filesystem/posix,network/cni
W1214 12:08:38.306980 28152 backend.cpp:76] Failed to create 'aufs' backend: AufsBackend requires
root privileges, but is running as user mesos
W1214 12:08:38.307245 28152 backend.cpp:76] Failed to create 'bind' backend: BindBackend requires
root privileges
I1214 12:08:38.310564 28182 slave.cpp:209] Mesos agent started on (670)@172.17.0.3:43603
I1214 12:08:38.310614 28182 slave.cpp:210] Flags at startup: --acls="" --appc_simple_discovery_uri_prefix="http://"
--appc_store_dir="/tmp/mesos/store/appc" --authenticate_http_readonly="true" --authenticate_http_readwrite="true"
--authenticatee="crammd5" --authentication_backoff_factor="1secs" --authorizer="local" --cgroups_cpu_enable_pids_and_tids_count="false"
--cgroups_enable_cfs="false" --cgroups_hierarchy="/sys/fs/cgroup" --cgroups_limit_swap="false"
--cgroups_root="mesos" --container_disk_watch_interval="15secs" --containerizers="mesos" --credential="/tmp/Endpoint_SlaveEndpointTest_AuthorizedRequest_1_yKf4aA/credential"
--default_role="*" --disk_watch_interval="1mins" --docker="docker" --docker_kill_orphans="true"
--docker_registry="https://registry-1.docker.io" --docker_remove_delay="6hrs" --docker_socket="/var/run/docker.sock"
--docker_stop_timeout="0ns" --docker_store_dir="/tmp/mesos/store/docker" --docker_volume_checkpoint_dir="/var/run/mesos/isolators/docker/volume"
--enforce_container_disk_quota="false" --executor_registration_timeout="1mins" --executor_shutdown_grace_period="5secs"
--fetcher_cache_dir="/tmp/Endpoint_SlaveEndpointTest_AuthorizedRequest_1_yKf4aA/fetch" --fetcher_cache_size="2GB"
--frameworks_home="" --gc_delay="1weeks" --gc_disk_headroom="0.1" --hadoop_home="" --help="false"
--hostname_lookup="true" --http_authenticators="basic" --http_command_executor="false" --http_credentials="/tmp/Endpoint_SlaveEndpointTest_AuthorizedRequest_1_yKf4aA/http_credentials"
--http_heartbeat_interval="30secs" --image_provisioner_backend="copy" --initialize_driver_logging="true"
--isolation="posix/cpu,posix/mem" --launcher="posix" --launcher_dir="/mesos/mesos-1.2.0/_build/src"
--logbufsecs="0" --logging_level="INFO" --max_completed_executors_per_framework="150" --oversubscribed_resources_interval="15secs"
--perf_duration="10secs" --perf_interval="1mins" --qos_correction_interval_min="0ns" --quiet="false"
--recover="reconnect" --recovery_timeout="15mins" --registration_backoff_factor="10ms" --resources="cpus:2;gpus:0;mem:1024;disk:1024;ports:[31000-32000]"
--revocable_cpu_low_priority="true" --runtime_dir="/tmp/Endpoint_SlaveEndpointTest_AuthorizedRequest_1_yKf4aA"
--sandbox_directory="/mnt/mesos/sandbox" --strict="true" --switch_user="true" --systemd_enable_support="true"
--systemd_runtime_directory="/run/systemd/system" --version="false" --work_dir="/tmp/Endpoint_SlaveEndpointTest_AuthorizedRequest_1_QAwtBR"
I1214 12:08:38.311370 28182 credentials.hpp:86] Loading credential for authentication from
'/tmp/Endpoint_SlaveEndpointTest_AuthorizedRequest_1_yKf4aA/credential'
I1214 12:08:38.311592 28182 slave.cpp:352] Agent using credential for: test-principal
I1214 12:08:38.311620 28182 credentials.hpp:37] Loading credentials for authentication from
'/tmp/Endpoint_SlaveEndpointTest_AuthorizedRequest_1_yKf4aA/http_credentials'
I1214 12:08:38.311918 28182 http.cpp:922] Using default 'basic' HTTP authenticator for realm
'mesos-agent-readonly'
I1214 12:08:38.312131 28182 http.cpp:922] Using default 'basic' HTTP authenticator for realm
'mesos-agent-readwrite'
I1214 12:08:38.313798 28182 slave.cpp:539] Agent resources: cpus(*):2; mem(*):1024; disk(*):1024;
ports(*):[31000-32000]
I1214 12:08:38.313920 28182 slave.cpp:547] Agent attributes: [  ]
I1214 12:08:38.313961 28182 slave.cpp:552] Agent hostname: f9fdd28b77b2
I1214 12:08:38.315840 28176 state.cpp:57] Recovering state from '/tmp/Endpoint_SlaveEndpointTest_AuthorizedRequest_1_QAwtBR/meta'
I1214 12:08:38.316216 28170 status_update_manager.cpp:203] Recovering status update manager
I1214 12:08:38.316426 28174 containerizer.cpp:594] Recovering containerizer
I1214 12:08:38.318011 28170 provisioner.cpp:253] Provisioner recovery complete
I1214 12:08:38.318414 28171 slave.cpp:5420] Finished recovery
I1214 12:08:38.319022 28171 slave.cpp:5594] Querying resource estimator for oversubscribable
resources
I1214 12:08:38.319288 28173 slave.cpp:5608] Received oversubscribable resources {} from the
resource estimator
I1214 12:08:38.322232 28174 process.cpp:3679] Handling HTTP event for process 'slave(670)'
with path: '/slave(670)/monitor/statistics.json'
I1214 12:08:38.323470 28179 http.cpp:874] Authorizing principal 'test-principal' to GET the
'/monitor/statistics.json' endpoint
I1214 12:08:38.327273 28152 slave.cpp:796] Agent terminating
[       OK ] Endpoint/SlaveEndpointTest.AuthorizedRequest/1 (32 ms)
[ RUN      ] Endpoint/SlaveEndpointTest.AuthorizedRequest/2
I1214 12:08:38.340900 28152 containerizer.cpp:220] Using isolation: posix/cpu,posix/mem,filesystem/posix,network/cni
W1214 12:08:38.341675 28152 backend.cpp:76] Failed to create 'aufs' backend: AufsBackend requires
root privileges, but is running as user mesos
W1214 12:08:38.341975 28152 backend.cpp:76] Failed to create 'bind' backend: BindBackend requires
root privileges
I1214 12:08:38.346432 28183 slave.cpp:209] Mesos agent started on (671)@172.17.0.3:43603
I1214 12:08:38.346513 28183 slave.cpp:210] Flags at startup: --acls="" --appc_simple_discovery_uri_prefix="http://"
--appc_store_dir="/tmp/mesos/store/appc" --authenticate_http_readonly="true" --authenticate_http_readwrite="true"
--authenticatee="crammd5" --authentication_backoff_factor="1secs" --authorizer="local" --cgroups_cpu_enable_pids_and_tids_count="false"
--cgroups_enable_cfs="false" --cgroups_hierarchy="/sys/fs/cgroup" --cgroups_limit_swap="false"
--cgroups_root="mesos" --container_disk_watch_interval="15secs" --containerizers="mesos" --credential="/tmp/Endpoint_SlaveEndpointTest_AuthorizedRequest_2_2PtGLs/credential"
--default_role="*" --disk_watch_interval="1mins" --docker="docker" --docker_kill_orphans="true"
--docker_registry="https://registry-1.docker.io" --docker_remove_delay="6hrs" --docker_socket="/var/run/docker.sock"
--docker_stop_timeout="0ns" --docker_store_dir="/tmp/mesos/store/docker" --docker_volume_checkpoint_dir="/var/run/mesos/isolators/docker/volume"
--enforce_container_disk_quota="false" --executor_registration_timeout="1mins" --executor_shutdown_grace_period="5secs"
--fetcher_cache_dir="/tmp/Endpoint_SlaveEndpointTest_AuthorizedRequest_2_2PtGLs/fetch" --fetcher_cache_size="2GB"
--frameworks_home="" --gc_delay="1weeks" --gc_disk_headroom="0.1" --hadoop_home="" --help="false"
--hostname_lookup="true" --http_authenticators="basic" --http_command_executor="false" --http_credentials="/tmp/Endpoint_SlaveEndpointTest_AuthorizedRequest_2_2PtGLs/http_credentials"
--http_heartbeat_interval="30secs" --image_provisioner_backend="copy" --initialize_driver_logging="true"
--isolation="posix/cpu,posix/mem" --launcher="posix" --launcher_dir="/mesos/mesos-1.2.0/_build/src"
--logbufsecs="0" --logging_level="INFO" --max_completed_executors_per_framework="150" --oversubscribed_resources_interval="15secs"
--perf_duration="10secs" --perf_interval="1mins" --qos_correction_interval_min="0ns" --quiet="false"
--recover="reconnect" --recovery_timeout="15mins" --registration_backoff_factor="10ms" --resources="cpus:2;gpus:0;mem:1024;disk:1024;ports:[31000-32000]"
--revocable_cpu_low_priority="true" --runtime_dir="/tmp/Endpoint_SlaveEndpointTest_AuthorizedRequest_2_2PtGLs"
--sandbox_directory="/mnt/mesos/sandbox" --strict="true" --switch_user="true" --systemd_enable_support="true"
--systemd_runtime_directory="/run/systemd/system" --version="false" --work_dir="/tmp/Endpoint_SlaveEndpointTest_AuthorizedRequest_2_I1vD6J"
I1214 12:08:38.347373 28183 credentials.hpp:86] Loading credential for authentication from
'/tmp/Endpoint_SlaveEndpointTest_AuthorizedRequest_2_2PtGLs/credential'
I1214 12:08:38.347618 28183 slave.cpp:352] Agent using credential for: test-principal
I1214 12:08:38.347646 28183 credentials.hpp:37] Loading credentials for authentication from
'/tmp/Endpoint_SlaveEndpointTest_AuthorizedRequest_2_2PtGLs/http_credentials'
I1214 12:08:38.347954 28183 http.cpp:922] Using default 'basic' HTTP authenticator for realm
'mesos-agent-readonly'
I1214 12:08:38.348181 28183 http.cpp:922] Using default 'basic' HTTP authenticator for realm
'mesos-agent-readwrite'
I1214 12:08:38.349838 28183 slave.cpp:539] Agent resources: cpus(*):2; mem(*):1024; disk(*):1024;
ports(*):[31000-32000]
I1214 12:08:38.349958 28183 slave.cpp:547] Agent attributes: [  ]
I1214 12:08:38.350004 28183 slave.cpp:552] Agent hostname: f9fdd28b77b2
I1214 12:08:38.352195 28180 state.cpp:57] Recovering state from '/tmp/Endpoint_SlaveEndpointTest_AuthorizedRequest_2_I1vD6J/meta'
I1214 12:08:38.352504 28174 status_update_manager.cpp:203] Recovering status update manager
I1214 12:08:38.352716 28178 containerizer.cpp:594] Recovering containerizer
I1214 12:08:38.354255 28185 provisioner.cpp:253] Provisioner recovery complete
I1214 12:08:38.354655 28175 slave.cpp:5420] Finished recovery
I1214 12:08:38.355267 28175 slave.cpp:5594] Querying resource estimator for oversubscribable
resources
I1214 12:08:38.355521 28184 slave.cpp:5608] Received oversubscribable resources {} from the
resource estimator
I1214 12:08:38.358242 28177 process.cpp:3679] Handling HTTP event for process 'slave(671)'
with path: '/slave(671)/containers'
I1214 12:08:38.360100 28177 http.cpp:874] Authorizing principal 'test-principal' to GET the
'/containers' endpoint
I1214 12:08:38.368654 28183 slave.cpp:796] Agent terminating
[       OK ] Endpoint/SlaveEndpointTest.AuthorizedRequest/2 (46 ms)
[ RUN      ] Endpoint/SlaveEndpointTest.UnauthorizedRequest/0
I1214 12:08:38.385689 28152 containerizer.cpp:220] Using isolation: posix/cpu,posix/mem,filesystem/posix,network/cni
W1214 12:08:38.386250 28152 backend.cpp:76] Failed to create 'aufs' backend: AufsBackend requires
root privileges, but is running as user mesos
W1214 12:08:38.386422 28152 backend.cpp:76] Failed to create 'bind' backend: BindBackend requires
root privileges
I1214 12:08:38.390110 28176 slave.cpp:209] Mesos agent started on (672)@172.17.0.3:43603
I1214 12:08:38.390156 28176 slave.cpp:210] Flags at startup: --acls="" --appc_simple_discovery_uri_prefix="http://"
--appc_store_dir="/tmp/mesos/store/appc" --authenticate_http_readonly="true" --authenticate_http_readwrite="true"
--authenticatee="crammd5" --authentication_backoff_factor="1secs" --authorizer="local" --cgroups_cpu_enable_pids_and_tids_count="false"
--cgroups_enable_cfs="false" --cgroups_hierarchy="/sys/fs/cgroup" --cgroups_limit_swap="false"
--cgroups_root="mesos" --container_disk_watch_interval="15secs" --containerizers="mesos" --credential="/tmp/Endpoint_SlaveEndpointTest_UnauthorizedRequest_0_utSFOl/credential"
--default_role="*" --disk_watch_interval="1mins" --docker="docker" --docker_kill_orphans="true"
--docker_registry="https://registry-1.docker.io" --docker_remove_delay="6hrs" --docker_socket="/var/run/docker.sock"
--docker_stop_timeout="0ns" --docker_store_dir="/tmp/mesos/store/docker" --docker_volume_checkpoint_dir="/var/run/mesos/isolators/docker/volume"
--enforce_container_disk_quota="false" --executor_registration_timeout="1mins" --executor_shutdown_grace_period="5secs"
--fetcher_cache_dir="/tmp/Endpoint_SlaveEndpointTest_UnauthorizedRequest_0_utSFOl/fetch" --fetcher_cache_size="2GB"
--frameworks_home="" --gc_delay="1weeks" --gc_disk_headroom="0.1" --hadoop_home="" --help="false"
--hostname_lookup="true" --http_authenticators="basic" --http_command_executor="false" --http_credentials="/tmp/Endpoint_SlaveEndpointTest_UnauthorizedRequest_0_utSFOl/http_credentials"
--http_heartbeat_interval="30secs" --image_provisioner_backend="copy" --initialize_driver_logging="true"
--isolation="posix/cpu,posix/mem" --launcher="posix" --launcher_dir="/mesos/mesos-1.2.0/_build/src"
--logbufsecs="0" --logging_level="INFO" --max_completed_executors_per_framework="150" --oversubscribed_resources_interval="15secs"
--perf_duration="10secs" --perf_interval="1mins" --qos_correction_interval_min="0ns" --quiet="false"
--recover="reconnect" --recovery_timeout="15mins" --registration_backoff_factor="10ms" --resources="cpus:2;gpus:0;mem:1024;disk:1024;ports:[31000-32000]"
--revocable_cpu_low_priority="true" --runtime_dir="/tmp/Endpoint_SlaveEndpointTest_UnauthorizedRequest_0_utSFOl"
--sandbox_directory="/mnt/mesos/sandbox" --strict="true" --switch_user="true" --systemd_enable_support="true"
--systemd_runtime_directory="/run/systemd/system" --version="false" --work_dir="/tmp/Endpoint_SlaveEndpointTest_UnauthorizedRequest_0_6LBb2C"
I1214 12:08:38.390875 28176 credentials.hpp:86] Loading credential for authentication from
'/tmp/Endpoint_SlaveEndpointTest_UnauthorizedRequest_0_utSFOl/credential'
I1214 12:08:38.391054 28176 slave.cpp:352] Agent using credential for: test-principal
I1214 12:08:38.391080 28176 credentials.hpp:37] Loading credentials for authentication from
'/tmp/Endpoint_SlaveEndpointTest_UnauthorizedRequest_0_utSFOl/http_credentials'
I1214 12:08:38.391304 28176 http.cpp:922] Using default 'basic' HTTP authenticator for realm
'mesos-agent-readonly'
I1214 12:08:38.391453 28176 http.cpp:922] Using default 'basic' HTTP authenticator for realm
'mesos-agent-readwrite'
I1214 12:08:38.392493 28176 slave.cpp:539] Agent resources: cpus(*):2; mem(*):1024; disk(*):1024;
ports(*):[31000-32000]
I1214 12:08:38.392576 28176 slave.cpp:547] Agent attributes: [  ]
I1214 12:08:38.392598 28176 slave.cpp:552] Agent hostname: f9fdd28b77b2
I1214 12:08:38.394294 28178 state.cpp:57] Recovering state from '/tmp/Endpoint_SlaveEndpointTest_UnauthorizedRequest_0_6LBb2C/meta'
I1214 12:08:38.394722 28177 status_update_manager.cpp:203] Recovering status update manager
I1214 12:08:38.394927 28172 containerizer.cpp:594] Recovering containerizer
I1214 12:08:38.396389 28176 provisioner.cpp:253] Provisioner recovery complete
I1214 12:08:38.396822 28181 slave.cpp:5420] Finished recovery
I1214 12:08:38.397429 28181 slave.cpp:5594] Querying resource estimator for oversubscribable
resources
I1214 12:08:38.397739 28181 slave.cpp:5608] Received oversubscribable resources {} from the
resource estimator
I1214 12:08:38.400568 28171 process.cpp:3679] Handling HTTP event for process 'slave(672)'
with path: '/slave(672)/monitor/statistics'
I1214 12:08:38.402014 28171 http.cpp:874] Authorizing principal 'test-principal' to GET the
'/monitor/statistics' endpoint
I1214 12:08:38.404712 28182 slave.cpp:796] Agent terminating
[       OK ] Endpoint/SlaveEndpointTest.UnauthorizedRequest/0 (28 ms)
[ RUN      ] Endpoint/SlaveEndpointTest.UnauthorizedRequest/1
I1214 12:08:38.413972 28152 containerizer.cpp:220] Using isolation: posix/cpu,posix/mem,filesystem/posix,network/cni
W1214 12:08:38.414628 28152 backend.cpp:76] Failed to create 'aufs' backend: AufsBackend requires
root privileges, but is running as user mesos
W1214 12:08:38.414824 28152 backend.cpp:76] Failed to create 'bind' backend: BindBackend requires
root privileges
I1214 12:08:38.419236 28174 slave.cpp:209] Mesos agent started on (673)@172.17.0.3:43603
I1214 12:08:38.419273 28174 slave.cpp:210] Flags at startup: --acls="" --appc_simple_discovery_uri_prefix="http://"
--appc_store_dir="/tmp/mesos/store/appc" --authenticate_http_readonly="true" --authenticate_http_readwrite="true"
--authenticatee="crammd5" --authentication_backoff_factor="1secs" --authorizer="local" --cgroups_cpu_enable_pids_and_tids_count="false"
--cgroups_enable_cfs="false" --cgroups_hierarchy="/sys/fs/cgroup" --cgroups_limit_swap="false"
--cgroups_root="mesos" --container_disk_watch_interval="15secs" --containerizers="mesos" --credential="/tmp/Endpoint_SlaveEndpointTest_UnauthorizedRequest_1_wmJncf/credential"
--default_role="*" --disk_watch_interval="1mins" --docker="docker" --docker_kill_orphans="true"
--docker_registry="https://registry-1.docker.io" --docker_remove_delay="6hrs" --docker_socket="/var/run/docker.sock"
--docker_stop_timeout="0ns" --docker_store_dir="/tmp/mesos/store/docker" --docker_volume_checkpoint_dir="/var/run/mesos/isolators/docker/volume"
--enforce_container_disk_quota="false" --executor_registration_timeout="1mins" --executor_shutdown_grace_period="5secs"
--fetcher_cache_dir="/tmp/Endpoint_SlaveEndpointTest_UnauthorizedRequest_1_wmJncf/fetch" --fetcher_cache_size="2GB"
--frameworks_home="" --gc_delay="1weeks" --gc_disk_headroom="0.1" --hadoop_home="" --help="false"
--hostname_lookup="true" --http_authenticators="basic" --http_command_executor="false" --http_credentials="/tmp/Endpoint_SlaveEndpointTest_UnauthorizedRequest_1_wmJncf/http_credentials"
--http_heartbeat_interval="30secs" --image_provisioner_backend="copy" --initialize_driver_logging="true"
--isolation="posix/cpu,posix/mem" --launcher="posix" --launcher_dir="/mesos/mesos-1.2.0/_build/src"
--logbufsecs="0" --logging_level="INFO" --max_completed_executors_per_framework="150" --oversubscribed_resources_interval="15secs"
--perf_duration="10secs" --perf_interval="1mins" --qos_correction_interval_min="0ns" --quiet="false"
--recover="reconnect" --recovery_timeout="15mins" --registration_backoff_factor="10ms" --resources="cpus:2;gpus:0;mem:1024;disk:1024;ports:[31000-32000]"
--revocable_cpu_low_priority="true" --runtime_dir="/tmp/Endpoint_SlaveEndpointTest_UnauthorizedRequest_1_wmJncf"
--sandbox_directory="/mnt/mesos/sandbox" --strict="true" --switch_user="true" --systemd_enable_support="true"
--systemd_runtime_directory="/run/systemd/system" --version="false" --work_dir="/tmp/Endpoint_SlaveEndpointTest_UnauthorizedRequest_1_wZ8glw"
I1214 12:08:38.419729 28174 credentials.hpp:86] Loading credential for authentication from
'/tmp/Endpoint_SlaveEndpointTest_UnauthorizedRequest_1_wmJncf/credential'
I1214 12:08:38.419926 28174 slave.cpp:352] Agent using credential for: test-principal
I1214 12:08:38.419951 28174 credentials.hpp:37] Loading credentials for authentication from
'/tmp/Endpoint_SlaveEndpointTest_UnauthorizedRequest_1_wmJncf/http_credentials'
I1214 12:08:38.420198 28174 http.cpp:922] Using default 'basic' HTTP authenticator for realm
'mesos-agent-readonly'
I1214 12:08:38.420339 28174 http.cpp:922] Using default 'basic' HTTP authenticator for realm
'mesos-agent-readwrite'
I1214 12:08:38.421331 28174 slave.cpp:539] Agent resources: cpus(*):2; mem(*):1024; disk(*):1024;
ports(*):[31000-32000]
I1214 12:08:38.421413 28174 slave.cpp:547] Agent attributes: [  ]
I1214 12:08:38.421576 28174 slave.cpp:552] Agent hostname: f9fdd28b77b2
I1214 12:08:38.423141 28176 state.cpp:57] Recovering state from '/tmp/Endpoint_SlaveEndpointTest_UnauthorizedRequest_1_wZ8glw/meta'
I1214 12:08:38.423385 28170 status_update_manager.cpp:203] Recovering status update manager
I1214 12:08:38.423585 28172 containerizer.cpp:594] Recovering containerizer
I1214 12:08:38.425020 28178 provisioner.cpp:253] Provisioner recovery complete
I1214 12:08:38.425377 28172 slave.cpp:5420] Finished recovery
I1214 12:08:38.425914 28172 slave.cpp:5594] Querying resource estimator for oversubscribable
resources
I1214 12:08:38.426182 28178 slave.cpp:5608] Received oversubscribable resources {} from the
resource estimator
I1214 12:08:38.428865 28179 process.cpp:3679] Handling HTTP event for process 'slave(673)'
with path: '/slave(673)/monitor/statistics.json'
I1214 12:08:38.430796 28185 http.cpp:874] Authorizing principal 'test-principal' to GET the
'/monitor/statistics.json' endpoint
I1214 12:08:38.433652 28152 slave.cpp:796] Agent terminating
[       OK ] Endpoint/SlaveEndpointTest.UnauthorizedRequest/1 (33 ms)
[ RUN      ] Endpoint/SlaveEndpointTest.UnauthorizedRequest/2
I1214 12:08:38.448417 28152 containerizer.cpp:220] Using isolation: posix/cpu,posix/mem,filesystem/posix,network/cni
W1214 12:08:38.448971 28152 backend.cpp:76] Failed to create 'aufs' backend: AufsBackend requires
root privileges, but is running as user mesos
W1214 12:08:38.449118 28152 backend.cpp:76] Failed to create 'bind' backend: BindBackend requires
root privileges
I1214 12:08:38.452131 28182 slave.cpp:209] Mesos agent started on (674)@172.17.0.3:43603
I1214 12:08:38.452198 28182 slave.cpp:210] Flags at startup: --acls="" --appc_simple_discovery_uri_prefix="http://"
--appc_store_dir="/tmp/mesos/store/appc" --authenticate_http_readonly="true" --authenticate_http_readwrite="true"
--authenticatee="crammd5" --authentication_backoff_factor="1secs" --authorizer="local" --cgroups_cpu_enable_pids_and_tids_count="false"
--cgroups_enable_cfs="false" --cgroups_hierarchy="/sys/fs/cgroup" --cgroups_limit_swap="false"
--cgroups_root="mesos" --container_disk_watch_interval="15secs" --containerizers="mesos" --credential="/tmp/Endpoint_SlaveEndpointTest_UnauthorizedRequest_2_C565U8/credential"
--default_role="*" --disk_watch_interval="1mins" --docker="docker" --docker_kill_orphans="true"
--docker_registry="https://registry-1.docker.io" --docker_remove_delay="6hrs" --docker_socket="/var/run/docker.sock"
--docker_stop_timeout="0ns" --docker_store_dir="/tmp/mesos/store/docker" --docker_volume_checkpoint_dir="/var/run/mesos/isolators/docker/volume"
--enforce_container_disk_quota="false" --executor_registration_timeout="1mins" --executor_shutdown_grace_period="5secs"
--fetcher_cache_dir="/tmp/Endpoint_SlaveEndpointTest_UnauthorizedRequest_2_C565U8/fetch" --fetcher_cache_size="2GB"
--frameworks_home="" --gc_delay="1weeks" --gc_disk_headroom="0.1" --hadoop_home="" --help="false"
--hostname_lookup="true" --http_authenticators="basic" --http_command_executor="false" --http_credentials="/tmp/Endpoint_SlaveEndpointTest_UnauthorizedRequest_2_C565U8/http_credentials"
--http_heartbeat_interval="30secs" --image_provisioner_backend="copy" --initialize_driver_logging="true"
--isolation="posix/cpu,posix/mem" --launcher="posix" --launcher_dir="/mesos/mesos-1.2.0/_build/src"
--logbufsecs="0" --logging_level="INFO" --max_completed_executors_per_framework="150" --oversubscribed_resources_interval="15secs"
--perf_duration="10secs" --perf_interval="1mins" --qos_correction_interval_min="0ns" --quiet="false"
--recover="reconnect" --recovery_timeout="15mins" --registration_backoff_factor="10ms" --resources="cpus:2;gpus:0;mem:1024;disk:1024;ports:[31000-32000]"
--revocable_cpu_low_priority="true" --runtime_dir="/tmp/Endpoint_SlaveEndpointTest_UnauthorizedRequest_2_C565U8"
--sandbox_directory="/mnt/mesos/sandbox" --strict="true" --switch_user="true" --systemd_enable_support="true"
--systemd_runtime_directory="/run/systemd/system" --version="false" --work_dir="/tmp/Endpoint_SlaveEndpointTest_UnauthorizedRequest_2_oFxxYp"
I1214 12:08:38.453035 28182 credentials.hpp:86] Loading credential for authentication from
'/tmp/Endpoint_SlaveEndpointTest_UnauthorizedRequest_2_C565U8/credential'
I1214 12:08:38.453275 28182 slave.cpp:352] Agent using credential for: test-principal
I1214 12:08:38.453305 28182 credentials.hpp:37] Loading credentials for authentication from
'/tmp/Endpoint_SlaveEndpointTest_UnauthorizedRequest_2_C565U8/http_credentials'
I1214 12:08:38.453636 28182 http.cpp:922] Using default 'basic' HTTP authenticator for realm
'mesos-agent-readonly'
I1214 12:08:38.453862 28182 http.cpp:922] Using default 'basic' HTTP authenticator for realm
'mesos-agent-readwrite'
I1214 12:08:38.455504 28182 slave.cpp:539] Agent resources: cpus(*):2; mem(*):1024; disk(*):1024;
ports(*):[31000-32000]
I1214 12:08:38.455633 28182 slave.cpp:547] Agent attributes: [  ]
I1214 12:08:38.455658 28182 slave.cpp:552] Agent hostname: f9fdd28b77b2
I1214 12:08:38.457718 28170 state.cpp:57] Recovering state from '/tmp/Endpoint_SlaveEndpointTest_UnauthorizedRequest_2_oFxxYp/meta'
I1214 12:08:38.462673 28170 status_update_manager.cpp:203] Recovering status update manager
I1214 12:08:38.463057 28183 containerizer.cpp:594] Recovering containerizer
I1214 12:08:38.464862 28183 provisioner.cpp:253] Provisioner recovery complete
I1214 12:08:38.465291 28182 slave.cpp:5420] Finished recovery
I1214 12:08:38.466018 28182 slave.cpp:5594] Querying resource estimator for oversubscribable
resources
I1214 12:08:38.466342 28181 slave.cpp:5608] Received oversubscribable resources {} from the
resource estimator
I1214 12:08:38.470522 28183 process.cpp:3679] Handling HTTP event for process 'slave(674)'
with path: '/slave(674)/containers'
I1214 12:08:38.472003 28181 http.cpp:874] Authorizing principal 'test-principal' to GET the
'/containers' endpoint
I1214 12:08:38.474303 28175 slave.cpp:796] Agent terminating
[       OK ] Endpoint/SlaveEndpointTest.UnauthorizedRequest/2 (36 ms)
[ RUN      ] Endpoint/SlaveEndpointTest.NoAuthorizer/0
I1214 12:08:38.484352 28152 containerizer.cpp:220] Using isolation: posix/cpu,posix/mem,filesystem/posix,network/cni
W1214 12:08:38.485229 28152 backend.cpp:76] Failed to create 'aufs' backend: AufsBackend requires
root privileges, but is running as user mesos
W1214 12:08:38.485550 28152 backend.cpp:76] Failed to create 'bind' backend: BindBackend requires
root privileges
I1214 12:08:38.487840 28152 cluster.cpp:446] Creating default 'local' authorizer
I1214 12:08:38.489722 28173 slave.cpp:209] Mesos agent started on (675)@172.17.0.3:43603
I1214 12:08:38.489768 28173 slave.cpp:210] Flags at startup: --acls="" --appc_simple_discovery_uri_prefix="http://"
--appc_store_dir="/tmp/mesos/store/appc" --authenticate_http_readonly="true" --authenticate_http_readwrite="true"
--authenticatee="crammd5" --authentication_backoff_factor="1secs" --authorizer="local" --cgroups_cpu_enable_pids_and_tids_count="false"
--cgroups_enable_cfs="false" --cgroups_hierarchy="/sys/fs/cgroup" --cgroups_limit_swap="false"
--cgroups_root="mesos" --container_disk_watch_interval="15secs" --containerizers="mesos" --credential="/tmp/Endpoint_SlaveEndpointTest_NoAuthorizer_0_eJ5112/credential"
--default_role="*" --disk_watch_interval="1mins" --docker="docker" --docker_kill_orphans="true"
--docker_registry="https://registry-1.docker.io" --docker_remove_delay="6hrs" --docker_socket="/var/run/docker.sock"
--docker_stop_timeout="0ns" --docker_store_dir="/tmp/mesos/store/docker" --docker_volume_checkpoint_dir="/var/run/mesos/isolators/docker/volume"
--enforce_container_disk_quota="false" --executor_registration_timeout="1mins" --executor_shutdown_grace_period="5secs"
--fetcher_cache_dir="/tmp/Endpoint_SlaveEndpointTest_NoAuthorizer_0_eJ5112/fetch" --fetcher_cache_size="2GB"
--frameworks_home="" --gc_delay="1weeks" --gc_disk_headroom="0.1" --hadoop_home="" --help="false"
--hostname_lookup="true" --http_authenticators="basic" --http_command_executor="false" --http_credentials="/tmp/Endpoint_SlaveEndpointTest_NoAuthorizer_0_eJ5112/http_credentials"
--http_heartbeat_interval="30secs" --image_provisioner_backend="copy" --initialize_driver_logging="true"
--isolation="posix/cpu,posix/mem" --launcher="posix" --launcher_dir="/mesos/mesos-1.2.0/_build/src"
--logbufsecs="0" --logging_level="INFO" --max_completed_executors_per_framework="150" --oversubscribed_resources_interval="15secs"
--perf_duration="10secs" --perf_interval="1mins" --qos_correction_interval_min="0ns" --quiet="false"
--recover="reconnect" --recovery_timeout="15mins" --registration_backoff_factor="10ms" --resources="cpus:2;gpus:0;mem:1024;disk:1024;ports:[31000-32000]"
--revocable_cpu_low_priority="true" --runtime_dir="/tmp/Endpoint_SlaveEndpointTest_NoAuthorizer_0_eJ5112"
--sandbox_directory="/mnt/mesos/sandbox" --strict="true" --switch_user="true" --systemd_enable_support="true"
--systemd_runtime_directory="/run/systemd/system" --version="false" --work_dir="/tmp/Endpoint_SlaveEndpointTest_NoAuthorizer_0_sVIyZj"
I1214 12:08:38.490433 28173 credentials.hpp:86] Loading credential for authentication from
'/tmp/Endpoint_SlaveEndpointTest_NoAuthorizer_0_eJ5112/credential'
I1214 12:08:38.490656 28173 slave.cpp:352] Agent using credential for: test-principal
I1214 12:08:38.490684 28173 credentials.hpp:37] Loading credentials for authentication from
'/tmp/Endpoint_SlaveEndpointTest_NoAuthorizer_0_eJ5112/http_credentials'
I1214 12:08:38.490978 28173 http.cpp:922] Using default 'basic' HTTP authenticator for realm
'mesos-agent-readonly'
I1214 12:08:38.491144 28173 http.cpp:922] Using default 'basic' HTTP authenticator for realm
'mesos-agent-readwrite'
I1214 12:08:38.492573 28173 slave.cpp:539] Agent resources: cpus(*):2; mem(*):1024; disk(*):1024;
ports(*):[31000-32000]
I1214 12:08:38.492700 28173 slave.cpp:547] Agent attributes: [  ]
I1214 12:08:38.492724 28173 slave.cpp:552] Agent hostname: f9fdd28b77b2
I1214 12:08:38.494848 28179 state.cpp:57] Recovering state from '/tmp/Endpoint_SlaveEndpointTest_NoAuthorizer_0_sVIyZj/meta'
I1214 12:08:38.495116 28184 status_update_manager.cpp:203] Recovering status update manager
I1214 12:08:38.495447 28185 containerizer.cpp:594] Recovering containerizer
I1214 12:08:38.497165 28180 provisioner.cpp:253] Provisioner recovery complete
I1214 12:08:38.497563 28177 slave.cpp:5420] Finished recovery
I1214 12:08:38.498095 28177 slave.cpp:5594] Querying resource estimator for oversubscribable
resources
I1214 12:08:38.498376 28175 slave.cpp:5608] Received oversubscribable resources {} from the
resource estimator
I1214 12:08:38.501754 28184 process.cpp:3679] Handling HTTP event for process 'slave(675)'
with path: '/slave(675)/monitor/statistics'
I1214 12:08:38.503131 28171 http.cpp:874] Authorizing principal 'test-principal' to GET the
'/monitor/statistics' endpoint
I1214 12:08:38.506839 28181 slave.cpp:796] Agent terminating
[       OK ] Endpoint/SlaveEndpointTest.NoAuthorizer/0 (34 ms)
[ RUN      ] Endpoint/SlaveEndpointTest.NoAuthorizer/1
I1214 12:08:38.519824 28152 containerizer.cpp:220] Using isolation: posix/cpu,posix/mem,filesystem/posix,network/cni
W1214 12:08:38.520345 28152 backend.cpp:76] Failed to create 'aufs' backend: AufsBackend requires
root privileges, but is running as user mesos
W1214 12:08:38.520514 28152 backend.cpp:76] Failed to create 'bind' backend: BindBackend requires
root privileges
I1214 12:08:38.522235 28152 cluster.cpp:446] Creating default 'local' authorizer
I1214 12:08:38.523715 28183 slave.cpp:209] Mesos agent started on (676)@172.17.0.3:43603
I1214 12:08:38.523778 28183 slave.cpp:210] Flags at startup: --acls="" --appc_simple_discovery_uri_prefix="http://"
--appc_store_dir="/tmp/mesos/store/appc" --authenticate_http_readonly="true" --authenticate_http_readwrite="true"
--authenticatee="crammd5" --authentication_backoff_factor="1secs" --authorizer="local" --cgroups_cpu_enable_pids_and_tids_count="false"
--cgroups_enable_cfs="false" --cgroups_hierarchy="/sys/fs/cgroup" --cgroups_limit_swap="false"
--cgroups_root="mesos" --container_disk_watch_interval="15secs" --containerizers="mesos" --credential="/tmp/Endpoint_SlaveEndpointTest_NoAuthorizer_1_kyrkvX/credential"
--default_role="*" --disk_watch_interval="1mins" --docker="docker" --docker_kill_orphans="true"
--docker_registry="https://registry-1.docker.io" --docker_remove_delay="6hrs" --docker_socket="/var/run/docker.sock"
--docker_stop_timeout="0ns" --docker_store_dir="/tmp/mesos/store/docker" --docker_volume_checkpoint_dir="/var/run/mesos/isolators/docker/volume"
--enforce_container_disk_quota="false" --executor_registration_timeout="1mins" --executor_shutdown_grace_period="5secs"
--fetcher_cache_dir="/tmp/Endpoint_SlaveEndpointTest_NoAuthorizer_1_kyrkvX/fetch" --fetcher_cache_size="2GB"
--frameworks_home="" --gc_delay="1weeks" --gc_disk_headroom="0.1" --hadoop_home="" --help="false"
--hostname_lookup="true" --http_authenticators="basic" --http_command_executor="false" --http_credentials="/tmp/Endpoint_SlaveEndpointTest_NoAuthorizer_1_kyrkvX/http_credentials"
--http_heartbeat_interval="30secs" --image_provisioner_backend="copy" --initialize_driver_logging="true"
--isolation="posix/cpu,posix/mem" --launcher="posix" --launcher_dir="/mesos/mesos-1.2.0/_build/src"
--logbufsecs="0" --logging_level="INFO" --max_completed_executors_per_framework="150" --oversubscribed_resources_interval="15secs"
--perf_duration="10secs" --perf_interval="1mins" --qos_correction_interval_min="0ns" --quiet="false"
--recover="reconnect" --recovery_timeout="15mins" --registration_backoff_factor="10ms" --resources="cpus:2;gpus:0;mem:1024;disk:1024;ports:[31000-32000]"
--revocable_cpu_low_priority="true" --runtime_dir="/tmp/Endpoint_SlaveEndpointTest_NoAuthorizer_1_kyrkvX"
--sandbox_directory="/mnt/mesos/sandbox" --strict="true" --switch_user="true" --systemd_enable_support="true"
--systemd_runtime_directory="/run/systemd/system" --version="false" --work_dir="/tmp/Endpoint_SlaveEndpointTest_NoAuthorizer_1_sJi6me"
I1214 12:08:38.524341 28183 credentials.hpp:86] Loading credential for authentication from
'/tmp/Endpoint_SlaveEndpointTest_NoAuthorizer_1_kyrkvX/credential'
I1214 12:08:38.524552 28183 slave.cpp:352] Agent using credential for: test-principal
I1214 12:08:38.524580 28183 credentials.hpp:37] Loading credentials for authentication from
'/tmp/Endpoint_SlaveEndpointTest_NoAuthorizer_1_kyrkvX/http_credentials'
I1214 12:08:38.524838 28183 http.cpp:922] Using default 'basic' HTTP authenticator for realm
'mesos-agent-readonly'
I1214 12:08:38.525164 28183 http.cpp:922] Using default 'basic' HTTP authenticator for realm
'mesos-agent-readwrite'
I1214 12:08:38.526243 28183 slave.cpp:539] Agent resources: cpus(*):2; mem(*):1024; disk(*):1024;
ports(*):[31000-32000]
I1214 12:08:38.526329 28183 slave.cpp:547] Agent attributes: [  ]
I1214 12:08:38.526350 28183 slave.cpp:552] Agent hostname: f9fdd28b77b2
I1214 12:08:38.527760 28185 state.cpp:57] Recovering state from '/tmp/Endpoint_SlaveEndpointTest_NoAuthorizer_1_sJi6me/meta'
I1214 12:08:38.528007 28173 status_update_manager.cpp:203] Recovering status update manager
I1214 12:08:38.528246 28183 containerizer.cpp:594] Recovering containerizer
I1214 12:08:38.529731 28181 provisioner.cpp:253] Provisioner recovery complete
I1214 12:08:38.530238 28179 slave.cpp:5420] Finished recovery
I1214 12:08:38.530848 28179 slave.cpp:5594] Querying resource estimator for oversubscribable
resources
I1214 12:08:38.531154 28179 slave.cpp:5608] Received oversubscribable resources {} from the
resource estimator
I1214 12:08:38.533874 28184 process.cpp:3679] Handling HTTP event for process 'slave(676)'
with path: '/slave(676)/monitor/statistics.json'
I1214 12:08:38.535465 28179 http.cpp:874] Authorizing principal 'test-principal' to GET the
'/monitor/statistics.json' endpoint
I1214 12:08:38.539331 28171 slave.cpp:796] Agent terminating
[       OK ] Endpoint/SlaveEndpointTest.NoAuthorizer/1 (30 ms)
[ RUN      ] Endpoint/SlaveEndpointTest.NoAuthorizer/2
I1214 12:08:38.550071 28152 containerizer.cpp:220] Using isolation: posix/cpu,posix/mem,filesystem/posix,network/cni
W1214 12:08:38.550621 28152 backend.cpp:76] Failed to create 'aufs' backend: AufsBackend requires
root privileges, but is running as user mesos
W1214 12:08:38.550772 28152 backend.cpp:76] Failed to create 'bind' backend: BindBackend requires
root privileges
I1214 12:08:38.552435 28152 cluster.cpp:446] Creating default 'local' authorizer
I1214 12:08:38.554317 28182 slave.cpp:209] Mesos agent started on (677)@172.17.0.3:43603
I1214 12:08:38.554469 28182 slave.cpp:210] Flags at startup: --acls="" --appc_simple_discovery_uri_prefix="http://"
--appc_store_dir="/tmp/mesos/store/appc" --authenticate_http_readonly="true" --authenticate_http_readwrite="true"
--authenticatee="crammd5" --authentication_backoff_factor="1secs" --authorizer="local" --cgroups_cpu_enable_pids_and_tids_count="false"
--cgroups_enable_cfs="false" --cgroups_hierarchy="/sys/fs/cgroup" --cgroups_limit_swap="false"
--cgroups_root="mesos" --container_disk_watch_interval="15secs" --containerizers="mesos" --credential="/tmp/Endpoint_SlaveEndpointTest_NoAuthorizer_2_KwjJiS/credential"
--default_role="*" --disk_watch_interval="1mins" --docker="docker" --docker_kill_orphans="true"
--docker_registry="https://registry-1.docker.io" --docker_remove_delay="6hrs" --docker_socket="/var/run/docker.sock"
--docker_stop_timeout="0ns" --docker_store_dir="/tmp/mesos/store/docker" --docker_volume_checkpoint_dir="/var/run/mesos/isolators/docker/volume"
--enforce_container_disk_quota="false" --executor_registration_timeout="1mins" --executor_shutdown_grace_period="5secs"
--fetcher_cache_dir="/tmp/Endpoint_SlaveEndpointTest_NoAuthorizer_2_KwjJiS/fetch" --fetcher_cache_size="2GB"
--frameworks_home="" --gc_delay="1weeks" --gc_disk_headroom="0.1" --hadoop_home="" --help="false"
--hostname_lookup="true" --http_authenticators="basic" --http_command_executor="false" --http_credentials="/tmp/Endpoint_SlaveEndpointTest_NoAuthorizer_2_KwjJiS/http_credentials"
--http_heartbeat_interval="30secs" --image_provisioner_backend="copy" --initialize_driver_logging="true"
--isolation="posix/cpu,posix/mem" --launcher="posix" --launcher_dir="/mesos/mesos-1.2.0/_build/src"
--logbufsecs="0" --logging_level="INFO" --max_completed_executors_per_framework="150" --oversubscribed_resources_interval="15secs"
--perf_duration="10secs" --perf_interval="1mins" --qos_correction_interval_min="0ns" --quiet="false"
--recover="reconnect" --recovery_timeout="15mins" --registration_backoff_factor="10ms" --resources="cpus:2;gpus:0;mem:1024;disk:1024;ports:[31000-32000]"
--revocable_cpu_low_priority="true" --runtime_dir="/tmp/Endpoint_SlaveEndpointTest_NoAuthorizer_2_KwjJiS"
--sandbox_directory="/mnt/mesos/sandbox" --strict="true" --switch_user="true" --systemd_enable_support="true"
--systemd_runtime_directory="/run/systemd/system" --version="false" --work_dir="/tmp/Endpoint_SlaveEndpointTest_NoAuthorizer_2_KQEB58"
I1214 12:08:38.554955 28182 credentials.hpp:86] Loading credential for authentication from
'/tmp/Endpoint_SlaveEndpointTest_NoAuthorizer_2_KwjJiS/credential'
I1214 12:08:38.555147 28182 slave.cpp:352] Agent using credential for: test-principal
I1214 12:08:38.555169 28182 credentials.hpp:37] Loading credentials for authentication from
'/tmp/Endpoint_SlaveEndpointTest_NoAuthorizer_2_KwjJiS/http_credentials'
I1214 12:08:38.555378 28182 http.cpp:922] Using default 'basic' HTTP authenticator for realm
'mesos-agent-readonly'
I1214 12:08:38.555539 28182 http.cpp:922] Using default 'basic' HTTP authenticator for realm
'mesos-agent-readwrite'
I1214 12:08:38.556763 28182 slave.cpp:539] Agent resources: cpus(*):2; mem(*):1024; disk(*):1024;
ports(*):[31000-32000]
I1214 12:08:38.556843 28182 slave.cpp:547] Agent attributes: [  ]
I1214 12:08:38.556859 28182 slave.cpp:552] Agent hostname: f9fdd28b77b2
I1214 12:08:38.558646 28178 state.cpp:57] Recovering state from '/tmp/Endpoint_SlaveEndpointTest_NoAuthorizer_2_KQEB58/meta'
I1214 12:08:38.558892 28176 status_update_manager.cpp:203] Recovering status update manager
I1214 12:08:38.559123 28184 containerizer.cpp:594] Recovering containerizer
I1214 12:08:38.560758 28170 provisioner.cpp:253] Provisioner recovery complete
I1214 12:08:38.561231 28176 slave.cpp:5420] Finished recovery
I1214 12:08:38.561843 28176 slave.cpp:5594] Querying resource estimator for oversubscribable
resources
I1214 12:08:38.562116 28174 slave.cpp:5608] Received oversubscribable resources {} from the
resource estimator
I1214 12:08:38.564529 28170 process.cpp:3679] Handling HTTP event for process 'slave(677)'
with path: '/slave(677)/containers'
I1214 12:08:38.566036 28178 http.cpp:874] Authorizing principal 'test-principal' to GET the
'/containers' endpoint
I1214 12:08:38.574189 28183 slave.cpp:796] Agent terminating
[       OK ] Endpoint/SlaveEndpointTest.NoAuthorizer/2 (33 ms)
[----------] 9 tests from Endpoint/SlaveEndpointTest (308 ms total)

[----------] Global test environment tear-down
[==========] 1435 tests from 165 test cases ran. (431649 ms total)
[  PASSED  ] 1434 tests.
[  FAILED  ] 1 test, listed below:
[  FAILED  ] ReservationEndpointsTest.GoodReserveAndUnreserveACL

 1 FAILED TEST
  YOU HAVE 9 DISABLED TESTS

make[4]: *** [check-local] Error 1
make[4]: Leaving directory `/mesos/mesos-1.2.0/_build/src'
make[3]: *** [check-am] Error 2
make[3]: Leaving directory `/mesos/mesos-1.2.0/_build/src'
make[2]: *** [check] Error 2
make[2]: Leaving directory `/mesos/mesos-1.2.0/_build/src'
make[1]: *** [check-recursive] Error 1
make[1]: Leaving directory `/mesos/mesos-1.2.0/_build'
make: *** [distcheck] Error 1
+ docker rmi mesos-1481714986-26840
Untagged: mesos-1481714986-26840:latest
Deleted: sha256:eb2077b8edfd48be826b15bd49f1ea20c156bdcd7ce49a4a9766a79d89bc2ac1
Deleted: sha256:3622cb2e0c3e0d0c3bfe4d7b9dde0fdee3c61e213f25618281211511b1357b9c
Deleted: sha256:71c9dff3b43d3733d3faf8d0dad04a83d100c5226a277110a487de3424349201
Deleted: sha256:4bf9829d1d3a0ea3fdf29699182b1830db118a5c7347e95ea58c3974d22d2d67
Deleted: sha256:faebbcaf8cd1d0bbc2493a63dd389471e5bafc53361a7bf0791b049ec90fb20e
Deleted: sha256:f123163aa5a992d6c67384e482d13b216d2ba4293cd8c675ca4d906b8d247ada
Deleted: sha256:2b2600cc08ba87a4a4595a651ba7a938fe39998151b2c4f0f3e586b86dc3c58c
Deleted: sha256:4372380af87e9322a00cd5675e2d0dd14e9035f04eedb2019d8e60dc19d5c026
Deleted: sha256:4d497198ffdadf66421f99be5040753408353eaf58e85623c9884b1b6e6ec113
Deleted: sha256:b554973fe6f2a5ff48cbcfa20d0153b8e32edce89fbe51683a1c83dd05f457db
Deleted: sha256:d2777d4bcc97e31ae5066d358c579f6349d9df09640f6e985d7a887431bc8382
Deleted: sha256:086f8901940c7189ec7c7973cc0e6b0df390ea7490c5626a855d2fbd150ffb4a
Deleted: sha256:5dce0186b90eeacd14c7442e23a1b88d787214dd6d03a6d9eb1c9cd556b62648
Deleted: sha256:a4aa095faa14e7e68d03ff3d0a4906b0b16093904d93b66ea5729d96fa9ec35e
Deleted: sha256:e502f725095ad340ac88f51290f630a7820165dff67c39a33527a2ecf1ba4916
Deleted: sha256:fcd0ef1c8e3b4910535fdab0672026e1325e3a98219028e36f20c2e023b1e46a
Deleted: sha256:f3022f4819e12528df7093a35fa927fce42db0f51dd88541a97911b4fcd66b02
Deleted: sha256:52893b1dfd21dabdae44ac94eb03d975ef82734cae0fc3f15ac4a9ef364ee514
Deleted: sha256:de8d99964f2356398baab43198ded0ee55246ada266c3d295637de4a8af7dc99
Deleted: sha256:3a55b567e55c5126e6b6e3ecbc5f962e9135995ad2944617d7a4ae9c1750bac2
Deleted: sha256:492192759bda61c86950d3897fcbda406d0ff20db8f457dff26a36c102522e3c
Deleted: sha256:de3b7afc4f3d52105c0c4a4fa8181f4adaa749eee868af39979d0e1982a0b8f2
Deleted: sha256:fb26fb32c325084af1b069ba48039d89881c9bc59469322ccde26414aba08b48
Deleted: sha256:d9e92970853399e1dc40f7cbaba1b88dbebec444ce9d56ab19241be0fd6d9e0c
Build step 'Execute shell' marked build as failure

Mime
View raw message