mesos-builds mailing list archives

Site index · List index
Message view « Date » · « Thread »
Top « Date » · « Thread »
From Apache Jenkins Server <jenk...@builds.apache.org>
Subject Build failed in Jenkins: Mesos » cmake,gcc,--verbose,GLOG_v=1 MESOS_VERBOSE=1,centos:7,(docker||Hadoop)&&(!ubuntu-us1)&&(!ubuntu-6)&&(!ubuntu-eu2) #3033
Date Tue, 13 Dec 2016 00:47:05 GMT
See <https://builds.apache.org/job/Mesos/BUILDTOOL=cmake,COMPILER=gcc,CONFIGURATION=--verbose,ENVIRONMENT=GLOG_v=1%20MESOS_VERBOSE=1,OS=centos%3A7,label_exp=(docker%7C%7CHadoop)&&(!ubuntu-us1)&&(!ubuntu-6)&&(!ubuntu-eu2)/3033/changes>

Changes:

[anand] Fixed erroneous usage of 'Accept' header as 'Accept-Type'.

[vinodkone] Removed "enable_io_switchboard_server" agent flag.

[vinodkone] Fixed EOF bug when tty is enabled in switch board server.

[yujie.jay] Updated address of 'http::connect()' with http scheme for SSL support.

[yujie.jay] Changed 'Socket::create()' in IOSwitchboard to always be of 'kind' POLL.

[yujie.jay] Changed the timing of entering mount namespace for DEBUG container.

[yujie.jay] Fixed an unreachable statement in launch.cpp.

[vinodkone] Added a `http_heartbeat_interval` flag to the agent flags.

[vinodkone] Added a bi-directional heartbeat for IOSwitchboard connections.

------------------------------------------
[...truncated 159924 lines...]
I1213 00:44:18.453666 25346 master.cpp:1258] Agent 23200e16-2bd4-41f5-8972-894da43af5ad-S0
at slave(662)@172.17.0.2:50582 (9c01fb552f95) disconnected
I1213 00:44:18.453688 25346 master.cpp:2977] Disconnecting agent 23200e16-2bd4-41f5-8972-894da43af5ad-S0
at slave(662)@172.17.0.2:50582 (9c01fb552f95)
I1213 00:44:18.453737 25346 master.cpp:2996] Deactivating agent 23200e16-2bd4-41f5-8972-894da43af5ad-S0
at slave(662)@172.17.0.2:50582 (9c01fb552f95)
I1213 00:44:18.453883 25350 hierarchical.cpp:589] Agent 23200e16-2bd4-41f5-8972-894da43af5ad-S0
deactivated
I1213 00:44:18.455467 25334 master.cpp:1097] Master terminating
I1213 00:44:18.455701 25347 hierarchical.cpp:522] Removed agent 23200e16-2bd4-41f5-8972-894da43af5ad-S0
W1213 00:44:18.456051 25334 master.hpp:2531] Failed to close HTTP pipe for 23200e16-2bd4-41f5-8972-894da43af5ad-0000
(default)
I1213 00:44:18.461463 25334 containerizer.cpp:220] Using isolation: posix/cpu,posix/mem,filesystem/posix,network/cni
W1213 00:44:18.461841 25334 backend.cpp:76] Failed to create 'aufs' backend: AufsBackend requires
root privileges, but is running as user mesos
W1213 00:44:18.461932 25334 backend.cpp:76] Failed to create 'bind' backend: BindBackend requires
root privileges
I1213 00:44:18.462841 25337 slave.cpp:209] Mesos agent started on (663)@172.17.0.2:50582
I1213 00:44:18.462854 25337 slave.cpp:210] Flags at startup: --acls="" --appc_simple_discovery_uri_prefix="http://"
--appc_store_dir="/tmp/mesos/store/appc" --authenticate_http_readonly="true" --authenticate_http_readwrite="true"
--authenticatee="crammd5" --authentication_backoff_factor="1secs" --authorizer="local" --cgroups_cpu_enable_pids_and_tids_count="false"
--cgroups_enable_cfs="false" --cgroups_hierarchy="/sys/fs/cgroup" --cgroups_limit_swap="false"
--cgroups_root="mesos" --container_disk_watch_interval="15secs" --containerizers="mesos" --credential="/tmp/Endpoint_SlaveEndpointTest_AuthorizedRequest_0_4ZXpty/credential"
--default_role="*" --disk_watch_interval="1mins" --docker="docker" --docker_kill_orphans="true"
--docker_registry="https://registry-1.docker.io" --docker_remove_delay="6hrs" --docker_socket="/var/run/docker.sock"
--docker_stop_timeout="0ns" --docker_store_dir="/tmp/mesos/store/docker" --docker_volume_checkpoint_dir="/var/run/mesos/isolators/docker/volume"
--enforce_container_disk_quota="false" --executor_registration_timeout="1mins" --executor_shutdown_grace_period="5secs"
--fetcher_cache_dir="/tmp/Endpoint_SlaveEndpointTest_AuthorizedRequest_0_4ZXpty/fetch" --fetcher_cache_size="2GB"
--frameworks_home="" --gc_delay="1weeks" --gc_disk_headroom="0.1" --hadoop_home="" --help="false"
--hostname_lookup="true" --http_authenticators="basic" --http_command_executor="false" --http_credentials="/tmp/Endpoint_SlaveEndpointTest_AuthorizedRequest_0_4ZXpty/http_credentials"
--http_heartbeat_interval="30secs" --image_provisioner_backend="copy" --initialize_driver_logging="true"
--isolation="posix/cpu,posix/mem" --launcher="posix" --launcher_dir="/mesos/build/src" --logbufsecs="0"
--logging_level="INFO" --max_completed_executors_per_framework="150" --oversubscribed_resources_interval="15secs"
--perf_duration="10secs" --perf_interval="1mins" --qos_correction_interval_min="0ns" --quiet="false"
--recover="reconnect" --recovery_timeout="15mins" --registration_backoff_factor="10ms" --resources="cpus:2;gpus:0;mem:1024;disk:1024;ports:[31000-32000]"
--revocable_cpu_low_priority="true" --runtime_dir="/tmp/Endpoint_SlaveEndpointTest_AuthorizedRequest_0_4ZXpty"
--sandbox_directory="/mnt/mesos/sandbox" --strict="true" --switch_user="true" --systemd_enable_support="true"
--systemd_runtime_directory="/run/systemd/system" --version="false" --work_dir="/tmp/Endpoint_SlaveEndpointTest_AuthorizedRequest_0_kehXCe"
I1213 00:44:18.463129 25337 credentials.hpp:86] Loading credential for authentication from
'/tmp/Endpoint_SlaveEndpointTest_AuthorizedRequest_0_4ZXpty/credential'
I1213 00:44:18.463204 25337 slave.cpp:347] Agent using credential for: test-principal
I1213 00:44:18.463217 25337 credentials.hpp:37] Loading credentials for authentication from
'/tmp/Endpoint_SlaveEndpointTest_AuthorizedRequest_0_4ZXpty/http_credentials'
I1213 00:44:18.463297 25337 http.cpp:922] Using default 'basic' HTTP authenticator for realm
'mesos-agent-readonly'
I1213 00:44:18.463335 25337 http.cpp:922] Using default 'basic' HTTP authenticator for realm
'mesos-agent-readwrite'
I1213 00:44:18.463814 25337 slave.cpp:534] Agent resources: cpus(*):2; mem(*):1024; disk(*):1024;
ports(*):[31000-32000]
I1213 00:44:18.463860 25337 slave.cpp:542] Agent attributes: [  ]
I1213 00:44:18.463866 25337 slave.cpp:547] Agent hostname: 9c01fb552f95
I1213 00:44:18.464311 25350 state.cpp:57] Recovering state from '/tmp/Endpoint_SlaveEndpointTest_AuthorizedRequest_0_kehXCe/meta'
I1213 00:44:18.464504 25346 status_update_manager.cpp:203] Recovering status update manager
I1213 00:44:18.464617 25335 containerizer.cpp:594] Recovering containerizer
I1213 00:44:18.465037 25336 provisioner.cpp:253] Provisioner recovery complete
I1213 00:44:18.465200 25335 slave.cpp:5415] Finished recovery
I1213 00:44:18.465508 25335 slave.cpp:5589] Querying resource estimator for oversubscribable
resources
I1213 00:44:18.465600 25350 slave.cpp:5603] Received oversubscribable resources {} from the
resource estimator
I1213 00:44:18.466091 25341 process.cpp:3679] Handling HTTP event for process 'slave(663)'
with path: '/slave(663)/monitor/statistics'
I1213 00:44:18.466454 25345 http.cpp:874] Authorizing principal 'test-principal' to GET the
'/monitor/statistics' endpoint
I1213 00:44:18.467581 25336 slave.cpp:791] Agent terminating
I1213 00:44:18.497576 25334 containerizer.cpp:220] Using isolation: posix/cpu,posix/mem,filesystem/posix,network/cni
W1213 00:44:18.497939 25334 backend.cpp:76] Failed to create 'aufs' backend: AufsBackend requires
root privileges, but is running as user mesos
W1213 00:44:18.498034 25334 backend.cpp:76] Failed to create 'bind' backend: BindBackend requires
root privileges
I1213 00:44:18.499191 25338 slave.cpp:209] Mesos agent started on (664)@172.17.0.2:50582
I1213 00:44:18.499210 25338 slave.cpp:210] Flags at startup: --acls="" --appc_simple_discovery_uri_prefix="http://"
--appc_store_dir="/tmp/mesos/store/appc" --authenticate_http_readonly="true" --authenticate_http_readwrite="true"
--authenticatee="crammd5" --authentication_backoff_factor="1secs" --authorizer="local" --cgroups_cpu_enable_pids_and_tids_count="false"
--cgroups_enable_cfs="false" --cgroups_hierarchy="/sys/fs/cgroup" --cgroups_limit_swap="false"
--cgroups_root="mesos" --container_disk_watch_interval="15secs" --containerizers="mesos" --credential="/tmp/Endpoint_SlaveEndpointTest_AuthorizedRequest_1_JwcC9P/credential"
--default_role="*" --disk_watch_interval="1mins" --docker="docker" --docker_kill_orphans="true"
--docker_registry="https://registry-1.docker.io" --docker_remove_delay="6hrs" --docker_socket="/var/run/docker.sock"
--docker_stop_timeout="0ns" --docker_store_dir="/tmp/mesos/store/docker" --docker_volume_checkpoint_dir="/var/run/mesos/isolators/docker/volume"
--enforce_container_disk_quota="false" --executor_registration_timeout="1mins" --executor_shutdown_grace_period="5secs"
--fetcher_cache_dir="/tmp/Endpoint_SlaveEndpointTest_AuthorizedRequest_1_JwcC9P/fetch" --fetcher_cache_size="2GB"
--frameworks_home="" --gc_delay="1weeks" --gc_disk_headroom="0.1" --hadoop_home="" --help="false"
--hostname_lookup="true" --http_authenticators="basic" --http_command_executor="false" --http_credentials="/tmp/Endpoint_SlaveEndpointTest_AuthorizedRequest_1_JwcC9P/http_credentials"
--http_heartbeat_interval="30secs" --image_provisioner_backend="copy" --initialize_driver_logging="true"
--isolation="posix/cpu,posix/mem" --launcher="posix" --launcher_dir="/mesos/build/src" --logbufsecs="0"
--logging_level="INFO" --max_completed_executors_per_framework="150" --oversubscribed_resources_interval="15secs"
--perf_duration="10secs" --perf_interval="1mins" --qos_correction_interval_min="0ns" --quiet="false"
--recover="reconnect" --recovery_timeout="15mins" --registration_backoff_factor="10ms" --resources="cpus:2;gpus:0;mem:1024;disk:1024;ports:[31000-32000]"
--revocable_cpu_low_priority="true" --runtime_dir="/tmp/Endpoint_SlaveEndpointTest_AuthorizedRequest_1_JwcC9P"
--sandbox_directory="/mnt/mesos/sandbox" --strict="true" --switch_user="true" --systemd_enable_support="true"
--systemd_runtime_directory="/run/systemd/system" --version="false" --work_dir="/tmp/Endpoint_SlaveEndpointTest_AuthorizedRequest_1_BxQgdw"
I1213 00:44:18.499593 25338 credentials.hpp:86] Loading credential for authentication from
'/tmp/Endpoint_SlaveEndpointTest_AuthorizedRequest_1_JwcC9P/credential'
I1213 00:44:18.499693 25338 slave.cpp:347] Agent using credential for: test-principal
I1213 00:44:18.499711 25338 credentials.hpp:37] Loading credentials for authentication from
'/tmp/Endpoint_SlaveEndpointTest_AuthorizedRequest_1_JwcC9P/http_credentials'
I1213 00:44:18.499858 25338 http.cpp:922] Using default 'basic' HTTP authenticator for realm
'mesos-agent-readonly'
I1213 00:44:18.499909 25338 http.cpp:922] Using default 'basic' HTTP authenticator for realm
'mesos-agent-readwrite'
I1213 00:44:18.500361 25338 slave.cpp:534] Agent resources: cpus(*):2; mem(*):1024; disk(*):1024;
ports(*):[31000-32000]
I1213 00:44:18.500406 25338 slave.cpp:542] Agent attributes: [  ]
I1213 00:44:18.500414 25338 slave.cpp:547] Agent hostname: 9c01fb552f95
I1213 00:44:18.500828 25347 state.cpp:57] Recovering state from '/tmp/Endpoint_SlaveEndpointTest_AuthorizedRequest_1_BxQgdw/meta'
I1213 00:44:18.501003 25343 status_update_manager.cpp:203] Recovering status update manager
I1213 00:44:18.501194 25347 containerizer.cpp:594] Recovering containerizer
I1213 00:44:18.501781 25349 provisioner.cpp:253] Provisioner recovery complete
I1213 00:44:18.502013 25338 slave.cpp:5415] Finished recovery
I1213 00:44:18.502471 25338 slave.cpp:5589] Querying resource estimator for oversubscribable
resources
I1213 00:44:18.502691 25347 slave.cpp:5603] Received oversubscribable resources {} from the
resource estimator
I1213 00:44:18.503348 25338 process.cpp:3679] Handling HTTP event for process 'slave(664)'
with path: '/slave(664)/monitor/statistics.json'
I1213 00:44:18.503854 25348 http.cpp:874] Authorizing principal 'test-principal' to GET the
'/monitor/statistics.json' endpoint
I1213 00:44:18.506124 25334 slave.cpp:791] Agent terminating
I1213 00:44:18.514425 25334 containerizer.cpp:220] Using isolation: posix/cpu,posix/mem,filesystem/posix,network/cni
W1213 00:44:18.514698 25334 backend.cpp:76] Failed to create 'aufs' backend: AufsBackend requires
root privileges, but is running as user mesos
W1213 00:44:18.514767 25334 backend.cpp:76] Failed to create 'bind' backend: BindBackend requires
root privileges
I1213 00:44:18.515928 25344 slave.cpp:209] Mesos agent started on (665)@172.17.0.2:50582
I1213 00:44:18.515951 25344 slave.cpp:210] Flags at startup: --acls="" --appc_simple_discovery_uri_prefix="http://"
--appc_store_dir="/tmp/mesos/store/appc" --authenticate_http_readonly="true" --authenticate_http_readwrite="true"
--authenticatee="crammd5" --authentication_backoff_factor="1secs" --authorizer="local" --cgroups_cpu_enable_pids_and_tids_count="false"
--cgroups_enable_cfs="false" --cgroups_hierarchy="/sys/fs/cgroup" --cgroups_limit_swap="false"
--cgroups_root="mesos" --container_disk_watch_interval="15secs" --containerizers="mesos" --credential="/tmp/Endpoint_SlaveEndpointTest_AuthorizedRequest_2_HIbb47/credential"
--default_role="*" --disk_watch_interval="1mins" --docker="docker" --docker_kill_orphans="true"
--docker_registry="https://registry-1.docker.io" --docker_remove_delay="6hrs" --docker_socket="/var/run/docker.sock"
--docker_stop_timeout="0ns" --docker_store_dir="/tmp/mesos/store/docker" --docker_volume_checkpoint_dir="/var/run/mesos/isolators/docker/volume"
--enforce_container_disk_quota="false" --executor_registration_timeout="1mins" --executor_shutdown_grace_period="5secs"
--fetcher_cache_dir="/tmp/Endpoint_SlaveEndpointTest_AuthorizedRequest_2_HIbb47/fetch" --fetcher_cache_size="2GB"
--frameworks_home="" --gc_delay="1weeks" --gc_disk_headroom="0.1" --hadoop_home="" --help="false"
--hostname_lookup="true" --http_authenticators="basic" --http_command_executor="false" --http_credentials="/tmp/Endpoint_SlaveEndpointTest_AuthorizedRequest_2_HIbb47/http_credentials"
--http_heartbeat_interval="30secs" --image_provisioner_backend="copy" --initialize_driver_logging="true"
--isolation="posix/cpu,posix/mem" --launcher="posix" --launcher_dir="/mesos/build/src" --logbufsecs="0"
--logging_level="INFO" --max_completed_executors_per_framework="150" --oversubscribed_resources_interval="15secs"
--perf_duration="10secs" --perf_interval="1mins" --qos_correction_interval_min="0ns" --quiet="false"
--recover="reconnect" --recovery_timeout="15mins" --registration_backoff_factor="10ms" --resources="cpus:2;gpus:0;mem:1024;disk:1024;ports:[31000-32000]"
--revocable_cpu_low_priority="true" --runtime_dir="/tmp/Endpoint_SlaveEndpointTest_AuthorizedRequest_2_HIbb47"
--sandbox_directory="/mnt/mesos/sandbox" --strict="true" --switch_user="true" --systemd_enable_support="true"
--systemd_runtime_directory="/run/systemd/system" --version="false" --work_dir="/tmp/Endpoint_SlaveEndpointTest_AuthorizedRequest_2_Vlh34N"
I1213 00:44:18.516309 25344 credentials.hpp:86] Loading credential for authentication from
'/tmp/Endpoint_SlaveEndpointTest_AuthorizedRequest_2_HIbb47/credential'
I1213 00:44:18.516415 25344 slave.cpp:347] Agent using credential for: test-principal
I1213 00:44:18.516433 25344 credentials.hpp:37] Loading credentials for authentication from
'/tmp/Endpoint_SlaveEndpointTest_AuthorizedRequest_2_HIbb47/http_credentials'
I1213 00:44:18.516548 25344 http.cpp:922] Using default 'basic' HTTP authenticator for realm
'mesos-agent-readonly'
I1213 00:44:18.516597 25344 http.cpp:922] Using default 'basic' HTTP authenticator for realm
'mesos-agent-readwrite'
I1213 00:44:18.517066 25344 slave.cpp:534] Agent resources: cpus(*):2; mem(*):1024; disk(*):1024;
ports(*):[31000-32000]
I1213 00:44:18.517109 25344 slave.cpp:542] Agent attributes: [  ]
I1213 00:44:18.517117 25344 slave.cpp:547] Agent hostname: 9c01fb552f95
I1213 00:44:18.517602 25341 state.cpp:57] Recovering state from '/tmp/Endpoint_SlaveEndpointTest_AuthorizedRequest_2_Vlh34N/meta'
I1213 00:44:18.517809 25340 status_update_manager.cpp:203] Recovering status update manager
I1213 00:44:18.517928 25335 containerizer.cpp:594] Recovering containerizer
I1213 00:44:18.518522 25346 provisioner.cpp:253] Provisioner recovery complete
I1213 00:44:18.518872 25340 slave.cpp:5415] Finished recovery
I1213 00:44:18.519261 25340 slave.cpp:5589] Querying resource estimator for oversubscribable
resources
I1213 00:44:18.519441 25337 slave.cpp:5603] Received oversubscribable resources {} from the
resource estimator
I1213 00:44:18.520242 25339 process.cpp:3679] Handling HTTP event for process 'slave(665)'
with path: '/slave(665)/containers'
I1213 00:44:18.520748 25335 http.cpp:874] Authorizing principal 'test-principal' to GET the
'/containers' endpoint
I1213 00:44:18.522562 25336 slave.cpp:791] Agent terminating
I1213 00:44:18.535387 25334 containerizer.cpp:220] Using isolation: posix/cpu,posix/mem,filesystem/posix,network/cni
W1213 00:44:18.535756 25334 backend.cpp:76] Failed to create 'aufs' backend: AufsBackend requires
root privileges, but is running as user mesos
W1213 00:44:18.535886 25334 backend.cpp:76] Failed to create 'bind' backend: BindBackend requires
root privileges
I1213 00:44:18.537401 25336 slave.cpp:209] Mesos agent started on (666)@172.17.0.2:50582
I1213 00:44:18.537418 25336 slave.cpp:210] Flags at startup: --acls="" --appc_simple_discovery_uri_prefix="http://"
--appc_store_dir="/tmp/mesos/store/appc" --authenticate_http_readonly="true" --authenticate_http_readwrite="true"
--authenticatee="crammd5" --authentication_backoff_factor="1secs" --authorizer="local" --cgroups_cpu_enable_pids_and_tids_count="false"
--cgroups_enable_cfs="false" --cgroups_hierarchy="/sys/fs/cgroup" --cgroups_limit_swap="false"
--cgroups_root="mesos" --container_disk_watch_interval="15secs" --containerizers="mesos" --credential="/tmp/Endpoint_SlaveEndpointTest_UnauthorizedRequest_0_Tv0sbq/credential"
--default_role="*" --disk_watch_interval="1mins" --docker="docker" --docker_kill_orphans="true"
--docker_registry="https://registry-1.docker.io" --docker_remove_delay="6hrs" --docker_socket="/var/run/docker.sock"
--docker_stop_timeout="0ns" --docker_store_dir="/tmp/mesos/store/docker" --docker_volume_checkpoint_dir="/var/run/mesos/isolators/docker/volume"
--enforce_container_disk_quota="false" --executor_registration_timeout="1mins" --executor_shutdown_grace_period="5secs"
--fetcher_cache_dir="/tmp/Endpoint_SlaveEndpointTest_UnauthorizedRequest_0_Tv0sbq/fetch" --fetcher_cache_size="2GB"
--frameworks_home="" --gc_delay="1weeks" --gc_disk_headroom="0.1" --hadoop_home="" --help="false"
--hostname_lookup="true" --http_authenticators="basic" --http_command_executor="false" --http_credentials="/tmp/Endpoint_SlaveEndpointTest_UnauthorizedRequest_0_Tv0sbq/http_credentials"
--http_heartbeat_interval="30secs" --image_provisioner_backend="copy" --initialize_driver_logging="true"
--isolation="posix/cpu,posix/mem" --launcher="posix" --launcher_dir="/mesos/build/src" --logbufsecs="0"
--logging_level="INFO" --max_completed_executors_per_framework="150" --oversubscribed_resources_interval="15secs"
--perf_duration="10secs" --perf_interval="1mins" --qos_correction_interval_min="0ns" --quiet="false"
--recover="reconnect" --recovery_timeout="15mins" --registration_backoff_factor="10ms" --resources="cpus:2;gpus:0;mem:1024;disk:1024;ports:[31000-32000]"
--revocable_cpu_low_priority="true" --runtime_dir="/tmp/Endpoint_SlaveEndpointTest_UnauthorizedRequest_0_Tv0sbq"
--sandbox_directory="/mnt/mesos/sandbox" --strict="true" --switch_user="true" --systemd_enable_support="true"
--systemd_runtime_directory="/run/systemd/system" --version="false" --work_dir="/tmp/Endpoint_SlaveEndpointTest_UnauthorizedRequest_0_nHCZ85"
I1213 00:44:18.537794 25336 credentials.hpp:86] Loading credential for authentication from
'/tmp/Endpoint_SlaveEndpointTest_UnauthorizedRequest_0_Tv0sbq/credential'
I1213 00:44:18.537909 25336 slave.cpp:347] Agent using credential for: test-principal
I1213 00:44:18.537925 25336 credentials.hpp:37] Loading credentials for authentication from
'/tmp/Endpoint_SlaveEndpointTest_UnauthorizedRequest_0_Tv0sbq/http_credentials'
I1213 00:44:18.538036 25336 http.cpp:922] Using default 'basic' HTTP authenticator for realm
'mesos-agent-readonly'
I1213 00:44:18.538087 25336 http.cpp:922] Using default 'basic' HTTP authenticator for realm
'mesos-agent-readwrite'
I1213 00:44:18.538545 25336 slave.cpp:534] Agent resources: cpus(*):2; mem(*):1024; disk(*):1024;
ports(*):[31000-32000]
I1213 00:44:18.538589 25336 slave.cpp:542] Agent attributes: [  ]
I1213 00:44:18.538599 25336 slave.cpp:547] Agent hostname: 9c01fb552f95
I1213 00:44:18.539046 25345 state.cpp:57] Recovering state from '/tmp/Endpoint_SlaveEndpointTest_UnauthorizedRequest_0_nHCZ85/meta'
I1213 00:44:18.539166 25336 status_update_manager.cpp:203] Recovering status update manager
I1213 00:44:18.539290 25350 containerizer.cpp:594] Recovering containerizer
I1213 00:44:18.539886 25338 provisioner.cpp:253] Provisioner recovery complete
I1213 00:44:18.540107 25335 slave.cpp:5415] Finished recovery
I1213 00:44:18.540501 25335 slave.cpp:5589] Querying resource estimator for oversubscribable
resources
I1213 00:44:18.540633 25339 slave.cpp:5603] Received oversubscribable resources {} from the
resource estimator
I1213 00:44:18.541448 25340 process.cpp:3679] Handling HTTP event for process 'slave(666)'
with path: '/slave(666)/monitor/statistics'
I1213 00:44:18.542031 25337 http.cpp:874] Authorizing principal 'test-principal' to GET the
'/monitor/statistics' endpoint
I1213 00:44:18.543457 25341 slave.cpp:791] Agent terminating
I1213 00:44:18.554821 25334 containerizer.cpp:220] Using isolation: posix/cpu,posix/mem,filesystem/posix,network/cni
W1213 00:44:18.555188 25334 backend.cpp:76] Failed to create 'aufs' backend: AufsBackend requires
root privileges, but is running as user mesos
W1213 00:44:18.555279 25334 backend.cpp:76] Failed to create 'bind' backend: BindBackend requires
root privileges
I1213 00:44:18.556571 25338 slave.cpp:209] Mesos agent started on (667)@172.17.0.2:50582
I1213 00:44:18.556746 25338 slave.cpp:210] Flags at startup: --acls="" --appc_simple_discovery_uri_prefix="http://"
--appc_store_dir="/tmp/mesos/store/appc" --authenticate_http_readonly="true" --authenticate_http_readwrite="true"
--authenticatee="crammd5" --authentication_backoff_factor="1secs" --authorizer="local" --cgroups_cpu_enable_pids_and_tids_count="false"
--cgroups_enable_cfs="false" --cgroups_hierarchy="/sys/fs/cgroup" --cgroups_limit_swap="false"
--cgroups_root="mesos" --container_disk_watch_interval="15secs" --containerizers="mesos" --credential="/tmp/Endpoint_SlaveEndpointTest_UnauthorizedRequest_1_7bjIvI/credential"
--default_role="*" --disk_watch_interval="1mins" --docker="docker" --docker_kill_orphans="true"
--docker_registry="https://registry-1.docker.io" --docker_remove_delay="6hrs" --docker_socket="/var/run/docker.sock"
--docker_stop_timeout="0ns" --docker_store_dir="/tmp/mesos/store/docker" --docker_volume_checkpoint_dir="/var/run/mesos/isolators/docker/volume"
--enforce_container_disk_quota="false" --executor_registration_timeout="1mins" --executor_shutdown_grace_period="5secs"
--fetcher_cache_dir="/tmp/Endpoint_SlaveEndpointTest_UnauthorizedRequest_1_7bjIvI/fetch" --fetcher_cache_size="2GB"
--frameworks_home="" --gc_delay="1weeks" --gc_disk_headroom="0.1" --hadoop_home="" --help="false"
--hostname_lookup="true" --http_authenticators="basic" --http_command_executor="false" --http_credentials="/tmp/Endpoint_SlaveEndpointTest_UnauthorizedRequest_1_7bjIvI/http_credentials"
--http_heartbeat_interval="30secs" --image_provisioner_backend="copy" --initialize_driver_logging="true"
--isolation="posix/cpu,posix/mem" --launcher="posix" --launcher_dir="/mesos/build/src" --logbufsecs="0"
--logging_level="INFO" --max_completed_executors_per_framework="150" --oversubscribed_resources_interval="15secs"
--perf_duration="10secs" --perf_interval="1mins" --qos_correction_interval_min="0ns" --quiet="false"
--recover="reconnect" --recovery_timeout="15mins" --registration_backoff_factor="10ms" --resources="cpus:2;gpus:0;mem:1024;disk:1024;ports:[31000-32000]"
--revocable_cpu_low_priority="true" --runtime_dir="/tmp/Endpoint_SlaveEndpointTest_UnauthorizedRequest_1_7bjIvI"
--sandbox_directory="/mnt/mesos/sandbox" --strict="true" --switch_user="true" --systemd_enable_support="true"
--systemd_runtime_directory="/run/systemd/system" --version="false" --work_dir="/tmp/Endpoint_SlaveEndpointTest_UnauthorizedRequest_1_vUG4po"
I1213 00:44:18.557087 25338 credentials.hpp:86] Loading credential for authentication from
'/tmp/Endpoint_SlaveEndpointTest_UnauthorizedRequest_1_7bjIvI/credential'
I1213 00:44:18.557178 25338 slave.cpp:347] Agent using credential for: test-principal
I1213 00:44:18.557194 25338 credentials.hpp:37] Loading credentials for authentication from
'/tmp/Endpoint_SlaveEndpointTest_UnauthorizedRequest_1_7bjIvI/http_credentials'
I1213 00:44:18.557308 25338 http.cpp:922] Using default 'basic' HTTP authenticator for realm
'mesos-agent-readonly'
I1213 00:44:18.557364 25338 http.cpp:922] Using default 'basic' HTTP authenticator for realm
'mesos-agent-readwrite'
I1213 00:44:18.557708 25338 slave.cpp:534] Agent resources: cpus(*):2; mem(*):1024; disk(*):1024;
ports(*):[31000-32000]
I1213 00:44:18.557752 25338 slave.cpp:542] Agent attributes: [  ]
I1213 00:44:18.557762 25338 slave.cpp:547] Agent hostname: 9c01fb552f95
I1213 00:44:18.558142 25345 state.cpp:57] Recovering state from '/tmp/Endpoint_SlaveEndpointTest_UnauthorizedRequest_1_vUG4po/meta'
I1213 00:44:18.558310 25336 status_update_manager.cpp:203] Recovering status update manager
I1213 00:44:18.558581 25349 containerizer.cpp:594] Recovering containerizer
I1213 00:44:18.559324 25346 provisioner.cpp:253] Provisioner recovery complete
I1213 00:44:18.559576 25335 slave.cpp:5415] Finished recovery
I1213 00:44:18.560184 25335 slave.cpp:5589] Querying resource estimator for oversubscribable
resources
I1213 00:44:18.560458 25350 slave.cpp:5603] Received oversubscribable resources {} from the
resource estimator
I1213 00:44:18.561173 25349 process.cpp:3679] Handling HTTP event for process 'slave(667)'
with path: '/slave(667)/monitor/statistics.json'
I1213 00:44:18.561650 25343 http.cpp:874] Authorizing principal 'test-principal' to GET the
'/monitor/statistics.json' endpoint
I1213 00:44:18.563308 25342 slave.cpp:791] Agent terminating
I1213 00:44:18.576099 25334 containerizer.cpp:220] Using isolation: posix/cpu,posix/mem,filesystem/posix,network/cni
W1213 00:44:18.576375 25334 backend.cpp:76] Failed to create 'aufs' backend: AufsBackend requires
root privileges, but is running as user mesos
W1213 00:44:18.576455 25334 backend.cpp:76] Failed to create 'bind' backend: BindBackend requires
root privileges
I1213 00:44:18.578140 25350 slave.cpp:209] Mesos agent started on (668)@172.17.0.2:50582
I1213 00:44:18.578157 25350 slave.cpp:210] Flags at startup: --acls="" --appc_simple_discovery_uri_prefix="http://"
--appc_store_dir="/tmp/mesos/store/appc" --authenticate_http_readonly="true" --authenticate_http_readwrite="true"
--authenticatee="crammd5" --authentication_backoff_factor="1secs" --authorizer="local" --cgroups_cpu_enable_pids_and_tids_count="false"
--cgroups_enable_cfs="false" --cgroups_hierarchy="/sys/fs/cgroup" --cgroups_limit_swap="false"
--cgroups_root="mesos" --container_disk_watch_interval="15secs" --containerizers="mesos" --credential="/tmp/Endpoint_SlaveEndpointTest_UnauthorizedRequest_2_fqUq30/credential"
--default_role="*" --disk_watch_interval="1mins" --docker="docker" --docker_kill_orphans="true"
--docker_registry="https://registry-1.docker.io" --docker_remove_delay="6hrs" --docker_socket="/var/run/docker.sock"
--docker_stop_timeout="0ns" --docker_store_dir="/tmp/mesos/store/docker" --docker_volume_checkpoint_dir="/var/run/mesos/isolators/docker/volume"
--enforce_container_disk_quota="false" --executor_registration_timeout="1mins" --executor_shutdown_grace_period="5secs"
--fetcher_cache_dir="/tmp/Endpoint_SlaveEndpointTest_UnauthorizedRequest_2_fqUq30/fetch" --fetcher_cache_size="2GB"
--frameworks_home="" --gc_delay="1weeks" --gc_disk_headroom="0.1" --hadoop_home="" --help="false"
--hostname_lookup="true" --http_authenticators="basic" --http_command_executor="false" --http_credentials="/tmp/Endpoint_SlaveEndpointTest_UnauthorizedRequest_2_fqUq30/http_credentials"
--http_heartbeat_interval="30secs" --image_provisioner_backend="copy" --initialize_driver_logging="true"
--isolation="posix/cpu,posix/mem" --launcher="posix" --launcher_dir="/mesos/build/src" --logbufsecs="0"
--logging_level="INFO" --max_completed_executors_per_framework="150" --oversubscribed_resources_interval="15secs"
--perf_duration="10secs" --perf_interval="1mins" --qos_correction_interval_min="0ns" --quiet="false"
--recover="reconnect" --recovery_timeout="15mins" --registration_backoff_factor="10ms" --resources="cpus:2;gpus:0;mem:1024;disk:1024;ports:[31000-32000]"
--revocable_cpu_low_priority="true" --runtime_dir="/tmp/Endpoint_SlaveEndpointTest_UnauthorizedRequest_2_fqUq30"
--sandbox_directory="/mnt/mesos/sandbox" --strict="true" --switch_user="true" --systemd_enable_support="true"
--systemd_runtime_directory="/run/systemd/system" --version="false" --work_dir="/tmp/Endpoint_SlaveEndpointTest_UnauthorizedRequest_2_FSnmUG"
I1213 00:44:18.578575 25350 credentials.hpp:86] Loading credential for authentication from
'/tmp/Endpoint_SlaveEndpointTest_UnauthorizedRequest_2_fqUq30/credential'
I1213 00:44:18.578685 25350 slave.cpp:347] Agent using credential for: test-principal
I1213 00:44:18.578701 25350 credentials.hpp:37] Loading credentials for authentication from
'/tmp/Endpoint_SlaveEndpointTest_UnauthorizedRequest_2_fqUq30/http_credentials'
I1213 00:44:18.578816 25350 http.cpp:922] Using default 'basic' HTTP authenticator for realm
'mesos-agent-readonly'
I1213 00:44:18.578873 25350 http.cpp:922] Using default 'basic' HTTP authenticator for realm
'mesos-agent-readwrite'
I1213 00:44:18.579377 25350 slave.cpp:534] Agent resources: cpus(*):2; mem(*):1024; disk(*):1024;
ports(*):[31000-32000]
I1213 00:44:18.579419 25350 slave.cpp:542] Agent attributes: [  ]
I1213 00:44:18.579427 25350 slave.cpp:547] Agent hostname: 9c01fb552f95
I1213 00:44:18.580006 25349 state.cpp:57] Recovering state from '/tmp/Endpoint_SlaveEndpointTest_UnauthorizedRequest_2_FSnmUG/meta'
I1213 00:44:18.580235 25336 status_update_manager.cpp:203] Recovering status update manager
I1213 00:44:18.580351 25336 containerizer.cpp:594] Recovering containerizer
I1213 00:44:18.581384 25337 provisioner.cpp:253] Provisioner recovery complete
I1213 00:44:18.581631 25346 slave.cpp:5415] Finished recovery
I1213 00:44:18.582062 25346 slave.cpp:5589] Querying resource estimator for oversubscribable
resources
I1213 00:44:18.582195 25348 slave.cpp:5603] Received oversubscribable resources {} from the
resource estimator
I1213 00:44:18.582847 25338 process.cpp:3679] Handling HTTP event for process 'slave(668)'
with path: '/slave(668)/containers'
I1213 00:44:18.583281 25347 http.cpp:874] Authorizing principal 'test-principal' to GET the
'/containers' endpoint
I1213 00:44:18.584724 25334 slave.cpp:791] Agent terminating
I1213 00:44:18.600805 25334 containerizer.cpp:220] Using isolation: posix/cpu,posix/mem,filesystem/posix,network/cni
W1213 00:44:18.601197 25334 backend.cpp:76] Failed to create 'aufs' backend: AufsBackend requires
root privileges, but is running as user mesos
W1213 00:44:18.601364 25334 backend.cpp:76] Failed to create 'bind' backend: BindBackend requires
root privileges
I1213 00:44:18.602216 25334 cluster.cpp:446] Creating default 'local' authorizer
I1213 00:44:18.602905 25345 slave.cpp:209] Mesos agent started on (669)@172.17.0.2:50582
I1213 00:44:18.602929 25345 slave.cpp:210] Flags at startup: --acls="" --appc_simple_discovery_uri_prefix="http://"
--appc_store_dir="/tmp/mesos/store/appc" --authenticate_http_readonly="true" --authenticate_http_readwrite="true"
--authenticatee="crammd5" --authentication_backoff_factor="1secs" --authorizer="local" --cgroups_cpu_enable_pids_and_tids_count="false"
--cgroups_enable_cfs="false" --cgroups_hierarchy="/sys/fs/cgroup" --cgroups_limit_swap="false"
--cgroups_root="mesos" --container_disk_watch_interval="15secs" --containerizers="mesos" --credential="/tmp/Endpoint_SlaveEndpointTest_NoAuthorizer_0_dEQvQj/credential"
--default_role="*" --disk_watch_interval="1mins" --docker="docker" --docker_kill_orphans="true"
--docker_registry="https://registry-1.docker.io" --docker_remove_delay="6hrs" --docker_socket="/var/run/docker.sock"
--docker_stop_timeout="0ns" --docker_store_dir="/tmp/mesos/store/docker" --docker_volume_checkpoint_dir="/var/run/mesos/isolators/docker/volume"
--enforce_container_disk_quota="false" --executor_registration_timeout="1mins" --executor_shutdown_grace_period="5secs"
--fetcher_cache_dir="/tmp/Endpoint_SlaveEndpointTest_NoAuthorizer_0_dEQvQj/fetch" --fetcher_cache_size="2GB"
--frameworks_home="" --gc_delay="1weeks" --gc_disk_headroom="0.1" --hadoop_home="" --help="false"
--hostname_lookup="true" --http_authenticators="basic" --http_command_executor="false" --http_credentials="/tmp/Endpoint_SlaveEndpointTest_NoAuthorizer_0_dEQvQj/http_credentials"
--http_heartbeat_interval="30secs" --image_provisioner_backend="copy" --initialize_driver_logging="true"
--isolation="posix/cpu,posix/mem" --launcher="posix" --launcher_dir="/mesos/build/src" --logbufsecs="0"
--logging_level="INFO" --max_completed_executors_per_framework="150" --oversubscribed_resources_interval="15secs"
--perf_duration="10secs" --perf_interval="1mins" --qos_correction_interval_min="0ns" --quiet="false"
--recover="reconnect" --recovery_timeout="15mins" --registration_backoff_factor="10ms" --resources="cpus:2;gpus:0;mem:1024;disk:1024;ports:[31000-32000]"
--revocable_cpu_low_priority="true" --runtime_dir="/tmp/Endpoint_SlaveEndpointTest_NoAuthorizer_0_dEQvQj"
--sandbox_directory="/mnt/mesos/sandbox" --strict="true" --switch_user="true" --systemd_enable_support="true"
--systemd_runtime_directory="/run/systemd/system" --version="false" --work_dir="/tmp/Endpoint_SlaveEndpointTest_NoAuthorizer_0_NvGuDZ"
I1213 00:44:18.603310 25345 credentials.hpp:86] Loading credential for authentication from
'/tmp/Endpoint_SlaveEndpointTest_NoAuthorizer_0_dEQvQj/credential'
I1213 00:44:18.620388 25345 slave.cpp:347] Agent using credential for: test-principal
I1213 00:44:18.620409 25345 credentials.hpp:37] Loading credentials for authentication from
'/tmp/Endpoint_SlaveEndpointTest_NoAuthorizer_0_dEQvQj/http_credentials'
I1213 00:44:18.620527 25345 http.cpp:922] Using default 'basic' HTTP authenticator for realm
'mesos-agent-readonly'
I1213 00:44:18.620578 25345 http.cpp:922] Using default 'basic' HTTP authenticator for realm
'mesos-agent-readwrite'
I1213 00:44:18.621013 25345 slave.cpp:534] Agent resources: cpus(*):2; mem(*):1024; disk(*):1024;
ports(*):[31000-32000]
I1213 00:44:18.621060 25345 slave.cpp:542] Agent attributes: [  ]
I1213 00:44:18.621073 25345 slave.cpp:547] Agent hostname: 9c01fb552f95
I1213 00:44:18.621668 25342 state.cpp:57] Recovering state from '/tmp/Endpoint_SlaveEndpointTest_NoAuthorizer_0_NvGuDZ/meta'
I1213 00:44:18.621893 25337 status_update_manager.cpp:203] Recovering status update manager
I1213 00:44:18.622022 25341 containerizer.cpp:594] Recovering containerizer
I1213 00:44:18.622711 25340 provisioner.cpp:253] Provisioner recovery complete
I1213 00:44:18.622961 25340 slave.cpp:5415] Finished recovery
I1213 00:44:18.623467 25340 slave.cpp:5589] Querying resource estimator for oversubscribable
resources
I1213 00:44:18.623653 25336 slave.cpp:5603] Received oversubscribable resources {} from the
resource estimator
I1213 00:44:18.624426 25337 process.cpp:3679] Handling HTTP event for process 'slave(669)'
with path: '/slave(669)/monitor/statistics'
I1213 00:44:18.624987 25350 http.cpp:874] Authorizing principal 'test-principal' to GET the
'/monitor/statistics' endpoint
I1213 00:44:18.626377 25342 slave.cpp:791] Agent terminating
I1213 00:44:18.657534 25334 containerizer.cpp:220] Using isolation: posix/cpu,posix/mem,filesystem/posix,network/cni
W1213 00:44:18.657927 25334 backend.cpp:76] Failed to create 'aufs' backend: AufsBackend requires
root privileges, but is running as user mesos
W1213 00:44:18.658025 25334 backend.cpp:76] Failed to create 'bind' backend: BindBackend requires
root privileges
I1213 00:44:18.658905 25334 cluster.cpp:446] Creating default 'local' authorizer
I1213 00:44:18.659499 25348 slave.cpp:209] Mesos agent started on (670)@172.17.0.2:50582
I1213 00:44:18.659528 25348 slave.cpp:210] Flags at startup: --acls="" --appc_simple_discovery_uri_prefix="http://"
--appc_store_dir="/tmp/mesos/store/appc" --authenticate_http_readonly="true" --authenticate_http_readwrite="true"
--authenticatee="crammd5" --authentication_backoff_factor="1secs" --authorizer="local" --cgroups_cpu_enable_pids_and_tids_count="false"
--cgroups_enable_cfs="false" --cgroups_hierarchy="/sys/fs/cgroup" --cgroups_limit_swap="false"
--cgroups_root="mesos" --container_disk_watch_interval="15secs" --containerizers="mesos" --credential="/tmp/Endpoint_SlaveEndpointTest_NoAuthorizer_1_RhK8bD/credential"
--default_role="*" --disk_watch_interval="1mins" --docker="docker" --docker_kill_orphans="true"
--docker_registry="https://registry-1.docker.io" --docker_remove_delay="6hrs" --docker_socket="/var/run/docker.sock"
--docker_stop_timeout="0ns" --docker_store_dir="/tmp/mesos/store/docker" --docker_volume_checkpoint_dir="/var/run/mesos/isolators/docker/volume"
--enforce_container_disk_quota="false" --executor_registration_timeout="1mins" --executor_shutdown_grace_period="5secs"
--fetcher_cache_dir="/tmp/Endpoint_SlaveEndpointTest_NoAuthorizer_1_RhK8bD/fetch" --fetcher_cache_size="2GB"
--frameworks_home="" --gc_delay="1weeks" --gc_disk_headroom="0.1" --hadoop_home="" --help="false"
--hostname_lookup="true" --http_authenticators="basic" --http_command_executor="false" --http_credentials="/tmp/Endpoint_SlaveEndpointTest_NoAuthorizer_1_RhK8bD/http_credentials"
--http_heartbeat_interval="30secs" --image_provisioner_backend="copy" --initialize_driver_logging="true"
--isolation="posix/cpu,posix/mem" --launcher="posix" --launcher_dir="/mesos/build/src" --logbufsecs="0"
--logging_level="INFO" --max_completed_executors_per_framework="150" --oversubscribed_resources_interval="15secs"
--perf_duration="10secs" --perf_interval="1mins" --qos_correction_interval_min="0ns" --quiet="false"
--recover="reconnect" --recovery_timeout="15mins" --registration_backoff_factor="10ms" --resources="cpus:2;gpus:0;mem:1024;disk:1024;ports:[31000-32000]"
--revocable_cpu_low_priority="true" --runtime_dir="/tmp/Endpoint_SlaveEndpointTest_NoAuthorizer_1_RhK8bD"
--sandbox_directory="/mnt/mesos/sandbox" --strict="true" --switch_user="true" --systemd_enable_support="true"
--systemd_runtime_directory="/run/systemd/system" --version="false" --work_dir="/tmp/Endpoint_SlaveEndpointTest_NoAuthorizer_1_Fw4QPi"
I1213 00:44:18.660046 25348 credentials.hpp:86] Loading credential for authentication from
'/tmp/Endpoint_SlaveEndpointTest_NoAuthorizer_1_RhK8bD/credential'
I1213 00:44:18.660176 25348 slave.cpp:347] Agent using credential for: test-principal
I1213 00:44:18.660192 25348 credentials.hpp:37] Loading credentials for authentication from
'/tmp/Endpoint_SlaveEndpointTest_NoAuthorizer_1_RhK8bD/http_credentials'
I1213 00:44:18.660316 25348 http.cpp:922] Using default 'basic' HTTP authenticator for realm
'mesos-agent-readonly'
I1213 00:44:18.660375 25348 http.cpp:922] Using default 'basic' HTTP authenticator for realm
'mesos-agent-readwrite'
I1213 00:44:18.660790 25348 slave.cpp:534] Agent resources: cpus(*):2; mem(*):1024; disk(*):1024;
ports(*):[31000-32000]
I1213 00:44:18.660836 25348 slave.cpp:542] Agent attributes: [  ]
I1213 00:44:18.660845 25348 slave.cpp:547] Agent hostname: 9c01fb552f95
I1213 00:44:18.661350 25335 state.cpp:57] Recovering state from '/tmp/Endpoint_SlaveEndpointTest_NoAuthorizer_1_Fw4QPi/meta'
I1213 00:44:18.661615 25336 status_update_manager.cpp:203] Recovering status update manager
I1213 00:44:18.661756 25343 containerizer.cpp:594] Recovering containerizer
I1213 00:44:18.662365 25348 provisioner.cpp:253] Provisioner recovery complete
I1213 00:44:18.662541 25336 slave.cpp:5415] Finished recovery
I1213 00:44:18.662883 25336 slave.cpp:5589] Querying resource estimator for oversubscribable
resources
I1213 00:44:18.663023 25339 slave.cpp:5603] Received oversubscribable resources {} from the
resource estimator
I1213 00:44:18.663856 25350 process.cpp:3679] Handling HTTP event for process 'slave(670)'
with path: '/slave(670)/monitor/statistics.json'
I1213 00:44:18.664430 25347 http.cpp:874] Authorizing principal 'test-principal' to GET the
'/monitor/statistics.json' endpoint
I1213 00:44:18.665915 25337 slave.cpp:791] Agent terminating
I1213 00:44:18.690526 25334 containerizer.cpp:220] Using isolation: posix/cpu,posix/mem,filesystem/posix,network/cni
W1213 00:44:18.690898 25334 backend.cpp:76] Failed to create 'aufs' backend: AufsBackend requires
root privileges, but is running as user mesos
W1213 00:44:18.690995 25334 backend.cpp:76] Failed to create 'bind' backend: BindBackend requires
root privileges
I1213 00:44:18.691745 25334 cluster.cpp:446] Creating default 'local' authorizer
I1213 00:44:18.692451 25341 slave.cpp:209] Mesos agent started on (671)@172.17.0.2:50582
I1213 00:44:18.692478 25341 slave.cpp:210] Flags at startup: --acls="" --appc_simple_discovery_uri_prefix="http://"
--appc_store_dir="/tmp/mesos/store/appc" --authenticate_http_readonly="true" --authenticate_http_readwrite="true"
--authenticatee="crammd5" --authentication_backoff_factor="1secs" --authorizer="local" --cgroups_cpu_enable_pids_and_tids_count="false"
--cgroups_enable_cfs="false" --cgroups_hierarchy="/sys/fs/cgroup" --cgroups_limit_swap="false"
--cgroups_root="mesos" --container_disk_watch_interval="15secs" --containerizers="mesos" --credential="/tmp/Endpoint_SlaveEndpointTest_NoAuthorizer_2_D9riUW/credential"
--default_role="*" --disk_watch_interval="1mins" --docker="docker" --docker_kill_orphans="true"
--docker_registry="https://registry-1.docker.io" --docker_remove_delay="6hrs" --docker_socket="/var/run/docker.sock"
--docker_stop_timeout="0ns" --docker_store_dir="/tmp/mesos/store/docker" --docker_volume_checkpoint_dir="/var/run/mesos/isolators/docker/volume"
--enforce_container_disk_quota="false" --executor_registration_timeout="1mins" --executor_shutdown_grace_period="5secs"
--fetcher_cache_dir="/tmp/Endpoint_SlaveEndpointTest_NoAuthorizer_2_D9riUW/fetch" --fetcher_cache_size="2GB"
--frameworks_home="" --gc_delay="1weeks" --gc_disk_headroom="0.1" --hadoop_home="" --help="false"
--hostname_lookup="true" --http_authenticators="basic" --http_command_executor="false" --http_credentials="/tmp/Endpoint_SlaveEndpointTest_NoAuthorizer_2_D9riUW/http_credentials"
--http_heartbeat_interval="30secs" --image_provisioner_backend="copy" --initialize_driver_logging="true"
--isolation="posix/cpu,posix/mem" --launcher="posix" --launcher_dir="/mesos/build/src" --logbufsecs="0"
--logging_level="INFO" --max_completed_executors_per_framework="150" --oversubscribed_resources_interval="15secs"
--perf_duration="10secs" --perf_interval="1mins" --qos_correction_interval_min="0ns" --quiet="false"
--recover="reconnect" --recovery_timeout="15mins" --registration_backoff_factor="10ms" --resources="cpus:2;gpus:0;mem:1024;disk:1024;ports:[31000-32000]"
--revocable_cpu_low_priority="true" --runtime_dir="/tmp/Endpoint_SlaveEndpointTest_NoAuthorizer_2_D9riUW"
--sandbox_directory="/mnt/mesos/sandbox" --strict="true" --switch_user="true" --systemd_enable_support="true"
--systemd_runtime_directory="/run/systemd/system" --version="false" --work_dir="/tmp/Endpoint_SlaveEndpointTest_NoAuthorizer_2_9QfEsC"
I1213 00:44:18.692914 25341 credentials.hpp:86] Loading credential for authentication from
'/tmp/Endpoint_SlaveEndpointTest_NoAuthorizer_2_D9riUW/credential'
I1213 00:44:18.693011 25341 slave.cpp:347] Agent using credential for: test-principal
I1213 00:44:18.693027 25341 credentials.hpp:37] Loading credentials for authentication from
'/tmp/Endpoint_SlaveEndpointTest_NoAuthorizer_2_D9riUW/http_credentials'
I1213 00:44:18.693137 25341 http.cpp:922] Using default 'basic' HTTP authenticator for realm
'mesos-agent-readonly'
I1213 00:44:18.693191 25341 http.cpp:922] Using default 'basic' HTTP authenticator for realm
'mesos-agent-readwrite'
I1213 00:44:18.693611 25341 slave.cpp:534] Agent resources: cpus(*):2; mem(*):1024; disk(*):1024;
ports(*):[31000-32000]
I1213 00:44:18.693655 25341 slave.cpp:542] Agent attributes: [  ]
I1213 00:44:18.693661 25341 slave.cpp:547] Agent hostname: 9c01fb552f95
I1213 00:44:18.694121 25344 state.cpp:57] Recovering state from '/tmp/Endpoint_SlaveEndpointTest_NoAuthorizer_2_9QfEsC/meta'
I1213 00:44:18.694322 25347 status_update_manager.cpp:203] Recovering status update manager
I1213 00:44:18.694442 25349 containerizer.cpp:594] Recovering containerizer
I1213 00:44:18.695152 25348 provisioner.cpp:253] Provisioner recovery complete
I1213 00:44:18.695309 25348 slave.cpp:5415] Finished recovery
I1213 00:44:18.695719 25348 slave.cpp:5589] Querying resource estimator for oversubscribable
resources
I1213 00:44:18.695891 25350 slave.cpp:5603] Received oversubscribable resources {} from the
resource estimator
I1213 00:44:18.696579 25340 process.cpp:3679] Handling HTTP event for process 'slave(671)'
with path: '/slave(671)/containers'
I1213 00:44:18.697033 25348 http.cpp:874] Authorizing principal 'test-principal' to GET the
'/containers' endpoint
I1213 00:44:18.698333 25345 slave.cpp:791] Agent terminating
make[3]: *** [CMakeFiles/check] Error 1
make[2]: *** [CMakeFiles/check.dir/all] Error 2
make[1]: *** [CMakeFiles/check.dir/rule] Error 2
make: *** [check] Error 2
+ docker rmi mesos-1481587221-5606
Untagged: mesos-1481587221-5606:latest
Deleted: sha256:b3f27b599ad9b899366aa7969b6cbffc97066b0cef68f2c365734def6be2676b
Deleted: sha256:06a803abcc64d087dae0abda2e8e4e38a434c0d4c22d5ed9411c5e417fdc663b
Deleted: sha256:916c7ed9e5a336b419ec95dc31f06ec478f33cf21fd20004e0ba09982ecc2a7d
Deleted: sha256:9a07a5b8c72df9e3c974e0da44fe14b09c713fa5486f0272a1fc2cec81ff6a20
Deleted: sha256:8b6e32c6d04257832a865169c47a84a1ebbcdf0da17cbca42e770e3cc0ca5055
Deleted: sha256:ddb6378f09c50de3a89179c85a3b2c780032974d6d328d9527afcfe823d0a2ad
Deleted: sha256:6385a717cd2f6d65919ec2556220404322ffc79154fc326f70cf5ebc9adb25c1
Deleted: sha256:ad14cec1cbeb9fa4ca4b3afc5352ddc1d88edd46db96f2556ffa0348626d1fb2
Deleted: sha256:6c9ad448624bd1067521f1b6a6782f1e8a82527ef74ea8c1b3b22102cc94e886
Deleted: sha256:9c18fa934994a94bc1a64052f216f5063223766932c3b4dd448384f4a95612df
Deleted: sha256:fd534f0e950949633db0e44289cc23bd21111a689fea215d10181e248ff2491b
Deleted: sha256:301c378c9f2446f369fbc95dcb3f79f5093957807e0341d54e15fa5f04555344
Deleted: sha256:21c9bfdaeb73fb67a579b1e1e979f6b2fe8489493ea6021d28a7a14e484eeaa1
Deleted: sha256:f3342edd248ee485e3b3afc35d46cdf723eca6430e747db03db4ba494e82204b
Deleted: sha256:d3841c28eb375415890b23fe5f1e34a95e725cc20dbae0e4e1ccc0536c439d0d
Deleted: sha256:31c1ec4ed2f329231715b270c6261f35ddc1c7709d8c841f5c97fc3456239481
Deleted: sha256:66ff848a07e3fa2ed5ccf12b58a0ef6ba26e8e4d0462fd9968125c8a0c7695c9
Deleted: sha256:eec0a2cd29f26e95dfbd33f26577dadcc2ffa511f918fe1ddedee45b27838d04
Deleted: sha256:e2de5c6e6c4c71e3e99cd4471876e07dbef26fd841099e72a2aa94b67d49d878
Deleted: sha256:c96699c78ebee9b62a5f33f6aecaf19b0eb4b7a0f331efb9df67ac849d69e03d
Deleted: sha256:ae0904da996143323ec5027d8a4ee864d2c95aa0a2ad67495fbc7b7af89d317c
Deleted: sha256:2872f46a4901fec4829a021b259e723fbe826477e3615c806ed412da86b6f303
Deleted: sha256:6959eba0c17a94ad5ad7740dfb6fb70e7af5985d2990490613c84c21f4dc5c44
Deleted: sha256:7109f930b5be96ec93d177fda253fe320cc701b2e18219c2d7117f5b4456e670
Deleted: sha256:3cda63a9170b6aba7d47ecff2d82187b77f44ce173268369439b1dedbe8415bf
Build step 'Execute shell' marked build as failure

Mime
View raw message