mesos-builds mailing list archives

Site index · List index
Message view « Date » · « Thread »
Top « Date » · « Thread »
From Apache Jenkins Server <jenk...@builds.apache.org>
Subject Build failed in Jenkins: Mesos » autotools,clang,--verbose --enable-libevent --enable-ssl,GLOG_v=1 MESOS_VERBOSE=1,ubuntu:14.04,(docker||Hadoop)&&(!ubuntu-us1)&&(!ubuntu-6)&&(!ubuntu-eu2) #3023
Date Fri, 09 Dec 2016 14:41:45 GMT
See <https://builds.apache.org/job/Mesos/BUILDTOOL=autotools,COMPILER=clang,CONFIGURATION=--verbose%20--enable-libevent%20--enable-ssl,ENVIRONMENT=GLOG_v=1%20MESOS_VERBOSE=1,OS=ubuntu%3A14.04,label_exp=(docker%7C%7CHadoop)&&(!ubuntu-us1)&&(!ubuntu-6)&&(!ubuntu-eu2)/3023/changes>

Changes:

[bmahler] Added implicit role tests for multi-role frameworks.

[toenshoff] Improved equality check in SlaveTest.StateEndpoint.

------------------------------------------
[...truncated 173853 lines...]
W1209 14:41:10.588683 29799 backend.cpp:76] Failed to create 'aufs' backend: AufsBackend requires
root privileges, but is running as user mesos
W1209 14:41:10.588829 29799 backend.cpp:76] Failed to create 'bind' backend: BindBackend requires
root privileges
I1209 14:41:10.591570 29821 slave.cpp:208] Mesos agent started on (662)@172.17.0.3:60259
I1209 14:41:10.591609 29821 slave.cpp:209] Flags at startup: --acls="" --appc_simple_discovery_uri_prefix="http://"
--appc_store_dir="/tmp/mesos/store/appc" --authenticate_http_readonly="true" --authenticate_http_readwrite="true"
--authenticatee="crammd5" --authentication_backoff_factor="1secs" --authorizer="local" --cgroups_cpu_enable_pids_and_tids_count="false"
--cgroups_enable_cfs="false" --cgroups_hierarchy="/sys/fs/cgroup" --cgroups_limit_swap="false"
--cgroups_root="mesos" --container_disk_watch_interval="15secs" --containerizers="mesos" --credential="/tmp/Endpoint_SlaveEndpointTest_AuthorizedRequest_1_QdmbdM/credential"
--default_role="*" --disk_watch_interval="1mins" --docker="docker" --docker_kill_orphans="true"
--docker_registry="https://registry-1.docker.io" --docker_remove_delay="6hrs" --docker_socket="/var/run/docker.sock"
--docker_stop_timeout="0ns" --docker_store_dir="/tmp/mesos/store/docker" --docker_volume_checkpoint_dir="/var/run/mesos/isolators/docker/volume"
--enforce_container_disk_quota="false" --executor_registration_timeout="1mins" --executor_shutdown_grace_period="5secs"
--fetcher_cache_dir="/tmp/Endpoint_SlaveEndpointTest_AuthorizedRequest_1_QdmbdM/fetch" --fetcher_cache_size="2GB"
--frameworks_home="" --gc_delay="1weeks" --gc_disk_headroom="0.1" --hadoop_home="" --help="false"
--hostname_lookup="true" --http_authenticators="basic" --http_command_executor="false" --http_credentials="/tmp/Endpoint_SlaveEndpointTest_AuthorizedRequest_1_QdmbdM/http_credentials"
--image_provisioner_backend="copy" --initialize_driver_logging="true" --io_switchboard_enable_server="true"
--isolation="posix/cpu,posix/mem" --launcher="posix" --launcher_dir="/mesos/mesos-1.2.0/_build/src"
--logbufsecs="0" --logging_level="INFO" --max_completed_executors_per_framework="150" --oversubscribed_resources_interval="15secs"
--perf_duration="10secs" --perf_interval="1mins" --qos_correction_interval_min="0ns" --quiet="false"
--recover="reconnect" --recovery_timeout="15mins" --registration_backoff_factor="10ms" --resources="cpus:2;gpus:0;mem:1024;disk:1024;ports:[31000-32000]"
--revocable_cpu_low_priority="true" --runtime_dir="/tmp/Endpoint_SlaveEndpointTest_AuthorizedRequest_1_QdmbdM"
--sandbox_directory="/mnt/mesos/sandbox" --strict="true" --switch_user="true" --systemd_enable_support="true"
--systemd_runtime_directory="/run/systemd/system" --version="false" --work_dir="/tmp/Endpoint_SlaveEndpointTest_AuthorizedRequest_1_Z73eQh"
I1209 14:41:10.592061 29821 credentials.hpp:86] Loading credential for authentication from
'/tmp/Endpoint_SlaveEndpointTest_AuthorizedRequest_1_QdmbdM/credential'
I1209 14:41:10.592190 29821 slave.cpp:346] Agent using credential for: test-principal
I1209 14:41:10.592211 29821 credentials.hpp:37] Loading credentials for authentication from
'/tmp/Endpoint_SlaveEndpointTest_AuthorizedRequest_1_QdmbdM/http_credentials'
I1209 14:41:10.592402 29821 http.cpp:922] Using default 'basic' HTTP authenticator for realm
'mesos-agent-readonly'
I1209 14:41:10.592530 29821 http.cpp:922] Using default 'basic' HTTP authenticator for realm
'mesos-agent-readwrite'
I1209 14:41:10.593502 29821 slave.cpp:533] Agent resources: cpus(*):2; mem(*):1024; disk(*):1024;
ports(*):[31000-32000]
I1209 14:41:10.593577 29821 slave.cpp:541] Agent attributes: [  ]
I1209 14:41:10.593590 29821 slave.cpp:546] Agent hostname: 5b06fb1bbcfc
I1209 14:41:10.594960 29817 state.cpp:57] Recovering state from '/tmp/Endpoint_SlaveEndpointTest_AuthorizedRequest_1_Z73eQh/meta'
I1209 14:41:10.595180 29821 status_update_manager.cpp:203] Recovering status update manager
I1209 14:41:10.595510 29817 containerizer.cpp:591] Recovering containerizer
I1209 14:41:10.596698 29822 provisioner.cpp:253] Provisioner recovery complete
I1209 14:41:10.597113 29826 slave.cpp:5414] Finished recovery
I1209 14:41:10.597551 29826 slave.cpp:5588] Querying resource estimator for oversubscribable
resources
I1209 14:41:10.597899 29822 slave.cpp:5602] Received oversubscribable resources {} from the
resource estimator
I1209 14:41:10.599493 29820 process.cpp:3679] Handling HTTP event for process 'slave(662)'
with path: '/slave(662)/monitor/statistics.json'
I1209 14:41:10.600780 29820 http.cpp:874] Authorizing principal 'test-principal' to GET the
'/monitor/statistics.json' endpoint
I1209 14:41:10.603516 29823 slave.cpp:790] Agent terminating
[       OK ] Endpoint/SlaveEndpointTest.AuthorizedRequest/1 (25 ms)
[ RUN      ] Endpoint/SlaveEndpointTest.AuthorizedRequest/2
I1209 14:41:10.615082 29799 containerizer.cpp:217] Using isolation: posix/cpu,posix/mem,filesystem/posix,network/cni
W1209 14:41:10.615713 29799 backend.cpp:76] Failed to create 'aufs' backend: AufsBackend requires
root privileges, but is running as user mesos
W1209 14:41:10.615880 29799 backend.cpp:76] Failed to create 'bind' backend: BindBackend requires
root privileges
I1209 14:41:10.619618 29822 slave.cpp:208] Mesos agent started on (663)@172.17.0.3:60259
I1209 14:41:10.619663 29822 slave.cpp:209] Flags at startup: --acls="" --appc_simple_discovery_uri_prefix="http://"
--appc_store_dir="/tmp/mesos/store/appc" --authenticate_http_readonly="true" --authenticate_http_readwrite="true"
--authenticatee="crammd5" --authentication_backoff_factor="1secs" --authorizer="local" --cgroups_cpu_enable_pids_and_tids_count="false"
--cgroups_enable_cfs="false" --cgroups_hierarchy="/sys/fs/cgroup" --cgroups_limit_swap="false"
--cgroups_root="mesos" --container_disk_watch_interval="15secs" --containerizers="mesos" --credential="/tmp/Endpoint_SlaveEndpointTest_AuthorizedRequest_2_eiaIVJ/credential"
--default_role="*" --disk_watch_interval="1mins" --docker="docker" --docker_kill_orphans="true"
--docker_registry="https://registry-1.docker.io" --docker_remove_delay="6hrs" --docker_socket="/var/run/docker.sock"
--docker_stop_timeout="0ns" --docker_store_dir="/tmp/mesos/store/docker" --docker_volume_checkpoint_dir="/var/run/mesos/isolators/docker/volume"
--enforce_container_disk_quota="false" --executor_registration_timeout="1mins" --executor_shutdown_grace_period="5secs"
--fetcher_cache_dir="/tmp/Endpoint_SlaveEndpointTest_AuthorizedRequest_2_eiaIVJ/fetch" --fetcher_cache_size="2GB"
--frameworks_home="" --gc_delay="1weeks" --gc_disk_headroom="0.1" --hadoop_home="" --help="false"
--hostname_lookup="true" --http_authenticators="basic" --http_command_executor="false" --http_credentials="/tmp/Endpoint_SlaveEndpointTest_AuthorizedRequest_2_eiaIVJ/http_credentials"
--image_provisioner_backend="copy" --initialize_driver_logging="true" --io_switchboard_enable_server="true"
--isolation="posix/cpu,posix/mem" --launcher="posix" --launcher_dir="/mesos/mesos-1.2.0/_build/src"
--logbufsecs="0" --logging_level="INFO" --max_completed_executors_per_framework="150" --oversubscribed_resources_interval="15secs"
--perf_duration="10secs" --perf_interval="1mins" --qos_correction_interval_min="0ns" --quiet="false"
--recover="reconnect" --recovery_timeout="15mins" --registration_backoff_factor="10ms" --resources="cpus:2;gpus:0;mem:1024;disk:1024;ports:[31000-32000]"
--revocable_cpu_low_priority="true" --runtime_dir="/tmp/Endpoint_SlaveEndpointTest_AuthorizedRequest_2_eiaIVJ"
--sandbox_directory="/mnt/mesos/sandbox" --strict="true" --switch_user="true" --systemd_enable_support="true"
--systemd_runtime_directory="/run/systemd/system" --version="false" --work_dir="/tmp/Endpoint_SlaveEndpointTest_AuthorizedRequest_2_z44muf"
I1209 14:41:10.620398 29822 credentials.hpp:86] Loading credential for authentication from
'/tmp/Endpoint_SlaveEndpointTest_AuthorizedRequest_2_eiaIVJ/credential'
I1209 14:41:10.620601 29822 slave.cpp:346] Agent using credential for: test-principal
I1209 14:41:10.620630 29822 credentials.hpp:37] Loading credentials for authentication from
'/tmp/Endpoint_SlaveEndpointTest_AuthorizedRequest_2_eiaIVJ/http_credentials'
I1209 14:41:10.620909 29822 http.cpp:922] Using default 'basic' HTTP authenticator for realm
'mesos-agent-readonly'
I1209 14:41:10.621065 29822 http.cpp:922] Using default 'basic' HTTP authenticator for realm
'mesos-agent-readwrite'
I1209 14:41:10.622649 29822 slave.cpp:533] Agent resources: cpus(*):2; mem(*):1024; disk(*):1024;
ports(*):[31000-32000]
I1209 14:41:10.622767 29822 slave.cpp:541] Agent attributes: [  ]
I1209 14:41:10.622817 29822 slave.cpp:546] Agent hostname: 5b06fb1bbcfc
I1209 14:41:10.625218 29822 state.cpp:57] Recovering state from '/tmp/Endpoint_SlaveEndpointTest_AuthorizedRequest_2_z44muf/meta'
I1209 14:41:10.625627 29822 status_update_manager.cpp:203] Recovering status update manager
I1209 14:41:10.625816 29822 containerizer.cpp:591] Recovering containerizer
I1209 14:41:10.627748 29822 provisioner.cpp:253] Provisioner recovery complete
I1209 14:41:10.628340 29822 slave.cpp:5414] Finished recovery
I1209 14:41:10.628818 29822 slave.cpp:5588] Querying resource estimator for oversubscribable
resources
I1209 14:41:10.629453 29822 slave.cpp:5602] Received oversubscribable resources {} from the
resource estimator
I1209 14:41:10.631729 29831 process.cpp:3679] Handling HTTP event for process 'slave(663)'
with path: '/slave(663)/containers'
I1209 14:41:10.633221 29829 http.cpp:874] Authorizing principal 'test-principal' to GET the
'/containers' endpoint
I1209 14:41:10.636512 29826 slave.cpp:790] Agent terminating
[       OK ] Endpoint/SlaveEndpointTest.AuthorizedRequest/2 (33 ms)
[ RUN      ] Endpoint/SlaveEndpointTest.UnauthorizedRequest/0
I1209 14:41:10.647826 29799 containerizer.cpp:217] Using isolation: posix/cpu,posix/mem,filesystem/posix,network/cni
W1209 14:41:10.648279 29799 backend.cpp:76] Failed to create 'aufs' backend: AufsBackend requires
root privileges, but is running as user mesos
W1209 14:41:10.648412 29799 backend.cpp:76] Failed to create 'bind' backend: BindBackend requires
root privileges
I1209 14:41:10.651202 29820 slave.cpp:208] Mesos agent started on (664)@172.17.0.3:60259
I1209 14:41:10.651240 29820 slave.cpp:209] Flags at startup: --acls="" --appc_simple_discovery_uri_prefix="http://"
--appc_store_dir="/tmp/mesos/store/appc" --authenticate_http_readonly="true" --authenticate_http_readwrite="true"
--authenticatee="crammd5" --authentication_backoff_factor="1secs" --authorizer="local" --cgroups_cpu_enable_pids_and_tids_count="false"
--cgroups_enable_cfs="false" --cgroups_hierarchy="/sys/fs/cgroup" --cgroups_limit_swap="false"
--cgroups_root="mesos" --container_disk_watch_interval="15secs" --containerizers="mesos" --credential="/tmp/Endpoint_SlaveEndpointTest_UnauthorizedRequest_0_cDtuZH/credential"
--default_role="*" --disk_watch_interval="1mins" --docker="docker" --docker_kill_orphans="true"
--docker_registry="https://registry-1.docker.io" --docker_remove_delay="6hrs" --docker_socket="/var/run/docker.sock"
--docker_stop_timeout="0ns" --docker_store_dir="/tmp/mesos/store/docker" --docker_volume_checkpoint_dir="/var/run/mesos/isolators/docker/volume"
--enforce_container_disk_quota="false" --executor_registration_timeout="1mins" --executor_shutdown_grace_period="5secs"
--fetcher_cache_dir="/tmp/Endpoint_SlaveEndpointTest_UnauthorizedRequest_0_cDtuZH/fetch" --fetcher_cache_size="2GB"
--frameworks_home="" --gc_delay="1weeks" --gc_disk_headroom="0.1" --hadoop_home="" --help="false"
--hostname_lookup="true" --http_authenticators="basic" --http_command_executor="false" --http_credentials="/tmp/Endpoint_SlaveEndpointTest_UnauthorizedRequest_0_cDtuZH/http_credentials"
--image_provisioner_backend="copy" --initialize_driver_logging="true" --io_switchboard_enable_server="true"
--isolation="posix/cpu,posix/mem" --launcher="posix" --launcher_dir="/mesos/mesos-1.2.0/_build/src"
--logbufsecs="0" --logging_level="INFO" --max_completed_executors_per_framework="150" --oversubscribed_resources_interval="15secs"
--perf_duration="10secs" --perf_interval="1mins" --qos_correction_interval_min="0ns" --quiet="false"
--recover="reconnect" --recovery_timeout="15mins" --registration_backoff_factor="10ms" --resources="cpus:2;gpus:0;mem:1024;disk:1024;ports:[31000-32000]"
--revocable_cpu_low_priority="true" --runtime_dir="/tmp/Endpoint_SlaveEndpointTest_UnauthorizedRequest_0_cDtuZH"
--sandbox_directory="/mnt/mesos/sandbox" --strict="true" --switch_user="true" --systemd_enable_support="true"
--systemd_runtime_directory="/run/systemd/system" --version="false" --work_dir="/tmp/Endpoint_SlaveEndpointTest_UnauthorizedRequest_0_BMFLsd"
I1209 14:41:10.651924 29820 credentials.hpp:86] Loading credential for authentication from
'/tmp/Endpoint_SlaveEndpointTest_UnauthorizedRequest_0_cDtuZH/credential'
I1209 14:41:10.652125 29820 slave.cpp:346] Agent using credential for: test-principal
I1209 14:41:10.652160 29820 credentials.hpp:37] Loading credentials for authentication from
'/tmp/Endpoint_SlaveEndpointTest_UnauthorizedRequest_0_cDtuZH/http_credentials'
I1209 14:41:10.652539 29820 http.cpp:922] Using default 'basic' HTTP authenticator for realm
'mesos-agent-readonly'
I1209 14:41:10.652703 29820 http.cpp:922] Using default 'basic' HTTP authenticator for realm
'mesos-agent-readwrite'
I1209 14:41:10.653862 29820 slave.cpp:533] Agent resources: cpus(*):2; mem(*):1024; disk(*):1024;
ports(*):[31000-32000]
I1209 14:41:10.653964 29820 slave.cpp:541] Agent attributes: [  ]
I1209 14:41:10.653980 29820 slave.cpp:546] Agent hostname: 5b06fb1bbcfc
I1209 14:41:10.655500 29826 state.cpp:57] Recovering state from '/tmp/Endpoint_SlaveEndpointTest_UnauthorizedRequest_0_BMFLsd/meta'
I1209 14:41:10.655764 29818 status_update_manager.cpp:203] Recovering status update manager
I1209 14:41:10.655963 29820 containerizer.cpp:591] Recovering containerizer
I1209 14:41:10.657490 29826 provisioner.cpp:253] Provisioner recovery complete
I1209 14:41:10.657940 29827 slave.cpp:5414] Finished recovery
I1209 14:41:10.658387 29827 slave.cpp:5588] Querying resource estimator for oversubscribable
resources
I1209 14:41:10.658594 29832 slave.cpp:5602] Received oversubscribable resources {} from the
resource estimator
I1209 14:41:10.660141 29828 process.cpp:3679] Handling HTTP event for process 'slave(664)'
with path: '/slave(664)/monitor/statistics'
I1209 14:41:10.661383 29827 http.cpp:874] Authorizing principal 'test-principal' to GET the
'/monitor/statistics' endpoint
I1209 14:41:10.663447 29824 slave.cpp:790] Agent terminating
[       OK ] Endpoint/SlaveEndpointTest.UnauthorizedRequest/0 (26 ms)
[ RUN      ] Endpoint/SlaveEndpointTest.UnauthorizedRequest/1
I1209 14:41:10.673645 29799 containerizer.cpp:217] Using isolation: posix/cpu,posix/mem,filesystem/posix,network/cni
W1209 14:41:10.674149 29799 backend.cpp:76] Failed to create 'aufs' backend: AufsBackend requires
root privileges, but is running as user mesos
W1209 14:41:10.674291 29799 backend.cpp:76] Failed to create 'bind' backend: BindBackend requires
root privileges
I1209 14:41:10.677309 29820 slave.cpp:208] Mesos agent started on (665)@172.17.0.3:60259
I1209 14:41:10.677348 29820 slave.cpp:209] Flags at startup: --acls="" --appc_simple_discovery_uri_prefix="http://"
--appc_store_dir="/tmp/mesos/store/appc" --authenticate_http_readonly="true" --authenticate_http_readwrite="true"
--authenticatee="crammd5" --authentication_backoff_factor="1secs" --authorizer="local" --cgroups_cpu_enable_pids_and_tids_count="false"
--cgroups_enable_cfs="false" --cgroups_hierarchy="/sys/fs/cgroup" --cgroups_limit_swap="false"
--cgroups_root="mesos" --container_disk_watch_interval="15secs" --containerizers="mesos" --credential="/tmp/Endpoint_SlaveEndpointTest_UnauthorizedRequest_1_uqgOkG/credential"
--default_role="*" --disk_watch_interval="1mins" --docker="docker" --docker_kill_orphans="true"
--docker_registry="https://registry-1.docker.io" --docker_remove_delay="6hrs" --docker_socket="/var/run/docker.sock"
--docker_stop_timeout="0ns" --docker_store_dir="/tmp/mesos/store/docker" --docker_volume_checkpoint_dir="/var/run/mesos/isolators/docker/volume"
--enforce_container_disk_quota="false" --executor_registration_timeout="1mins" --executor_shutdown_grace_period="5secs"
--fetcher_cache_dir="/tmp/Endpoint_SlaveEndpointTest_UnauthorizedRequest_1_uqgOkG/fetch" --fetcher_cache_size="2GB"
--frameworks_home="" --gc_delay="1weeks" --gc_disk_headroom="0.1" --hadoop_home="" --help="false"
--hostname_lookup="true" --http_authenticators="basic" --http_command_executor="false" --http_credentials="/tmp/Endpoint_SlaveEndpointTest_UnauthorizedRequest_1_uqgOkG/http_credentials"
--image_provisioner_backend="copy" --initialize_driver_logging="true" --io_switchboard_enable_server="true"
--isolation="posix/cpu,posix/mem" --launcher="posix" --launcher_dir="/mesos/mesos-1.2.0/_build/src"
--logbufsecs="0" --logging_level="INFO" --max_completed_executors_per_framework="150" --oversubscribed_resources_interval="15secs"
--perf_duration="10secs" --perf_interval="1mins" --qos_correction_interval_min="0ns" --quiet="false"
--recover="reconnect" --recovery_timeout="15mins" --registration_backoff_factor="10ms" --resources="cpus:2;gpus:0;mem:1024;disk:1024;ports:[31000-32000]"
--revocable_cpu_low_priority="true" --runtime_dir="/tmp/Endpoint_SlaveEndpointTest_UnauthorizedRequest_1_uqgOkG"
--sandbox_directory="/mnt/mesos/sandbox" --strict="true" --switch_user="true" --systemd_enable_support="true"
--systemd_runtime_directory="/run/systemd/system" --version="false" --work_dir="/tmp/Endpoint_SlaveEndpointTest_UnauthorizedRequest_1_lCQQJb"
I1209 14:41:10.678098 29820 credentials.hpp:86] Loading credential for authentication from
'/tmp/Endpoint_SlaveEndpointTest_UnauthorizedRequest_1_uqgOkG/credential'
I1209 14:41:10.678293 29820 slave.cpp:346] Agent using credential for: test-principal
I1209 14:41:10.678328 29820 credentials.hpp:37] Loading credentials for authentication from
'/tmp/Endpoint_SlaveEndpointTest_UnauthorizedRequest_1_uqgOkG/http_credentials'
I1209 14:41:10.678696 29820 http.cpp:922] Using default 'basic' HTTP authenticator for realm
'mesos-agent-readonly'
I1209 14:41:10.678897 29820 http.cpp:922] Using default 'basic' HTTP authenticator for realm
'mesos-agent-readwrite'
I1209 14:41:10.680135 29820 slave.cpp:533] Agent resources: cpus(*):2; mem(*):1024; disk(*):1024;
ports(*):[31000-32000]
I1209 14:41:10.680234 29820 slave.cpp:541] Agent attributes: [  ]
I1209 14:41:10.680251 29820 slave.cpp:546] Agent hostname: 5b06fb1bbcfc
I1209 14:41:10.681592 29824 state.cpp:57] Recovering state from '/tmp/Endpoint_SlaveEndpointTest_UnauthorizedRequest_1_lCQQJb/meta'
I1209 14:41:10.681854 29828 status_update_manager.cpp:203] Recovering status update manager
I1209 14:41:10.682042 29832 containerizer.cpp:591] Recovering containerizer
I1209 14:41:10.683327 29824 provisioner.cpp:253] Provisioner recovery complete
I1209 14:41:10.683830 29817 slave.cpp:5414] Finished recovery
I1209 14:41:10.684329 29817 slave.cpp:5588] Querying resource estimator for oversubscribable
resources
I1209 14:41:10.684633 29821 slave.cpp:5602] Received oversubscribable resources {} from the
resource estimator
I1209 14:41:10.686364 29824 process.cpp:3679] Handling HTTP event for process 'slave(665)'
with path: '/slave(665)/monitor/statistics.json'
I1209 14:41:10.687649 29825 http.cpp:874] Authorizing principal 'test-principal' to GET the
'/monitor/statistics.json' endpoint
I1209 14:41:10.689436 29827 slave.cpp:790] Agent terminating
[       OK ] Endpoint/SlaveEndpointTest.UnauthorizedRequest/1 (25 ms)
[ RUN      ] Endpoint/SlaveEndpointTest.UnauthorizedRequest/2
I1209 14:41:10.700094 29799 containerizer.cpp:217] Using isolation: posix/cpu,posix/mem,filesystem/posix,network/cni
W1209 14:41:10.700772 29799 backend.cpp:76] Failed to create 'aufs' backend: AufsBackend requires
root privileges, but is running as user mesos
W1209 14:41:10.700968 29799 backend.cpp:76] Failed to create 'bind' backend: BindBackend requires
root privileges
I1209 14:41:10.704779 29818 slave.cpp:208] Mesos agent started on (666)@172.17.0.3:60259
I1209 14:41:10.704823 29818 slave.cpp:209] Flags at startup: --acls="" --appc_simple_discovery_uri_prefix="http://"
--appc_store_dir="/tmp/mesos/store/appc" --authenticate_http_readonly="true" --authenticate_http_readwrite="true"
--authenticatee="crammd5" --authentication_backoff_factor="1secs" --authorizer="local" --cgroups_cpu_enable_pids_and_tids_count="false"
--cgroups_enable_cfs="false" --cgroups_hierarchy="/sys/fs/cgroup" --cgroups_limit_swap="false"
--cgroups_root="mesos" --container_disk_watch_interval="15secs" --containerizers="mesos" --credential="/tmp/Endpoint_SlaveEndpointTest_UnauthorizedRequest_2_gVGSWE/credential"
--default_role="*" --disk_watch_interval="1mins" --docker="docker" --docker_kill_orphans="true"
--docker_registry="https://registry-1.docker.io" --docker_remove_delay="6hrs" --docker_socket="/var/run/docker.sock"
--docker_stop_timeout="0ns" --docker_store_dir="/tmp/mesos/store/docker" --docker_volume_checkpoint_dir="/var/run/mesos/isolators/docker/volume"
--enforce_container_disk_quota="false" --executor_registration_timeout="1mins" --executor_shutdown_grace_period="5secs"
--fetcher_cache_dir="/tmp/Endpoint_SlaveEndpointTest_UnauthorizedRequest_2_gVGSWE/fetch" --fetcher_cache_size="2GB"
--frameworks_home="" --gc_delay="1weeks" --gc_disk_headroom="0.1" --hadoop_home="" --help="false"
--hostname_lookup="true" --http_authenticators="basic" --http_command_executor="false" --http_credentials="/tmp/Endpoint_SlaveEndpointTest_UnauthorizedRequest_2_gVGSWE/http_credentials"
--image_provisioner_backend="copy" --initialize_driver_logging="true" --io_switchboard_enable_server="true"
--isolation="posix/cpu,posix/mem" --launcher="posix" --launcher_dir="/mesos/mesos-1.2.0/_build/src"
--logbufsecs="0" --logging_level="INFO" --max_completed_executors_per_framework="150" --oversubscribed_resources_interval="15secs"
--perf_duration="10secs" --perf_interval="1mins" --qos_correction_interval_min="0ns" --quiet="false"
--recover="reconnect" --recovery_timeout="15mins" --registration_backoff_factor="10ms" --resources="cpus:2;gpus:0;mem:1024;disk:1024;ports:[31000-32000]"
--revocable_cpu_low_priority="true" --runtime_dir="/tmp/Endpoint_SlaveEndpointTest_UnauthorizedRequest_2_gVGSWE"
--sandbox_directory="/mnt/mesos/sandbox" --strict="true" --switch_user="true" --systemd_enable_support="true"
--systemd_runtime_directory="/run/systemd/system" --version="false" --work_dir="/tmp/Endpoint_SlaveEndpointTest_UnauthorizedRequest_2_DGOJha"
I1209 14:41:10.705473 29818 credentials.hpp:86] Loading credential for authentication from
'/tmp/Endpoint_SlaveEndpointTest_UnauthorizedRequest_2_gVGSWE/credential'
I1209 14:41:10.705664 29818 slave.cpp:346] Agent using credential for: test-principal
I1209 14:41:10.705691 29818 credentials.hpp:37] Loading credentials for authentication from
'/tmp/Endpoint_SlaveEndpointTest_UnauthorizedRequest_2_gVGSWE/http_credentials'
I1209 14:41:10.705945 29818 http.cpp:922] Using default 'basic' HTTP authenticator for realm
'mesos-agent-readonly'
I1209 14:41:10.706102 29818 http.cpp:922] Using default 'basic' HTTP authenticator for realm
'mesos-agent-readwrite'
I1209 14:41:10.707448 29818 slave.cpp:533] Agent resources: cpus(*):2; mem(*):1024; disk(*):1024;
ports(*):[31000-32000]
I1209 14:41:10.707550 29818 slave.cpp:541] Agent attributes: [  ]
I1209 14:41:10.707563 29818 slave.cpp:546] Agent hostname: 5b06fb1bbcfc
I1209 14:41:10.709725 29827 state.cpp:57] Recovering state from '/tmp/Endpoint_SlaveEndpointTest_UnauthorizedRequest_2_DGOJha/meta'
I1209 14:41:10.710209 29828 status_update_manager.cpp:203] Recovering status update manager
I1209 14:41:10.710427 29819 containerizer.cpp:591] Recovering containerizer
I1209 14:41:10.712142 29817 provisioner.cpp:253] Provisioner recovery complete
I1209 14:41:10.712774 29822 slave.cpp:5414] Finished recovery
I1209 14:41:10.713337 29822 slave.cpp:5588] Querying resource estimator for oversubscribable
resources
I1209 14:41:10.713613 29827 slave.cpp:5602] Received oversubscribable resources {} from the
resource estimator
I1209 14:41:10.715836 29820 process.cpp:3679] Handling HTTP event for process 'slave(666)'
with path: '/slave(666)/containers'
I1209 14:41:10.717317 29829 http.cpp:874] Authorizing principal 'test-principal' to GET the
'/containers' endpoint
I1209 14:41:10.719532 29821 slave.cpp:790] Agent terminating
[       OK ] Endpoint/SlaveEndpointTest.UnauthorizedRequest/2 (31 ms)
[ RUN      ] Endpoint/SlaveEndpointTest.NoAuthorizer/0
I1209 14:41:10.731024 29799 containerizer.cpp:217] Using isolation: posix/cpu,posix/mem,filesystem/posix,network/cni
W1209 14:41:10.731597 29799 backend.cpp:76] Failed to create 'aufs' backend: AufsBackend requires
root privileges, but is running as user mesos
W1209 14:41:10.731760 29799 backend.cpp:76] Failed to create 'bind' backend: BindBackend requires
root privileges
I1209 14:41:10.733548 29799 cluster.cpp:446] Creating default 'local' authorizer
I1209 14:41:10.735371 29820 slave.cpp:208] Mesos agent started on (667)@172.17.0.3:60259
I1209 14:41:10.735539 29820 slave.cpp:209] Flags at startup: --acls="" --appc_simple_discovery_uri_prefix="http://"
--appc_store_dir="/tmp/mesos/store/appc" --authenticate_http_readonly="true" --authenticate_http_readwrite="true"
--authenticatee="crammd5" --authentication_backoff_factor="1secs" --authorizer="local" --cgroups_cpu_enable_pids_and_tids_count="false"
--cgroups_enable_cfs="false" --cgroups_hierarchy="/sys/fs/cgroup" --cgroups_limit_swap="false"
--cgroups_root="mesos" --container_disk_watch_interval="15secs" --containerizers="mesos" --credential="/tmp/Endpoint_SlaveEndpointTest_NoAuthorizer_0_yuODSD/credential"
--default_role="*" --disk_watch_interval="1mins" --docker="docker" --docker_kill_orphans="true"
--docker_registry="https://registry-1.docker.io" --docker_remove_delay="6hrs" --docker_socket="/var/run/docker.sock"
--docker_stop_timeout="0ns" --docker_store_dir="/tmp/mesos/store/docker" --docker_volume_checkpoint_dir="/var/run/mesos/isolators/docker/volume"
--enforce_container_disk_quota="false" --executor_registration_timeout="1mins" --executor_shutdown_grace_period="5secs"
--fetcher_cache_dir="/tmp/Endpoint_SlaveEndpointTest_NoAuthorizer_0_yuODSD/fetch" --fetcher_cache_size="2GB"
--frameworks_home="" --gc_delay="1weeks" --gc_disk_headroom="0.1" --hadoop_home="" --help="false"
--hostname_lookup="true" --http_authenticators="basic" --http_command_executor="false" --http_credentials="/tmp/Endpoint_SlaveEndpointTest_NoAuthorizer_0_yuODSD/http_credentials"
--image_provisioner_backend="copy" --initialize_driver_logging="true" --io_switchboard_enable_server="true"
--isolation="posix/cpu,posix/mem" --launcher="posix" --launcher_dir="/mesos/mesos-1.2.0/_build/src"
--logbufsecs="0" --logging_level="INFO" --max_completed_executors_per_framework="150" --oversubscribed_resources_interval="15secs"
--perf_duration="10secs" --perf_interval="1mins" --qos_correction_interval_min="0ns" --quiet="false"
--recover="reconnect" --recovery_timeout="15mins" --registration_backoff_factor="10ms" --resources="cpus:2;gpus:0;mem:1024;disk:1024;ports:[31000-32000]"
--revocable_cpu_low_priority="true" --runtime_dir="/tmp/Endpoint_SlaveEndpointTest_NoAuthorizer_0_yuODSD"
--sandbox_directory="/mnt/mesos/sandbox" --strict="true" --switch_user="true" --systemd_enable_support="true"
--systemd_runtime_directory="/run/systemd/system" --version="false" --work_dir="/tmp/Endpoint_SlaveEndpointTest_NoAuthorizer_0_7Ivv88"
I1209 14:41:10.736439 29820 credentials.hpp:86] Loading credential for authentication from
'/tmp/Endpoint_SlaveEndpointTest_NoAuthorizer_0_yuODSD/credential'
I1209 14:41:10.736742 29820 slave.cpp:346] Agent using credential for: test-principal
I1209 14:41:10.736773 29820 credentials.hpp:37] Loading credentials for authentication from
'/tmp/Endpoint_SlaveEndpointTest_NoAuthorizer_0_yuODSD/http_credentials'
I1209 14:41:10.737090 29820 http.cpp:922] Using default 'basic' HTTP authenticator for realm
'mesos-agent-readonly'
I1209 14:41:10.737243 29820 http.cpp:922] Using default 'basic' HTTP authenticator for realm
'mesos-agent-readwrite'
I1209 14:41:10.738533 29820 slave.cpp:533] Agent resources: cpus(*):2; mem(*):1024; disk(*):1024;
ports(*):[31000-32000]
I1209 14:41:10.738621 29820 slave.cpp:541] Agent attributes: [  ]
I1209 14:41:10.738639 29820 slave.cpp:546] Agent hostname: 5b06fb1bbcfc
I1209 14:41:10.740041 29827 state.cpp:57] Recovering state from '/tmp/Endpoint_SlaveEndpointTest_NoAuthorizer_0_7Ivv88/meta'
I1209 14:41:10.740301 29824 status_update_manager.cpp:203] Recovering status update manager
I1209 14:41:10.740523 29830 containerizer.cpp:591] Recovering containerizer
I1209 14:41:10.742055 29817 provisioner.cpp:253] Provisioner recovery complete
I1209 14:41:10.742471 29828 slave.cpp:5414] Finished recovery
I1209 14:41:10.743037 29828 slave.cpp:5588] Querying resource estimator for oversubscribable
resources
I1209 14:41:10.743330 29822 slave.cpp:5602] Received oversubscribable resources {} from the
resource estimator
I1209 14:41:10.745172 29829 process.cpp:3679] Handling HTTP event for process 'slave(667)'
with path: '/slave(667)/monitor/statistics'
I1209 14:41:10.746500 29830 http.cpp:874] Authorizing principal 'test-principal' to GET the
'/monitor/statistics' endpoint
I1209 14:41:10.749414 29821 slave.cpp:790] Agent terminating
[       OK ] Endpoint/SlaveEndpointTest.NoAuthorizer/0 (28 ms)
[ RUN      ] Endpoint/SlaveEndpointTest.NoAuthorizer/1
I1209 14:41:10.759671 29799 containerizer.cpp:217] Using isolation: posix/cpu,posix/mem,filesystem/posix,network/cni
W1209 14:41:10.760296 29799 backend.cpp:76] Failed to create 'aufs' backend: AufsBackend requires
root privileges, but is running as user mesos
W1209 14:41:10.760471 29799 backend.cpp:76] Failed to create 'bind' backend: BindBackend requires
root privileges
I1209 14:41:10.762281 29799 cluster.cpp:446] Creating default 'local' authorizer
I1209 14:41:10.763959 29827 slave.cpp:208] Mesos agent started on (668)@172.17.0.3:60259
I1209 14:41:10.764004 29827 slave.cpp:209] Flags at startup: --acls="" --appc_simple_discovery_uri_prefix="http://"
--appc_store_dir="/tmp/mesos/store/appc" --authenticate_http_readonly="true" --authenticate_http_readwrite="true"
--authenticatee="crammd5" --authentication_backoff_factor="1secs" --authorizer="local" --cgroups_cpu_enable_pids_and_tids_count="false"
--cgroups_enable_cfs="false" --cgroups_hierarchy="/sys/fs/cgroup" --cgroups_limit_swap="false"
--cgroups_root="mesos" --container_disk_watch_interval="15secs" --containerizers="mesos" --credential="/tmp/Endpoint_SlaveEndpointTest_NoAuthorizer_1_2Cdd7C/credential"
--default_role="*" --disk_watch_interval="1mins" --docker="docker" --docker_kill_orphans="true"
--docker_registry="https://registry-1.docker.io" --docker_remove_delay="6hrs" --docker_socket="/var/run/docker.sock"
--docker_stop_timeout="0ns" --docker_store_dir="/tmp/mesos/store/docker" --docker_volume_checkpoint_dir="/var/run/mesos/isolators/docker/volume"
--enforce_container_disk_quota="false" --executor_registration_timeout="1mins" --executor_shutdown_grace_period="5secs"
--fetcher_cache_dir="/tmp/Endpoint_SlaveEndpointTest_NoAuthorizer_1_2Cdd7C/fetch" --fetcher_cache_size="2GB"
--frameworks_home="" --gc_delay="1weeks" --gc_disk_headroom="0.1" --hadoop_home="" --help="false"
--hostname_lookup="true" --http_authenticators="basic" --http_command_executor="false" --http_credentials="/tmp/Endpoint_SlaveEndpointTest_NoAuthorizer_1_2Cdd7C/http_credentials"
--image_provisioner_backend="copy" --initialize_driver_logging="true" --io_switchboard_enable_server="true"
--isolation="posix/cpu,posix/mem" --launcher="posix" --launcher_dir="/mesos/mesos-1.2.0/_build/src"
--logbufsecs="0" --logging_level="INFO" --max_completed_executors_per_framework="150" --oversubscribed_resources_interval="15secs"
--perf_duration="10secs" --perf_interval="1mins" --qos_correction_interval_min="0ns" --quiet="false"
--recover="reconnect" --recovery_timeout="15mins" --registration_backoff_factor="10ms" --resources="cpus:2;gpus:0;mem:1024;disk:1024;ports:[31000-32000]"
--revocable_cpu_low_priority="true" --runtime_dir="/tmp/Endpoint_SlaveEndpointTest_NoAuthorizer_1_2Cdd7C"
--sandbox_directory="/mnt/mesos/sandbox" --strict="true" --switch_user="true" --systemd_enable_support="true"
--systemd_runtime_directory="/run/systemd/system" --version="false" --work_dir="/tmp/Endpoint_SlaveEndpointTest_NoAuthorizer_1_3M2pi8"
I1209 14:41:10.764652 29827 credentials.hpp:86] Loading credential for authentication from
'/tmp/Endpoint_SlaveEndpointTest_NoAuthorizer_1_2Cdd7C/credential'
I1209 14:41:10.764808 29827 slave.cpp:346] Agent using credential for: test-principal
I1209 14:41:10.764832 29827 credentials.hpp:37] Loading credentials for authentication from
'/tmp/Endpoint_SlaveEndpointTest_NoAuthorizer_1_2Cdd7C/http_credentials'
I1209 14:41:10.765076 29827 http.cpp:922] Using default 'basic' HTTP authenticator for realm
'mesos-agent-readonly'
I1209 14:41:10.765209 29827 http.cpp:922] Using default 'basic' HTTP authenticator for realm
'mesos-agent-readwrite'
I1209 14:41:10.766255 29827 slave.cpp:533] Agent resources: cpus(*):2; mem(*):1024; disk(*):1024;
ports(*):[31000-32000]
I1209 14:41:10.766343 29827 slave.cpp:541] Agent attributes: [  ]
I1209 14:41:10.766365 29827 slave.cpp:546] Agent hostname: 5b06fb1bbcfc
I1209 14:41:10.767710 29828 state.cpp:57] Recovering state from '/tmp/Endpoint_SlaveEndpointTest_NoAuthorizer_1_3M2pi8/meta'
I1209 14:41:10.767961 29831 status_update_manager.cpp:203] Recovering status update manager
I1209 14:41:10.768208 29826 containerizer.cpp:591] Recovering containerizer
I1209 14:41:10.769511 29818 provisioner.cpp:253] Provisioner recovery complete
I1209 14:41:10.769886 29821 slave.cpp:5414] Finished recovery
I1209 14:41:10.770383 29821 slave.cpp:5588] Querying resource estimator for oversubscribable
resources
I1209 14:41:10.770712 29818 slave.cpp:5602] Received oversubscribable resources {} from the
resource estimator
I1209 14:41:10.772409 29820 process.cpp:3679] Handling HTTP event for process 'slave(668)'
with path: '/slave(668)/monitor/statistics.json'
I1209 14:41:10.773589 29824 http.cpp:874] Authorizing principal 'test-principal' to GET the
'/monitor/statistics.json' endpoint
I1209 14:41:10.776460 29822 slave.cpp:790] Agent terminating
[       OK ] Endpoint/SlaveEndpointTest.NoAuthorizer/1 (27 ms)
[ RUN      ] Endpoint/SlaveEndpointTest.NoAuthorizer/2
I1209 14:41:10.787477 29799 containerizer.cpp:217] Using isolation: posix/cpu,posix/mem,filesystem/posix,network/cni
W1209 14:41:10.788066 29799 backend.cpp:76] Failed to create 'aufs' backend: AufsBackend requires
root privileges, but is running as user mesos
W1209 14:41:10.788246 29799 backend.cpp:76] Failed to create 'bind' backend: BindBackend requires
root privileges
I1209 14:41:10.790205 29799 cluster.cpp:446] Creating default 'local' authorizer
I1209 14:41:10.791767 29832 slave.cpp:208] Mesos agent started on (669)@172.17.0.3:60259
I1209 14:41:10.791803 29832 slave.cpp:209] Flags at startup: --acls="" --appc_simple_discovery_uri_prefix="http://"
--appc_store_dir="/tmp/mesos/store/appc" --authenticate_http_readonly="true" --authenticate_http_readwrite="true"
--authenticatee="crammd5" --authentication_backoff_factor="1secs" --authorizer="local" --cgroups_cpu_enable_pids_and_tids_count="false"
--cgroups_enable_cfs="false" --cgroups_hierarchy="/sys/fs/cgroup" --cgroups_limit_swap="false"
--cgroups_root="mesos" --container_disk_watch_interval="15secs" --containerizers="mesos" --credential="/tmp/Endpoint_SlaveEndpointTest_NoAuthorizer_2_2QKKDC/credential"
--default_role="*" --disk_watch_interval="1mins" --docker="docker" --docker_kill_orphans="true"
--docker_registry="https://registry-1.docker.io" --docker_remove_delay="6hrs" --docker_socket="/var/run/docker.sock"
--docker_stop_timeout="0ns" --docker_store_dir="/tmp/mesos/store/docker" --docker_volume_checkpoint_dir="/var/run/mesos/isolators/docker/volume"
--enforce_container_disk_quota="false" --executor_registration_timeout="1mins" --executor_shutdown_grace_period="5secs"
--fetcher_cache_dir="/tmp/Endpoint_SlaveEndpointTest_NoAuthorizer_2_2QKKDC/fetch" --fetcher_cache_size="2GB"
--frameworks_home="" --gc_delay="1weeks" --gc_disk_headroom="0.1" --hadoop_home="" --help="false"
--hostname_lookup="true" --http_authenticators="basic" --http_command_executor="false" --http_credentials="/tmp/Endpoint_SlaveEndpointTest_NoAuthorizer_2_2QKKDC/http_credentials"
--image_provisioner_backend="copy" --initialize_driver_logging="true" --io_switchboard_enable_server="true"
--isolation="posix/cpu,posix/mem" --launcher="posix" --launcher_dir="/mesos/mesos-1.2.0/_build/src"
--logbufsecs="0" --logging_level="INFO" --max_completed_executors_per_framework="150" --oversubscribed_resources_interval="15secs"
--perf_duration="10secs" --perf_interval="1mins" --qos_correction_interval_min="0ns" --quiet="false"
--recover="reconnect" --recovery_timeout="15mins" --registration_backoff_factor="10ms" --resources="cpus:2;gpus:0;mem:1024;disk:1024;ports:[31000-32000]"
--revocable_cpu_low_priority="true" --runtime_dir="/tmp/Endpoint_SlaveEndpointTest_NoAuthorizer_2_2QKKDC"
--sandbox_directory="/mnt/mesos/sandbox" --strict="true" --switch_user="true" --systemd_enable_support="true"
--systemd_runtime_directory="/run/systemd/system" --version="false" --work_dir="/tmp/Endpoint_SlaveEndpointTest_NoAuthorizer_2_fyLrK7"
I1209 14:41:10.792440 29832 credentials.hpp:86] Loading credential for authentication from
'/tmp/Endpoint_SlaveEndpointTest_NoAuthorizer_2_2QKKDC/credential'
I1209 14:41:10.792608 29832 slave.cpp:346] Agent using credential for: test-principal
I1209 14:41:10.792634 29832 credentials.hpp:37] Loading credentials for authentication from
'/tmp/Endpoint_SlaveEndpointTest_NoAuthorizer_2_2QKKDC/http_credentials'
I1209 14:41:10.792881 29832 http.cpp:922] Using default 'basic' HTTP authenticator for realm
'mesos-agent-readonly'
I1209 14:41:10.792990 29832 http.cpp:922] Using default 'basic' HTTP authenticator for realm
'mesos-agent-readwrite'
I1209 14:41:10.793891 29832 slave.cpp:533] Agent resources: cpus(*):2; mem(*):1024; disk(*):1024;
ports(*):[31000-32000]
I1209 14:41:10.793962 29832 slave.cpp:541] Agent attributes: [  ]
I1209 14:41:10.793974 29832 slave.cpp:546] Agent hostname: 5b06fb1bbcfc
I1209 14:41:10.795514 29829 state.cpp:57] Recovering state from '/tmp/Endpoint_SlaveEndpointTest_NoAuthorizer_2_fyLrK7/meta'
I1209 14:41:10.795796 29829 status_update_manager.cpp:203] Recovering status update manager
I1209 14:41:10.796015 29829 containerizer.cpp:591] Recovering containerizer
I1209 14:41:10.797361 29824 provisioner.cpp:253] Provisioner recovery complete
I1209 14:41:10.797802 29821 slave.cpp:5414] Finished recovery
I1209 14:41:10.798420 29821 slave.cpp:5588] Querying resource estimator for oversubscribable
resources
I1209 14:41:10.798686 29825 slave.cpp:5602] Received oversubscribable resources {} from the
resource estimator
I1209 14:41:10.800411 29824 process.cpp:3679] Handling HTTP event for process 'slave(669)'
with path: '/slave(669)/containers'
I1209 14:41:10.801537 29821 http.cpp:874] Authorizing principal 'test-principal' to GET the
'/containers' endpoint
I1209 14:41:10.804939 29822 slave.cpp:790] Agent terminating
[       OK ] Endpoint/SlaveEndpointTest.NoAuthorizer/2 (28 ms)
[----------] 9 tests from Endpoint/SlaveEndpointTest (255 ms total)

[----------] Global test environment tear-down
[==========] 1423 tests from 164 test cases ran. (464511 ms total)
[  PASSED  ] 1421 tests.
[  FAILED  ] 2 tests, listed below:
[  FAILED  ] RegistrarTest.RemoveQuota
[  FAILED  ] DiskResource/PersistentVolumeTest.SharedPersistentVolumeMasterFailover/0, where
GetParam() = 0

 2 FAILED TESTS
  YOU HAVE 9 DISABLED TESTS

make[4]: *** [check-local] Error 1
make[4]: Leaving directory `/mesos/mesos-1.2.0/_build/src'
make[3]: *** [check-am] Error 2
make[3]: Leaving directory `/mesos/mesos-1.2.0/_build/src'
make[2]: *** [check] Error 2
make[2]: Leaving directory `/mesos/mesos-1.2.0/_build/src'
make[1]: *** [check-recursive] Error 1
make[1]: Leaving directory `/mesos/mesos-1.2.0/_build'
make: *** [distcheck] Error 1
+ docker rmi mesos-1481291914-27770
Untagged: mesos-1481291914-27770:latest
Deleted: sha256:e6fc5d3156322a0b3de12f6a34013defeb29a431018c6cd2a5518fc75856717c
Deleted: sha256:1beebe0cd2aa11088bdefbcd0561087eb85831210ec242d1fafce16ef4cd2d42
Deleted: sha256:20ab1d2f17edd41abf41c5f0ba2be209db6f6d53f6c63531b2bb4a2a047419e7
Deleted: sha256:f8a91f6da782528f31a555e680546ce509f21f1b5d12ecadff3834339858c4ff
Deleted: sha256:412855ea548ef3df1d0da90d52507c60e22e7181465378476054a1f136c79708
Deleted: sha256:36bff0c0cadae57796c40906fe6ce9e688784e2a0114dfecd0636c41600237d2
Deleted: sha256:73e8395d12c31a1c75368d96bd2569b90e87a8778f058f675376bb1152e91b04
Deleted: sha256:65bcb6830be3a961f9f883ed9a80ed663a3cb2066425ebd53d93be8929253ac8
Deleted: sha256:4cf7ee14adee16f1c5adc513c26ed75ede108ab0437b727e39ae4d68e5ed079a
Deleted: sha256:01617ad9845e90182778e0f7579bc27764c9603eea4720507c59c4119626287a
Deleted: sha256:c93f68fc38f4a8fe9d75491a3a542f7d64be90a5e721685a70ebde2ba93c2985
Deleted: sha256:5e7cd988603fc3ef5c533204283f89da46dcedfab84f5a369a9f9f30e5260d75
Deleted: sha256:933f1dcad70cfd129a124b4115c2a81f581820cda978713eeecb600788d3022f
Deleted: sha256:7a3ca842d9f734c4e17c861e9403c12e74a6373dd8762903a917368c8a60c508
Deleted: sha256:344add4c9c8910d42586a6e5a95cd94cc0ca12985c8f138abd0d5e305f52e53c
Deleted: sha256:ec0123d5432b8fdd2f0285c0f30dfbc1ff0a1c2d93430a2669fd5e7f88be4fe4
Deleted: sha256:7d556695e42ccd7f325775b635e7a34b72074ba21d5ac96c0e76ac4e203c4e0c
Deleted: sha256:b85cb3dff7a48fb97017a39af6b172326a7eeb61e012383b0525052364edfabc
Deleted: sha256:8de3da7b2c77c17409a7121e64bc35e9ada05a110f9c30f97dedda4ad27c3356
Deleted: sha256:d1f0157483faab3c52c93103cb294bf1d6e8e274061692fe5870b9f46430c8ed
Deleted: sha256:d6267049d0cc35d6cb3e991829e337e08595bfc2445d8cbd0b1ebb3134a215f3
Deleted: sha256:392157afe88ddab5df8aa6b502cdd0e1f320d39a674af0eee88792ce368cda28
Deleted: sha256:5b83d96a09411cd4e972e3251253110730a4551cfad83cb4acc32f537425b89f
Deleted: sha256:a0f434cc781b81f54bf58f650393923f979ba8c7d76ad1184df20bce183ac8d0
Build step 'Execute shell' marked build as failure

Mime
View raw message