mesos-builds mailing list archives

Site index · List index
Message view « Date » · « Thread »
Top « Date » · « Thread »
From Apache Jenkins Server <jenk...@builds.apache.org>
Subject Build failed in Jenkins: Mesos » cmake,clang,--verbose --enable-libevent --enable-ssl,GLOG_v=1 MESOS_VERBOSE=1,ubuntu:14.04,(docker||Hadoop)&&(!ubuntu-us1)&&(!ubuntu-6)&&(!ubuntu-eu2) #3022
Date Fri, 09 Dec 2016 02:33:41 GMT
See <https://builds.apache.org/job/Mesos/BUILDTOOL=cmake,COMPILER=clang,CONFIGURATION=--verbose%20--enable-libevent%20--enable-ssl,ENVIRONMENT=GLOG_v=1%20MESOS_VERBOSE=1,OS=ubuntu%3A14.04,label_exp=(docker%7C%7CHadoop)&&(!ubuntu-us1)&&(!ubuntu-6)&&(!ubuntu-eu2)/3022/changes>

Changes:

[bmahler] Added a test for the `getRoles` helper in protobuf utils.

[bmahler] Removed "*" role from default response of `getRoles` API.

[yujie.jay] Added a grace period for I/O switchboard server termination.

------------------------------------------
[...truncated 170069 lines...]
[       OK ] Endpoint/SlaveEndpointTest.AuthorizedRequest/0 (14 ms)
[ RUN      ] Endpoint/SlaveEndpointTest.AuthorizedRequest/1
I1209 02:32:44.177306 25803 containerizer.cpp:217] Using isolation: posix/cpu,posix/mem,filesystem/posix,network/cni
W1209 02:32:44.177614 25803 backend.cpp:76] Failed to create 'aufs' backend: AufsBackend requires
root privileges, but is running as user mesos
W1209 02:32:44.177705 25803 backend.cpp:76] Failed to create 'bind' backend: BindBackend requires
root privileges
I1209 02:32:44.178954 25818 slave.cpp:208] Mesos agent started on (659)@172.17.0.2:58450
I1209 02:32:44.178998 25818 slave.cpp:209] Flags at startup: --acls="" --appc_simple_discovery_uri_prefix="http://"
--appc_store_dir="/tmp/mesos/store/appc" --authenticate_http_readonly="true" --authenticate_http_readwrite="true"
--authenticatee="crammd5" --authentication_backoff_factor="1secs" --authorizer="local" --cgroups_cpu_enable_pids_and_tids_count="false"
--cgroups_enable_cfs="false" --cgroups_hierarchy="/sys/fs/cgroup" --cgroups_limit_swap="false"
--cgroups_root="mesos" --container_disk_watch_interval="15secs" --containerizers="mesos" --credential="/tmp/Endpoint_SlaveEndpointTest_AuthorizedRequest_1_sKXiqG/credential"
--default_role="*" --disk_watch_interval="1mins" --docker="docker" --docker_kill_orphans="true"
--docker_registry="https://registry-1.docker.io" --docker_remove_delay="6hrs" --docker_socket="/var/run/docker.sock"
--docker_stop_timeout="0ns" --docker_store_dir="/tmp/mesos/store/docker" --docker_volume_checkpoint_dir="/var/run/mesos/isolators/docker/volume"
--enforce_container_disk_quota="false" --executor_registration_timeout="1mins" --executor_shutdown_grace_period="5secs"
--fetcher_cache_dir="/tmp/Endpoint_SlaveEndpointTest_AuthorizedRequest_1_sKXiqG/fetch" --fetcher_cache_size="2GB"
--frameworks_home="" --gc_delay="1weeks" --gc_disk_headroom="0.1" --hadoop_home="" --help="false"
--hostname_lookup="true" --http_authenticators="basic" --http_command_executor="false" --http_credentials="/tmp/Endpoint_SlaveEndpointTest_AuthorizedRequest_1_sKXiqG/http_credentials"
--image_provisioner_backend="copy" --initialize_driver_logging="true" --io_switchboard_enable_server="true"
--isolation="posix/cpu,posix/mem" --launcher="posix" --launcher_dir="/mesos/build/src" --logbufsecs="0"
--logging_level="INFO" --max_completed_executors_per_framework="150" --oversubscribed_resources_interval="15secs"
--perf_duration="10secs" --perf_interval="1mins" --qos_correction_interval_min="0ns" --quiet="false"
--recover="reconnect" --recovery_timeout="15mins" --registration_backoff_factor="10ms" --resources="cpus:2;gpus:0;mem:1024;disk:1024;ports:[31000-32000]"
--revocable_cpu_low_priority="true" --runtime_dir="/tmp/Endpoint_SlaveEndpointTest_AuthorizedRequest_1_sKXiqG"
--sandbox_directory="/mnt/mesos/sandbox" --strict="true" --switch_user="true" --systemd_enable_support="true"
--systemd_runtime_directory="/run/systemd/system" --version="false" --work_dir="/tmp/Endpoint_SlaveEndpointTest_AuthorizedRequest_1_1e0p5r"
I1209 02:32:44.179492 25818 credentials.hpp:86] Loading credential for authentication from
'/tmp/Endpoint_SlaveEndpointTest_AuthorizedRequest_1_sKXiqG/credential'
I1209 02:32:44.179608 25818 slave.cpp:346] Agent using credential for: test-principal
I1209 02:32:44.179623 25818 credentials.hpp:37] Loading credentials for authentication from
'/tmp/Endpoint_SlaveEndpointTest_AuthorizedRequest_1_sKXiqG/http_credentials'
I1209 02:32:44.179749 25818 http.cpp:922] Using default 'basic' HTTP authenticator for realm
'mesos-agent-readonly'
I1209 02:32:44.179817 25818 http.cpp:922] Using default 'basic' HTTP authenticator for realm
'mesos-agent-readwrite'
I1209 02:32:44.180238 25818 slave.cpp:533] Agent resources: cpus(*):2; mem(*):1024; disk(*):1024;
ports(*):[31000-32000]
I1209 02:32:44.180269 25818 slave.cpp:541] Agent attributes: [  ]
I1209 02:32:44.180274 25818 slave.cpp:546] Agent hostname: c67feabc8346
I1209 02:32:44.180747 25817 state.cpp:57] Recovering state from '/tmp/Endpoint_SlaveEndpointTest_AuthorizedRequest_1_1e0p5r/meta'
I1209 02:32:44.180893 25808 status_update_manager.cpp:203] Recovering status update manager
I1209 02:32:44.181030 25818 containerizer.cpp:591] Recovering containerizer
I1209 02:32:44.181409 25818 provisioner.cpp:253] Provisioner recovery complete
I1209 02:32:44.181548 25818 slave.cpp:5414] Finished recovery
I1209 02:32:44.181865 25818 slave.cpp:5588] Querying resource estimator for oversubscribable
resources
I1209 02:32:44.182003 25818 slave.cpp:5602] Received oversubscribable resources {} from the
resource estimator
I1209 02:32:44.182790 25807 process.cpp:3679] Handling HTTP event for process 'slave(659)'
with path: '/slave(659)/monitor/statistics.json'
I1209 02:32:44.183264 25817 http.cpp:874] Authorizing principal 'test-principal' to GET the
'/monitor/statistics.json' endpoint
I1209 02:32:44.184453 25819 slave.cpp:790] Agent terminating
[       OK ] Endpoint/SlaveEndpointTest.AuthorizedRequest/1 (11 ms)
[ RUN      ] Endpoint/SlaveEndpointTest.AuthorizedRequest/2
I1209 02:32:44.189054 25803 containerizer.cpp:217] Using isolation: posix/cpu,posix/mem,filesystem/posix,network/cni
W1209 02:32:44.189358 25803 backend.cpp:76] Failed to create 'aufs' backend: AufsBackend requires
root privileges, but is running as user mesos
W1209 02:32:44.189451 25803 backend.cpp:76] Failed to create 'bind' backend: BindBackend requires
root privileges
I1209 02:32:44.190418 25816 slave.cpp:208] Mesos agent started on (660)@172.17.0.2:58450
I1209 02:32:44.190459 25816 slave.cpp:209] Flags at startup: --acls="" --appc_simple_discovery_uri_prefix="http://"
--appc_store_dir="/tmp/mesos/store/appc" --authenticate_http_readonly="true" --authenticate_http_readwrite="true"
--authenticatee="crammd5" --authentication_backoff_factor="1secs" --authorizer="local" --cgroups_cpu_enable_pids_and_tids_count="false"
--cgroups_enable_cfs="false" --cgroups_hierarchy="/sys/fs/cgroup" --cgroups_limit_swap="false"
--cgroups_root="mesos" --container_disk_watch_interval="15secs" --containerizers="mesos" --credential="/tmp/Endpoint_SlaveEndpointTest_AuthorizedRequest_2_wvQkSB/credential"
--default_role="*" --disk_watch_interval="1mins" --docker="docker" --docker_kill_orphans="true"
--docker_registry="https://registry-1.docker.io" --docker_remove_delay="6hrs" --docker_socket="/var/run/docker.sock"
--docker_stop_timeout="0ns" --docker_store_dir="/tmp/mesos/store/docker" --docker_volume_checkpoint_dir="/var/run/mesos/isolators/docker/volume"
--enforce_container_disk_quota="false" --executor_registration_timeout="1mins" --executor_shutdown_grace_period="5secs"
--fetcher_cache_dir="/tmp/Endpoint_SlaveEndpointTest_AuthorizedRequest_2_wvQkSB/fetch" --fetcher_cache_size="2GB"
--frameworks_home="" --gc_delay="1weeks" --gc_disk_headroom="0.1" --hadoop_home="" --help="false"
--hostname_lookup="true" --http_authenticators="basic" --http_command_executor="false" --http_credentials="/tmp/Endpoint_SlaveEndpointTest_AuthorizedRequest_2_wvQkSB/http_credentials"
--image_provisioner_backend="copy" --initialize_driver_logging="true" --io_switchboard_enable_server="true"
--isolation="posix/cpu,posix/mem" --launcher="posix" --launcher_dir="/mesos/build/src" --logbufsecs="0"
--logging_level="INFO" --max_completed_executors_per_framework="150" --oversubscribed_resources_interval="15secs"
--perf_duration="10secs" --perf_interval="1mins" --qos_correction_interval_min="0ns" --quiet="false"
--recover="reconnect" --recovery_timeout="15mins" --registration_backoff_factor="10ms" --resources="cpus:2;gpus:0;mem:1024;disk:1024;ports:[31000-32000]"
--revocable_cpu_low_priority="true" --runtime_dir="/tmp/Endpoint_SlaveEndpointTest_AuthorizedRequest_2_wvQkSB"
--sandbox_directory="/mnt/mesos/sandbox" --strict="true" --switch_user="true" --systemd_enable_support="true"
--systemd_runtime_directory="/run/systemd/system" --version="false" --work_dir="/tmp/Endpoint_SlaveEndpointTest_AuthorizedRequest_2_usgxvn"
I1209 02:32:44.190817 25816 credentials.hpp:86] Loading credential for authentication from
'/tmp/Endpoint_SlaveEndpointTest_AuthorizedRequest_2_wvQkSB/credential'
I1209 02:32:44.190912 25816 slave.cpp:346] Agent using credential for: test-principal
I1209 02:32:44.190927 25816 credentials.hpp:37] Loading credentials for authentication from
'/tmp/Endpoint_SlaveEndpointTest_AuthorizedRequest_2_wvQkSB/http_credentials'
I1209 02:32:44.191041 25816 http.cpp:922] Using default 'basic' HTTP authenticator for realm
'mesos-agent-readonly'
I1209 02:32:44.191083 25816 http.cpp:922] Using default 'basic' HTTP authenticator for realm
'mesos-agent-readwrite'
I1209 02:32:44.191488 25816 slave.cpp:533] Agent resources: cpus(*):2; mem(*):1024; disk(*):1024;
ports(*):[31000-32000]
I1209 02:32:44.191515 25816 slave.cpp:541] Agent attributes: [  ]
I1209 02:32:44.191520 25816 slave.cpp:546] Agent hostname: c67feabc8346
I1209 02:32:44.191887 25816 state.cpp:57] Recovering state from '/tmp/Endpoint_SlaveEndpointTest_AuthorizedRequest_2_usgxvn/meta'
I1209 02:32:44.192098 25811 status_update_manager.cpp:203] Recovering status update manager
I1209 02:32:44.192149 25811 containerizer.cpp:591] Recovering containerizer
I1209 02:32:44.192617 25806 provisioner.cpp:253] Provisioner recovery complete
I1209 02:32:44.192814 25815 slave.cpp:5414] Finished recovery
I1209 02:32:44.193143 25815 slave.cpp:5588] Querying resource estimator for oversubscribable
resources
I1209 02:32:44.193310 25814 slave.cpp:5602] Received oversubscribable resources {} from the
resource estimator
I1209 02:32:44.193985 25813 process.cpp:3679] Handling HTTP event for process 'slave(660)'
with path: '/slave(660)/containers'
I1209 02:32:44.194391 25808 http.cpp:874] Authorizing principal 'test-principal' to GET the
'/containers' endpoint
I1209 02:32:44.195654 25803 slave.cpp:790] Agent terminating
[       OK ] Endpoint/SlaveEndpointTest.AuthorizedRequest/2 (10 ms)
[ RUN      ] Endpoint/SlaveEndpointTest.UnauthorizedRequest/0
I1209 02:32:44.199746 25803 containerizer.cpp:217] Using isolation: posix/cpu,posix/mem,filesystem/posix,network/cni
W1209 02:32:44.200073 25803 backend.cpp:76] Failed to create 'aufs' backend: AufsBackend requires
root privileges, but is running as user mesos
W1209 02:32:44.200172 25803 backend.cpp:76] Failed to create 'bind' backend: BindBackend requires
root privileges
I1209 02:32:44.201305 25810 slave.cpp:208] Mesos agent started on (661)@172.17.0.2:58450
I1209 02:32:44.201333 25810 slave.cpp:209] Flags at startup: --acls="" --appc_simple_discovery_uri_prefix="http://"
--appc_store_dir="/tmp/mesos/store/appc" --authenticate_http_readonly="true" --authenticate_http_readwrite="true"
--authenticatee="crammd5" --authentication_backoff_factor="1secs" --authorizer="local" --cgroups_cpu_enable_pids_and_tids_count="false"
--cgroups_enable_cfs="false" --cgroups_hierarchy="/sys/fs/cgroup" --cgroups_limit_swap="false"
--cgroups_root="mesos" --container_disk_watch_interval="15secs" --containerizers="mesos" --credential="/tmp/Endpoint_SlaveEndpointTest_UnauthorizedRequest_0_LMulrx/credential"
--default_role="*" --disk_watch_interval="1mins" --docker="docker" --docker_kill_orphans="true"
--docker_registry="https://registry-1.docker.io" --docker_remove_delay="6hrs" --docker_socket="/var/run/docker.sock"
--docker_stop_timeout="0ns" --docker_store_dir="/tmp/mesos/store/docker" --docker_volume_checkpoint_dir="/var/run/mesos/isolators/docker/volume"
--enforce_container_disk_quota="false" --executor_registration_timeout="1mins" --executor_shutdown_grace_period="5secs"
--fetcher_cache_dir="/tmp/Endpoint_SlaveEndpointTest_UnauthorizedRequest_0_LMulrx/fetch" --fetcher_cache_size="2GB"
--frameworks_home="" --gc_delay="1weeks" --gc_disk_headroom="0.1" --hadoop_home="" --help="false"
--hostname_lookup="true" --http_authenticators="basic" --http_command_executor="false" --http_credentials="/tmp/Endpoint_SlaveEndpointTest_UnauthorizedRequest_0_LMulrx/http_credentials"
--image_provisioner_backend="copy" --initialize_driver_logging="true" --io_switchboard_enable_server="true"
--isolation="posix/cpu,posix/mem" --launcher="posix" --launcher_dir="/mesos/build/src" --logbufsecs="0"
--logging_level="INFO" --max_completed_executors_per_framework="150" --oversubscribed_resources_interval="15secs"
--perf_duration="10secs" --perf_interval="1mins" --qos_correction_interval_min="0ns" --quiet="false"
--recover="reconnect" --recovery_timeout="15mins" --registration_backoff_factor="10ms" --resources="cpus:2;gpus:0;mem:1024;disk:1024;ports:[31000-32000]"
--revocable_cpu_low_priority="true" --runtime_dir="/tmp/Endpoint_SlaveEndpointTest_UnauthorizedRequest_0_LMulrx"
--sandbox_directory="/mnt/mesos/sandbox" --strict="true" --switch_user="true" --systemd_enable_support="true"
--systemd_runtime_directory="/run/systemd/system" --version="false" --work_dir="/tmp/Endpoint_SlaveEndpointTest_UnauthorizedRequest_0_jF6O2i"
I1209 02:32:44.201695 25810 credentials.hpp:86] Loading credential for authentication from
'/tmp/Endpoint_SlaveEndpointTest_UnauthorizedRequest_0_LMulrx/credential'
I1209 02:32:44.201817 25810 slave.cpp:346] Agent using credential for: test-principal
I1209 02:32:44.201833 25810 credentials.hpp:37] Loading credentials for authentication from
'/tmp/Endpoint_SlaveEndpointTest_UnauthorizedRequest_0_LMulrx/http_credentials'
I1209 02:32:44.201968 25810 http.cpp:922] Using default 'basic' HTTP authenticator for realm
'mesos-agent-readonly'
I1209 02:32:44.202019 25810 http.cpp:922] Using default 'basic' HTTP authenticator for realm
'mesos-agent-readwrite'
I1209 02:32:44.202353 25810 slave.cpp:533] Agent resources: cpus(*):2; mem(*):1024; disk(*):1024;
ports(*):[31000-32000]
I1209 02:32:44.202383 25810 slave.cpp:541] Agent attributes: [  ]
I1209 02:32:44.202386 25810 slave.cpp:546] Agent hostname: c67feabc8346
I1209 02:32:44.202762 25815 state.cpp:57] Recovering state from '/tmp/Endpoint_SlaveEndpointTest_UnauthorizedRequest_0_jF6O2i/meta'
I1209 02:32:44.202926 25805 status_update_manager.cpp:203] Recovering status update manager
I1209 02:32:44.202996 25815 containerizer.cpp:591] Recovering containerizer
I1209 02:32:44.203572 25819 provisioner.cpp:253] Provisioner recovery complete
I1209 02:32:44.203776 25815 slave.cpp:5414] Finished recovery
I1209 02:32:44.204190 25815 slave.cpp:5588] Querying resource estimator for oversubscribable
resources
I1209 02:32:44.204381 25811 slave.cpp:5602] Received oversubscribable resources {} from the
resource estimator
I1209 02:32:44.205216 25810 process.cpp:3679] Handling HTTP event for process 'slave(661)'
with path: '/slave(661)/monitor/statistics'
I1209 02:32:44.205613 25805 http.cpp:874] Authorizing principal 'test-principal' to GET the
'/monitor/statistics' endpoint
I1209 02:32:44.206758 25806 slave.cpp:790] Agent terminating
[       OK ] Endpoint/SlaveEndpointTest.UnauthorizedRequest/0 (11 ms)
[ RUN      ] Endpoint/SlaveEndpointTest.UnauthorizedRequest/1
I1209 02:32:44.211264 25803 containerizer.cpp:217] Using isolation: posix/cpu,posix/mem,filesystem/posix,network/cni
W1209 02:32:44.211594 25803 backend.cpp:76] Failed to create 'aufs' backend: AufsBackend requires
root privileges, but is running as user mesos
W1209 02:32:44.211664 25803 backend.cpp:76] Failed to create 'bind' backend: BindBackend requires
root privileges
I1209 02:32:44.212600 25808 slave.cpp:208] Mesos agent started on (662)@172.17.0.2:58450
I1209 02:32:44.212826 25808 slave.cpp:209] Flags at startup: --acls="" --appc_simple_discovery_uri_prefix="http://"
--appc_store_dir="/tmp/mesos/store/appc" --authenticate_http_readonly="true" --authenticate_http_readwrite="true"
--authenticatee="crammd5" --authentication_backoff_factor="1secs" --authorizer="local" --cgroups_cpu_enable_pids_and_tids_count="false"
--cgroups_enable_cfs="false" --cgroups_hierarchy="/sys/fs/cgroup" --cgroups_limit_swap="false"
--cgroups_root="mesos" --container_disk_watch_interval="15secs" --containerizers="mesos" --credential="/tmp/Endpoint_SlaveEndpointTest_UnauthorizedRequest_1_LcJO7s/credential"
--default_role="*" --disk_watch_interval="1mins" --docker="docker" --docker_kill_orphans="true"
--docker_registry="https://registry-1.docker.io" --docker_remove_delay="6hrs" --docker_socket="/var/run/docker.sock"
--docker_stop_timeout="0ns" --docker_store_dir="/tmp/mesos/store/docker" --docker_volume_checkpoint_dir="/var/run/mesos/isolators/docker/volume"
--enforce_container_disk_quota="false" --executor_registration_timeout="1mins" --executor_shutdown_grace_period="5secs"
--fetcher_cache_dir="/tmp/Endpoint_SlaveEndpointTest_UnauthorizedRequest_1_LcJO7s/fetch" --fetcher_cache_size="2GB"
--frameworks_home="" --gc_delay="1weeks" --gc_disk_headroom="0.1" --hadoop_home="" --help="false"
--hostname_lookup="true" --http_authenticators="basic" --http_command_executor="false" --http_credentials="/tmp/Endpoint_SlaveEndpointTest_UnauthorizedRequest_1_LcJO7s/http_credentials"
--image_provisioner_backend="copy" --initialize_driver_logging="true" --io_switchboard_enable_server="true"
--isolation="posix/cpu,posix/mem" --launcher="posix" --launcher_dir="/mesos/build/src" --logbufsecs="0"
--logging_level="INFO" --max_completed_executors_per_framework="150" --oversubscribed_resources_interval="15secs"
--perf_duration="10secs" --perf_interval="1mins" --qos_correction_interval_min="0ns" --quiet="false"
--recover="reconnect" --recovery_timeout="15mins" --registration_backoff_factor="10ms" --resources="cpus:2;gpus:0;mem:1024;disk:1024;ports:[31000-32000]"
--revocable_cpu_low_priority="true" --runtime_dir="/tmp/Endpoint_SlaveEndpointTest_UnauthorizedRequest_1_LcJO7s"
--sandbox_directory="/mnt/mesos/sandbox" --strict="true" --switch_user="true" --systemd_enable_support="true"
--systemd_runtime_directory="/run/systemd/system" --version="false" --work_dir="/tmp/Endpoint_SlaveEndpointTest_UnauthorizedRequest_1_G3tpHe"
I1209 02:32:44.213238 25808 credentials.hpp:86] Loading credential for authentication from
'/tmp/Endpoint_SlaveEndpointTest_UnauthorizedRequest_1_LcJO7s/credential'
I1209 02:32:44.213407 25808 slave.cpp:346] Agent using credential for: test-principal
I1209 02:32:44.213424 25808 credentials.hpp:37] Loading credentials for authentication from
'/tmp/Endpoint_SlaveEndpointTest_UnauthorizedRequest_1_LcJO7s/http_credentials'
I1209 02:32:44.213635 25808 http.cpp:922] Using default 'basic' HTTP authenticator for realm
'mesos-agent-readonly'
I1209 02:32:44.213693 25808 http.cpp:922] Using default 'basic' HTTP authenticator for realm
'mesos-agent-readwrite'
I1209 02:32:44.214103 25808 slave.cpp:533] Agent resources: cpus(*):2; mem(*):1024; disk(*):1024;
ports(*):[31000-32000]
I1209 02:32:44.214136 25808 slave.cpp:541] Agent attributes: [  ]
I1209 02:32:44.214144 25808 slave.cpp:546] Agent hostname: c67feabc8346
I1209 02:32:44.214681 25819 state.cpp:57] Recovering state from '/tmp/Endpoint_SlaveEndpointTest_UnauthorizedRequest_1_G3tpHe/meta'
I1209 02:32:44.214840 25819 status_update_manager.cpp:203] Recovering status update manager
I1209 02:32:44.214907 25819 containerizer.cpp:591] Recovering containerizer
I1209 02:32:44.215487 25819 provisioner.cpp:253] Provisioner recovery complete
I1209 02:32:44.215628 25819 slave.cpp:5414] Finished recovery
I1209 02:32:44.216069 25819 slave.cpp:5588] Querying resource estimator for oversubscribable
resources
I1209 02:32:44.216229 25819 slave.cpp:5602] Received oversubscribable resources {} from the
resource estimator
I1209 02:32:44.217277 25804 process.cpp:3679] Handling HTTP event for process 'slave(662)'
with path: '/slave(662)/monitor/statistics.json'
I1209 02:32:44.217803 25819 http.cpp:874] Authorizing principal 'test-principal' to GET the
'/monitor/statistics.json' endpoint
I1209 02:32:44.219007 25803 slave.cpp:790] Agent terminating
[       OK ] Endpoint/SlaveEndpointTest.UnauthorizedRequest/1 (12 ms)
[ RUN      ] Endpoint/SlaveEndpointTest.UnauthorizedRequest/2
I1209 02:32:44.225213 25803 containerizer.cpp:217] Using isolation: posix/cpu,posix/mem,filesystem/posix,network/cni
W1209 02:32:44.225607 25803 backend.cpp:76] Failed to create 'aufs' backend: AufsBackend requires
root privileges, but is running as user mesos
W1209 02:32:44.225703 25803 backend.cpp:76] Failed to create 'bind' backend: BindBackend requires
root privileges
I1209 02:32:44.227088 25813 slave.cpp:208] Mesos agent started on (663)@172.17.0.2:58450
I1209 02:32:44.227118 25813 slave.cpp:209] Flags at startup: --acls="" --appc_simple_discovery_uri_prefix="http://"
--appc_store_dir="/tmp/mesos/store/appc" --authenticate_http_readonly="true" --authenticate_http_readwrite="true"
--authenticatee="crammd5" --authentication_backoff_factor="1secs" --authorizer="local" --cgroups_cpu_enable_pids_and_tids_count="false"
--cgroups_enable_cfs="false" --cgroups_hierarchy="/sys/fs/cgroup" --cgroups_limit_swap="false"
--cgroups_root="mesos" --container_disk_watch_interval="15secs" --containerizers="mesos" --credential="/tmp/Endpoint_SlaveEndpointTest_UnauthorizedRequest_2_ZePAWo/credential"
--default_role="*" --disk_watch_interval="1mins" --docker="docker" --docker_kill_orphans="true"
--docker_registry="https://registry-1.docker.io" --docker_remove_delay="6hrs" --docker_socket="/var/run/docker.sock"
--docker_stop_timeout="0ns" --docker_store_dir="/tmp/mesos/store/docker" --docker_volume_checkpoint_dir="/var/run/mesos/isolators/docker/volume"
--enforce_container_disk_quota="false" --executor_registration_timeout="1mins" --executor_shutdown_grace_period="5secs"
--fetcher_cache_dir="/tmp/Endpoint_SlaveEndpointTest_UnauthorizedRequest_2_ZePAWo/fetch" --fetcher_cache_size="2GB"
--frameworks_home="" --gc_delay="1weeks" --gc_disk_headroom="0.1" --hadoop_home="" --help="false"
--hostname_lookup="true" --http_authenticators="basic" --http_command_executor="false" --http_credentials="/tmp/Endpoint_SlaveEndpointTest_UnauthorizedRequest_2_ZePAWo/http_credentials"
--image_provisioner_backend="copy" --initialize_driver_logging="true" --io_switchboard_enable_server="true"
--isolation="posix/cpu,posix/mem" --launcher="posix" --launcher_dir="/mesos/build/src" --logbufsecs="0"
--logging_level="INFO" --max_completed_executors_per_framework="150" --oversubscribed_resources_interval="15secs"
--perf_duration="10secs" --perf_interval="1mins" --qos_correction_interval_min="0ns" --quiet="false"
--recover="reconnect" --recovery_timeout="15mins" --registration_backoff_factor="10ms" --resources="cpus:2;gpus:0;mem:1024;disk:1024;ports:[31000-32000]"
--revocable_cpu_low_priority="true" --runtime_dir="/tmp/Endpoint_SlaveEndpointTest_UnauthorizedRequest_2_ZePAWo"
--sandbox_directory="/mnt/mesos/sandbox" --strict="true" --switch_user="true" --systemd_enable_support="true"
--systemd_runtime_directory="/run/systemd/system" --version="false" --work_dir="/tmp/Endpoint_SlaveEndpointTest_UnauthorizedRequest_2_QWH1ta"
I1209 02:32:44.227526 25813 credentials.hpp:86] Loading credential for authentication from
'/tmp/Endpoint_SlaveEndpointTest_UnauthorizedRequest_2_ZePAWo/credential'
I1209 02:32:44.227655 25813 slave.cpp:346] Agent using credential for: test-principal
I1209 02:32:44.227766 25813 credentials.hpp:37] Loading credentials for authentication from
'/tmp/Endpoint_SlaveEndpointTest_UnauthorizedRequest_2_ZePAWo/http_credentials'
I1209 02:32:44.227989 25813 http.cpp:922] Using default 'basic' HTTP authenticator for realm
'mesos-agent-readonly'
I1209 02:32:44.228094 25813 http.cpp:922] Using default 'basic' HTTP authenticator for realm
'mesos-agent-readwrite'
I1209 02:32:44.228569 25813 slave.cpp:533] Agent resources: cpus(*):2; mem(*):1024; disk(*):1024;
ports(*):[31000-32000]
I1209 02:32:44.228605 25813 slave.cpp:541] Agent attributes: [  ]
I1209 02:32:44.228612 25813 slave.cpp:546] Agent hostname: c67feabc8346
I1209 02:32:44.229110 25808 state.cpp:57] Recovering state from '/tmp/Endpoint_SlaveEndpointTest_UnauthorizedRequest_2_QWH1ta/meta'
I1209 02:32:44.229290 25805 status_update_manager.cpp:203] Recovering status update manager
I1209 02:32:44.229472 25816 containerizer.cpp:591] Recovering containerizer
I1209 02:32:44.229957 25816 provisioner.cpp:253] Provisioner recovery complete
I1209 02:32:44.230125 25816 slave.cpp:5414] Finished recovery
I1209 02:32:44.230623 25816 slave.cpp:5588] Querying resource estimator for oversubscribable
resources
I1209 02:32:44.230722 25816 slave.cpp:5602] Received oversubscribable resources {} from the
resource estimator
I1209 02:32:44.231535 25807 process.cpp:3679] Handling HTTP event for process 'slave(663)'
with path: '/slave(663)/containers'
I1209 02:32:44.231945 25808 http.cpp:874] Authorizing principal 'test-principal' to GET the
'/containers' endpoint
I1209 02:32:44.232689 25810 slave.cpp:790] Agent terminating
[       OK ] Endpoint/SlaveEndpointTest.UnauthorizedRequest/2 (12 ms)
[ RUN      ] Endpoint/SlaveEndpointTest.NoAuthorizer/0
I1209 02:32:44.237202 25803 containerizer.cpp:217] Using isolation: posix/cpu,posix/mem,filesystem/posix,network/cni
W1209 02:32:44.237478 25803 backend.cpp:76] Failed to create 'aufs' backend: AufsBackend requires
root privileges, but is running as user mesos
W1209 02:32:44.237557 25803 backend.cpp:76] Failed to create 'bind' backend: BindBackend requires
root privileges
I1209 02:32:44.238100 25803 cluster.cpp:446] Creating default 'local' authorizer
I1209 02:32:44.238562 25807 slave.cpp:208] Mesos agent started on (664)@172.17.0.2:58450
I1209 02:32:44.238591 25807 slave.cpp:209] Flags at startup: --acls="" --appc_simple_discovery_uri_prefix="http://"
--appc_store_dir="/tmp/mesos/store/appc" --authenticate_http_readonly="true" --authenticate_http_readwrite="true"
--authenticatee="crammd5" --authentication_backoff_factor="1secs" --authorizer="local" --cgroups_cpu_enable_pids_and_tids_count="false"
--cgroups_enable_cfs="false" --cgroups_hierarchy="/sys/fs/cgroup" --cgroups_limit_swap="false"
--cgroups_root="mesos" --container_disk_watch_interval="15secs" --containerizers="mesos" --credential="/tmp/Endpoint_SlaveEndpointTest_NoAuthorizer_0_6qcWTk/credential"
--default_role="*" --disk_watch_interval="1mins" --docker="docker" --docker_kill_orphans="true"
--docker_registry="https://registry-1.docker.io" --docker_remove_delay="6hrs" --docker_socket="/var/run/docker.sock"
--docker_stop_timeout="0ns" --docker_store_dir="/tmp/mesos/store/docker" --docker_volume_checkpoint_dir="/var/run/mesos/isolators/docker/volume"
--enforce_container_disk_quota="false" --executor_registration_timeout="1mins" --executor_shutdown_grace_period="5secs"
--fetcher_cache_dir="/tmp/Endpoint_SlaveEndpointTest_NoAuthorizer_0_6qcWTk/fetch" --fetcher_cache_size="2GB"
--frameworks_home="" --gc_delay="1weeks" --gc_disk_headroom="0.1" --hadoop_home="" --help="false"
--hostname_lookup="true" --http_authenticators="basic" --http_command_executor="false" --http_credentials="/tmp/Endpoint_SlaveEndpointTest_NoAuthorizer_0_6qcWTk/http_credentials"
--image_provisioner_backend="copy" --initialize_driver_logging="true" --io_switchboard_enable_server="true"
--isolation="posix/cpu,posix/mem" --launcher="posix" --launcher_dir="/mesos/build/src" --logbufsecs="0"
--logging_level="INFO" --max_completed_executors_per_framework="150" --oversubscribed_resources_interval="15secs"
--perf_duration="10secs" --perf_interval="1mins" --qos_correction_interval_min="0ns" --quiet="false"
--recover="reconnect" --recovery_timeout="15mins" --registration_backoff_factor="10ms" --resources="cpus:2;gpus:0;mem:1024;disk:1024;ports:[31000-32000]"
--revocable_cpu_low_priority="true" --runtime_dir="/tmp/Endpoint_SlaveEndpointTest_NoAuthorizer_0_6qcWTk"
--sandbox_directory="/mnt/mesos/sandbox" --strict="true" --switch_user="true" --systemd_enable_support="true"
--systemd_runtime_directory="/run/systemd/system" --version="false" --work_dir="/tmp/Endpoint_SlaveEndpointTest_NoAuthorizer_0_rnKkp6"
I1209 02:32:44.238982 25807 credentials.hpp:86] Loading credential for authentication from
'/tmp/Endpoint_SlaveEndpointTest_NoAuthorizer_0_6qcWTk/credential'
I1209 02:32:44.239094 25807 slave.cpp:346] Agent using credential for: test-principal
I1209 02:32:44.239110 25807 credentials.hpp:37] Loading credentials for authentication from
'/tmp/Endpoint_SlaveEndpointTest_NoAuthorizer_0_6qcWTk/http_credentials'
I1209 02:32:44.239229 25807 http.cpp:922] Using default 'basic' HTTP authenticator for realm
'mesos-agent-readonly'
I1209 02:32:44.239271 25807 http.cpp:922] Using default 'basic' HTTP authenticator for realm
'mesos-agent-readwrite'
I1209 02:32:44.239573 25807 slave.cpp:533] Agent resources: cpus(*):2; mem(*):1024; disk(*):1024;
ports(*):[31000-32000]
I1209 02:32:44.239603 25807 slave.cpp:541] Agent attributes: [  ]
I1209 02:32:44.239608 25807 slave.cpp:546] Agent hostname: c67feabc8346
I1209 02:32:44.239961 25807 state.cpp:57] Recovering state from '/tmp/Endpoint_SlaveEndpointTest_NoAuthorizer_0_rnKkp6/meta'
I1209 02:32:44.240074 25807 status_update_manager.cpp:203] Recovering status update manager
I1209 02:32:44.240218 25808 containerizer.cpp:591] Recovering containerizer
I1209 02:32:44.240741 25805 provisioner.cpp:253] Provisioner recovery complete
I1209 02:32:44.240895 25819 slave.cpp:5414] Finished recovery
I1209 02:32:44.241242 25819 slave.cpp:5588] Querying resource estimator for oversubscribable
resources
I1209 02:32:44.241333 25810 slave.cpp:5602] Received oversubscribable resources {} from the
resource estimator
I1209 02:32:44.241905 25811 process.cpp:3679] Handling HTTP event for process 'slave(664)'
with path: '/slave(664)/monitor/statistics'
I1209 02:32:44.242267 25813 http.cpp:874] Authorizing principal 'test-principal' to GET the
'/monitor/statistics' endpoint
I1209 02:32:44.243376 25803 slave.cpp:790] Agent terminating
[       OK ] Endpoint/SlaveEndpointTest.NoAuthorizer/0 (10 ms)
[ RUN      ] Endpoint/SlaveEndpointTest.NoAuthorizer/1
I1209 02:32:44.247395 25803 containerizer.cpp:217] Using isolation: posix/cpu,posix/mem,filesystem/posix,network/cni
W1209 02:32:44.247653 25803 backend.cpp:76] Failed to create 'aufs' backend: AufsBackend requires
root privileges, but is running as user mesos
W1209 02:32:44.247720 25803 backend.cpp:76] Failed to create 'bind' backend: BindBackend requires
root privileges
I1209 02:32:44.248277 25803 cluster.cpp:446] Creating default 'local' authorizer
I1209 02:32:44.248729 25815 slave.cpp:208] Mesos agent started on (665)@172.17.0.2:58450
I1209 02:32:44.248751 25815 slave.cpp:209] Flags at startup: --acls="" --appc_simple_discovery_uri_prefix="http://"
--appc_store_dir="/tmp/mesos/store/appc" --authenticate_http_readonly="true" --authenticate_http_readwrite="true"
--authenticatee="crammd5" --authentication_backoff_factor="1secs" --authorizer="local" --cgroups_cpu_enable_pids_and_tids_count="false"
--cgroups_enable_cfs="false" --cgroups_hierarchy="/sys/fs/cgroup" --cgroups_limit_swap="false"
--cgroups_root="mesos" --container_disk_watch_interval="15secs" --containerizers="mesos" --credential="/tmp/Endpoint_SlaveEndpointTest_NoAuthorizer_1_FaRYXg/credential"
--default_role="*" --disk_watch_interval="1mins" --docker="docker" --docker_kill_orphans="true"
--docker_registry="https://registry-1.docker.io" --docker_remove_delay="6hrs" --docker_socket="/var/run/docker.sock"
--docker_stop_timeout="0ns" --docker_store_dir="/tmp/mesos/store/docker" --docker_volume_checkpoint_dir="/var/run/mesos/isolators/docker/volume"
--enforce_container_disk_quota="false" --executor_registration_timeout="1mins" --executor_shutdown_grace_period="5secs"
--fetcher_cache_dir="/tmp/Endpoint_SlaveEndpointTest_NoAuthorizer_1_FaRYXg/fetch" --fetcher_cache_size="2GB"
--frameworks_home="" --gc_delay="1weeks" --gc_disk_headroom="0.1" --hadoop_home="" --help="false"
--hostname_lookup="true" --http_authenticators="basic" --http_command_executor="false" --http_credentials="/tmp/Endpoint_SlaveEndpointTest_NoAuthorizer_1_FaRYXg/http_credentials"
--image_provisioner_backend="copy" --initialize_driver_logging="true" --io_switchboard_enable_server="true"
--isolation="posix/cpu,posix/mem" --launcher="posix" --launcher_dir="/mesos/build/src" --logbufsecs="0"
--logging_level="INFO" --max_completed_executors_per_framework="150" --oversubscribed_resources_interval="15secs"
--perf_duration="10secs" --perf_interval="1mins" --qos_correction_interval_min="0ns" --quiet="false"
--recover="reconnect" --recovery_timeout="15mins" --registration_backoff_factor="10ms" --resources="cpus:2;gpus:0;mem:1024;disk:1024;ports:[31000-32000]"
--revocable_cpu_low_priority="true" --runtime_dir="/tmp/Endpoint_SlaveEndpointTest_NoAuthorizer_1_FaRYXg"
--sandbox_directory="/mnt/mesos/sandbox" --strict="true" --switch_user="true" --systemd_enable_support="true"
--systemd_runtime_directory="/run/systemd/system" --version="false" --work_dir="/tmp/Endpoint_SlaveEndpointTest_NoAuthorizer_1_MS7Ir2"
I1209 02:32:44.249081 25815 credentials.hpp:86] Loading credential for authentication from
'/tmp/Endpoint_SlaveEndpointTest_NoAuthorizer_1_FaRYXg/credential'
I1209 02:32:44.249169 25815 slave.cpp:346] Agent using credential for: test-principal
I1209 02:32:44.249181 25815 credentials.hpp:37] Loading credentials for authentication from
'/tmp/Endpoint_SlaveEndpointTest_NoAuthorizer_1_FaRYXg/http_credentials'
I1209 02:32:44.249306 25815 http.cpp:922] Using default 'basic' HTTP authenticator for realm
'mesos-agent-readonly'
I1209 02:32:44.249349 25815 http.cpp:922] Using default 'basic' HTTP authenticator for realm
'mesos-agent-readwrite'
I1209 02:32:44.249635 25815 slave.cpp:533] Agent resources: cpus(*):2; mem(*):1024; disk(*):1024;
ports(*):[31000-32000]
I1209 02:32:44.249665 25815 slave.cpp:541] Agent attributes: [  ]
I1209 02:32:44.249673 25815 slave.cpp:546] Agent hostname: c67feabc8346
I1209 02:32:44.250071 25812 state.cpp:57] Recovering state from '/tmp/Endpoint_SlaveEndpointTest_NoAuthorizer_1_MS7Ir2/meta'
I1209 02:32:44.250222 25818 status_update_manager.cpp:203] Recovering status update manager
I1209 02:32:44.250306 25809 containerizer.cpp:591] Recovering containerizer
I1209 02:32:44.250944 25806 provisioner.cpp:253] Provisioner recovery complete
I1209 02:32:44.251138 25816 slave.cpp:5414] Finished recovery
I1209 02:32:44.251473 25816 slave.cpp:5588] Querying resource estimator for oversubscribable
resources
I1209 02:32:44.251606 25817 slave.cpp:5602] Received oversubscribable resources {} from the
resource estimator
I1209 02:32:44.252167 25818 process.cpp:3679] Handling HTTP event for process 'slave(665)'
with path: '/slave(665)/monitor/statistics.json'
I1209 02:32:44.252506 25814 http.cpp:874] Authorizing principal 'test-principal' to GET the
'/monitor/statistics.json' endpoint
I1209 02:32:44.253495 25803 slave.cpp:790] Agent terminating
[       OK ] Endpoint/SlaveEndpointTest.NoAuthorizer/1 (9 ms)
[ RUN      ] Endpoint/SlaveEndpointTest.NoAuthorizer/2
I1209 02:32:44.256693 25803 containerizer.cpp:217] Using isolation: posix/cpu,posix/mem,filesystem/posix,network/cni
W1209 02:32:44.256983 25803 backend.cpp:76] Failed to create 'aufs' backend: AufsBackend requires
root privileges, but is running as user mesos
W1209 02:32:44.257052 25803 backend.cpp:76] Failed to create 'bind' backend: BindBackend requires
root privileges
I1209 02:32:44.257781 25803 cluster.cpp:446] Creating default 'local' authorizer
I1209 02:32:44.258493 25810 slave.cpp:208] Mesos agent started on (666)@172.17.0.2:58450
I1209 02:32:44.258920 25810 slave.cpp:209] Flags at startup: --acls="" --appc_simple_discovery_uri_prefix="http://"
--appc_store_dir="/tmp/mesos/store/appc" --authenticate_http_readonly="true" --authenticate_http_readwrite="true"
--authenticatee="crammd5" --authentication_backoff_factor="1secs" --authorizer="local" --cgroups_cpu_enable_pids_and_tids_count="false"
--cgroups_enable_cfs="false" --cgroups_hierarchy="/sys/fs/cgroup" --cgroups_limit_swap="false"
--cgroups_root="mesos" --container_disk_watch_interval="15secs" --containerizers="mesos" --credential="/tmp/Endpoint_SlaveEndpointTest_NoAuthorizer_2_AxPf8c/credential"
--default_role="*" --disk_watch_interval="1mins" --docker="docker" --docker_kill_orphans="true"
--docker_registry="https://registry-1.docker.io" --docker_remove_delay="6hrs" --docker_socket="/var/run/docker.sock"
--docker_stop_timeout="0ns" --docker_store_dir="/tmp/mesos/store/docker" --docker_volume_checkpoint_dir="/var/run/mesos/isolators/docker/volume"
--enforce_container_disk_quota="false" --executor_registration_timeout="1mins" --executor_shutdown_grace_period="5secs"
--fetcher_cache_dir="/tmp/Endpoint_SlaveEndpointTest_NoAuthorizer_2_AxPf8c/fetch" --fetcher_cache_size="2GB"
--frameworks_home="" --gc_delay="1weeks" --gc_disk_headroom="0.1" --hadoop_home="" --help="false"
--hostname_lookup="true" --http_authenticators="basic" --http_command_executor="false" --http_credentials="/tmp/Endpoint_SlaveEndpointTest_NoAuthorizer_2_AxPf8c/http_credentials"
--image_provisioner_backend="copy" --initialize_driver_logging="true" --io_switchboard_enable_server="true"
--isolation="posix/cpu,posix/mem" --launcher="posix" --launcher_dir="/mesos/build/src" --logbufsecs="0"
--logging_level="INFO" --max_completed_executors_per_framework="150" --oversubscribed_resources_interval="15secs"
--perf_duration="10secs" --perf_interval="1mins" --qos_correction_interval_min="0ns" --quiet="false"
--recover="reconnect" --recovery_timeout="15mins" --registration_backoff_factor="10ms" --resources="cpus:2;gpus:0;mem:1024;disk:1024;ports:[31000-32000]"
--revocable_cpu_low_priority="true" --runtime_dir="/tmp/Endpoint_SlaveEndpointTest_NoAuthorizer_2_AxPf8c"
--sandbox_directory="/mnt/mesos/sandbox" --strict="true" --switch_user="true" --systemd_enable_support="true"
--systemd_runtime_directory="/run/systemd/system" --version="false" --work_dir="/tmp/Endpoint_SlaveEndpointTest_NoAuthorizer_2_ZzxtAY"
I1209 02:32:44.259557 25810 credentials.hpp:86] Loading credential for authentication from
'/tmp/Endpoint_SlaveEndpointTest_NoAuthorizer_2_AxPf8c/credential'
I1209 02:32:44.259852 25810 slave.cpp:346] Agent using credential for: test-principal
I1209 02:32:44.259866 25810 credentials.hpp:37] Loading credentials for authentication from
'/tmp/Endpoint_SlaveEndpointTest_NoAuthorizer_2_AxPf8c/http_credentials'
I1209 02:32:44.259997 25810 http.cpp:922] Using default 'basic' HTTP authenticator for realm
'mesos-agent-readonly'
I1209 02:32:44.260058 25810 http.cpp:922] Using default 'basic' HTTP authenticator for realm
'mesos-agent-readwrite'
I1209 02:32:44.260474 25810 slave.cpp:533] Agent resources: cpus(*):2; mem(*):1024; disk(*):1024;
ports(*):[31000-32000]
I1209 02:32:44.260509 25810 slave.cpp:541] Agent attributes: [  ]
I1209 02:32:44.260516 25810 slave.cpp:546] Agent hostname: c67feabc8346
I1209 02:32:44.261127 25807 state.cpp:57] Recovering state from '/tmp/Endpoint_SlaveEndpointTest_NoAuthorizer_2_ZzxtAY/meta'
I1209 02:32:44.261298 25807 status_update_manager.cpp:203] Recovering status update manager
I1209 02:32:44.261373 25807 containerizer.cpp:591] Recovering containerizer
I1209 02:32:44.261845 25807 provisioner.cpp:253] Provisioner recovery complete
I1209 02:32:44.262002 25807 slave.cpp:5414] Finished recovery
I1209 02:32:44.262468 25807 slave.cpp:5588] Querying resource estimator for oversubscribable
resources
I1209 02:32:44.262549 25816 slave.cpp:5602] Received oversubscribable resources {} from the
resource estimator
I1209 02:32:44.263826 25810 process.cpp:3679] Handling HTTP event for process 'slave(666)'
with path: '/slave(666)/containers'
I1209 02:32:44.264233 25808 http.cpp:874] Authorizing principal 'test-principal' to GET the
'/containers' endpoint
I1209 02:32:44.265382 25809 slave.cpp:790] Agent terminating
[       OK ] Endpoint/SlaveEndpointTest.NoAuthorizer/2 (13 ms)
[----------] 9 tests from Endpoint/SlaveEndpointTest (107 ms total)

[----------] Global test environment tear-down
[==========] 1375 tests from 157 test cases ran. (183842 ms total)
[  PASSED  ] 1374 tests.
[  FAILED  ] 1 test, listed below:
[  FAILED  ] DefaultExecutorTest.KillTaskGroupOnTaskFailure

 1 FAILED TEST
  YOU HAVE 9 DISABLED TESTS

make[3]: *** [CMakeFiles/check] Error 1
make[3]: Leaving directory `/mesos/build'
make[2]: *** [CMakeFiles/check.dir/all] Error 2
make[2]: Leaving directory `/mesos/build'
make[1]: *** [CMakeFiles/check.dir/rule] Error 2
make[1]: Leaving directory `/mesos/build'
make: *** [check] Error 2
+ docker rmi mesos-1481248614-29439
Untagged: mesos-1481248614-29439:latest
Deleted: sha256:d80e5c52eee0bc85dc074086398cad08c0f3e1293b64376698eb9af49c2e63cc
Deleted: sha256:5df3182472a3ce382092b509685aa75cc98ffa569ebfd43f8b2287ecabd416e8
Deleted: sha256:03e9c4d7ff449bcd50a62867d778bc7f8acbd0a34e6f65840498c32a61a5a75f
Deleted: sha256:c49d60b2be161601489611afb33b437eb10961e8df222a31fcba8a1b82bc3da5
Deleted: sha256:45d3397b80b01b7909260d31a2bd7200b21abfbae3ed825442a7571ceeb5a462
Deleted: sha256:dd103a8fe88a1d9c6414d4ffe816b6f67cbc4bb660108a0ead898e039ee92c08
Deleted: sha256:a214976ce7384dce20394419d075704a929afc58498e62e2e892000c32ed2b19
Deleted: sha256:4026015bf09ff7eb8f3e1fa7b6a54731e56aa0fd37290381b0be27353fe6877f
Deleted: sha256:c2608c3d3d9f588b00e29473eed7760fa7e42c50e02bb85d8fb8c17122b98164
Deleted: sha256:dc0a1995054265e0153d4ea472af62d05dd0906238f8fa88a2fddc7f8e560011
Deleted: sha256:d0b501accd07dba54dd844800cfd1284016dd5f2a71c3ac1f51c59d47f1a51ea
Deleted: sha256:0929a8aaae18b5b27b6b487e006bd0f7478444afe286eb65f90610080aa4633e
Deleted: sha256:8365f06bbe4d846ae4c19326e23487291de63e80850fdd3e9ffdb60929766d2f
Deleted: sha256:7eba2bcc5948152843cb136dd14b37eab86a031a28cfb79cbdda38838d1c7e66
Deleted: sha256:3106e721f9b41def1c14030d70850cade857146164fd02269647be56767c02f9
Deleted: sha256:5f8ce37a9d5174edb6ee65593793a445071e54f63aa951964f93da529c1b1b41
Deleted: sha256:8578e58895af0bdedd19cc5f74331a9203c9de9e78c831bfed190861613914d7
Deleted: sha256:3f0471bcceecf4ad3ba80866c1531f715f2a7703549bff4b8b16deb8797a9cef
Deleted: sha256:e6e667cd8d76a5ff2942322bc94c5a607064df3fbdc8f5ba159c4d936f33e924
Deleted: sha256:98127ac883a47e5448713cbf43fc00f357f50f1909f053d1561108cfcbf8cf38
Deleted: sha256:f66c9c8e389f1f1e09c9991f43294c7db1cb6d1f4d684225081d681c217ce2bf
Deleted: sha256:4abf91b45700bda2c81ead195c5886b2caf0326c67e89f1cff8028faae4a5b2e
Deleted: sha256:55ecaba4880102a1f3051465d56e0c45e5c7cc0c02ee2b9c6fc73a442c776b47
Deleted: sha256:0c54a8c345cbeb0251d36c07927ccf9d09eede495a75e578dbc1029948b2f64e
Build step 'Execute shell' marked build as failure

Mime
View raw message