mesos-builds mailing list archives

Site index · List index
Message view « Date » · « Thread »
Top « Date » · « Thread »
From Apache Jenkins Server <jenk...@builds.apache.org>
Subject Build failed in Jenkins: Mesos » cmake,gcc,--verbose,GLOG_v=1 MESOS_VERBOSE=1,ubuntu:14.04,(docker||Hadoop)&&(!ubuntu-us1)&&(!ubuntu-6)&&(!ubuntu-eu2) #3037
Date Thu, 15 Dec 2016 19:48:28 GMT
See <https://builds.apache.org/job/Mesos/BUILDTOOL=cmake,COMPILER=gcc,CONFIGURATION=--verbose,ENVIRONMENT=GLOG_v=1%20MESOS_VERBOSE=1,OS=ubuntu%3A14.04,label_exp=(docker%7C%7CHadoop)&&(!ubuntu-us1)&&(!ubuntu-6)&&(!ubuntu-eu2)/3037/changes>

Changes:

[toenshoff] Used correct shell string comparison operator in test.

[benjamin.hindman] Added a synchronous version of loop for io::read/write/redirect.

[benjamin.hindman] Used process::loop in infinitely recursive functions.

[yujie.jay] Kept the listening socket while accept is in flight.

[yujie.jay] Fixed overlay backend symlink error message.

[vinodkone] Updated contributors.yaml.

[vinodkone] Added tests for IOSwitchboard heartbeat.

[mpark] Fixed a few places to use `foreachkey` / `foreachvalue`.

[mpark] Changed implementation of `LinkedHashMap`.

[mpark] Enhanced `LinkedHashMap` to support `foreachpair` and friends.

[mpark] Modernized code to use `foreachpair` with `LinkedHashMap`.

[mpark] Updated stout's `README`.

[mpark] Removed unused header include from stout's `hashmap`.

[mpark] Updated the Windows doc to refer to `.\support\windows-build.bat`.

------------------------------------------
[...truncated 161801 lines...]
[ RUN      ] Endpoint/SlaveEndpointTest.AuthorizedRequest/1
I1215 19:48:20.823936 26135 containerizer.cpp:220] Using isolation: posix/cpu,posix/mem,filesystem/posix,network/cni
W1215 19:48:20.824321 26135 backend.cpp:76] Failed to create 'aufs' backend: AufsBackend requires
root privileges, but is running as user mesos
W1215 19:48:20.824409 26135 backend.cpp:76] Failed to create 'bind' backend: BindBackend requires
root privileges
I1215 19:48:20.825983 26147 slave.cpp:209] Mesos agent started on (667)@172.17.0.3:38261
I1215 19:48:20.826004 26147 slave.cpp:210] Flags at startup: --acls="" --appc_simple_discovery_uri_prefix="http://"
--appc_store_dir="/tmp/mesos/store/appc" --authenticate_http_readonly="true" --authenticate_http_readwrite="true"
--authenticatee="crammd5" --authentication_backoff_factor="1secs" --authorizer="local" --cgroups_cpu_enable_pids_and_tids_count="false"
--cgroups_enable_cfs="false" --cgroups_hierarchy="/sys/fs/cgroup" --cgroups_limit_swap="false"
--cgroups_root="mesos" --container_disk_watch_interval="15secs" --containerizers="mesos" --credential="/tmp/Endpoint_SlaveEndpointTest_AuthorizedRequest_1_Qz1yo8/credential"
--default_role="*" --disk_watch_interval="1mins" --docker="docker" --docker_kill_orphans="true"
--docker_registry="https://registry-1.docker.io" --docker_remove_delay="6hrs" --docker_socket="/var/run/docker.sock"
--docker_stop_timeout="0ns" --docker_store_dir="/tmp/mesos/store/docker" --docker_volume_checkpoint_dir="/var/run/mesos/isolators/docker/volume"
--enforce_container_disk_quota="false" --executor_registration_timeout="1mins" --executor_shutdown_grace_period="5secs"
--fetcher_cache_dir="/tmp/Endpoint_SlaveEndpointTest_AuthorizedRequest_1_Qz1yo8/fetch" --fetcher_cache_size="2GB"
--frameworks_home="" --gc_delay="1weeks" --gc_disk_headroom="0.1" --hadoop_home="" --help="false"
--hostname_lookup="true" --http_authenticators="basic" --http_command_executor="false" --http_credentials="/tmp/Endpoint_SlaveEndpointTest_AuthorizedRequest_1_Qz1yo8/http_credentials"
--http_heartbeat_interval="30secs" --image_provisioner_backend="copy" --initialize_driver_logging="true"
--isolation="posix/cpu,posix/mem" --launcher="posix" --launcher_dir="/mesos/build/src" --logbufsecs="0"
--logging_level="INFO" --max_completed_executors_per_framework="150" --oversubscribed_resources_interval="15secs"
--perf_duration="10secs" --perf_interval="1mins" --qos_correction_interval_min="0ns" --quiet="false"
--recover="reconnect" --recovery_timeout="15mins" --registration_backoff_factor="10ms" --resources="cpus:2;gpus:0;mem:1024;disk:1024;ports:[31000-32000]"
--revocable_cpu_low_priority="true" --runtime_dir="/tmp/Endpoint_SlaveEndpointTest_AuthorizedRequest_1_Qz1yo8"
--sandbox_directory="/mnt/mesos/sandbox" --strict="true" --switch_user="true" --systemd_enable_support="true"
--systemd_runtime_directory="/run/systemd/system" --version="false" --work_dir="/tmp/Endpoint_SlaveEndpointTest_AuthorizedRequest_1_Fkg2Ah"
I1215 19:48:20.826436 26147 credentials.hpp:86] Loading credential for authentication from
'/tmp/Endpoint_SlaveEndpointTest_AuthorizedRequest_1_Qz1yo8/credential'
I1215 19:48:20.826535 26147 slave.cpp:352] Agent using credential for: test-principal
I1215 19:48:20.826551 26147 credentials.hpp:37] Loading credentials for authentication from
'/tmp/Endpoint_SlaveEndpointTest_AuthorizedRequest_1_Qz1yo8/http_credentials'
I1215 19:48:20.826666 26147 http.cpp:922] Using default 'basic' HTTP authenticator for realm
'mesos-agent-readonly'
I1215 19:48:20.826719 26147 http.cpp:922] Using default 'basic' HTTP authenticator for realm
'mesos-agent-readwrite'
I1215 19:48:20.827112 26147 slave.cpp:539] Agent resources: cpus(*):2; mem(*):1024; disk(*):1024;
ports(*):[31000-32000]
I1215 19:48:20.827155 26147 slave.cpp:547] Agent attributes: [  ]
I1215 19:48:20.827168 26147 slave.cpp:552] Agent hostname: 2f17514ee6e7
I1215 19:48:20.827601 26147 state.cpp:57] Recovering state from '/tmp/Endpoint_SlaveEndpointTest_AuthorizedRequest_1_Fkg2Ah/meta'
I1215 19:48:20.827854 26148 status_update_manager.cpp:203] Recovering status update manager
I1215 19:48:20.828089 26151 containerizer.cpp:594] Recovering containerizer
I1215 19:48:20.828953 26137 provisioner.cpp:253] Provisioner recovery complete
I1215 19:48:20.829454 26137 slave.cpp:5408] Finished recovery
I1215 19:48:20.829970 26137 slave.cpp:5582] Querying resource estimator for oversubscribable
resources
I1215 19:48:20.830183 26149 slave.cpp:5596] Received oversubscribable resources {} from the
resource estimator
I1215 19:48:20.830853 26140 process.cpp:3679] Handling HTTP event for process 'slave(667)'
with path: '/slave(667)/monitor/statistics.json'
I1215 19:48:20.831497 26140 http.cpp:874] Authorizing principal 'test-principal' to GET the
'/monitor/statistics.json' endpoint
I1215 19:48:20.833426 26136 slave.cpp:796] Agent terminating
[       OK ] Endpoint/SlaveEndpointTest.AuthorizedRequest/1 (15 ms)
[ RUN      ] Endpoint/SlaveEndpointTest.AuthorizedRequest/2
I1215 19:48:20.839004 26135 containerizer.cpp:220] Using isolation: posix/cpu,posix/mem,filesystem/posix,network/cni
W1215 19:48:20.839342 26135 backend.cpp:76] Failed to create 'aufs' backend: AufsBackend requires
root privileges, but is running as user mesos
W1215 19:48:20.839596 26135 backend.cpp:76] Failed to create 'bind' backend: BindBackend requires
root privileges
I1215 19:48:20.840988 26150 slave.cpp:209] Mesos agent started on (668)@172.17.0.3:38261
I1215 19:48:20.841012 26150 slave.cpp:210] Flags at startup: --acls="" --appc_simple_discovery_uri_prefix="http://"
--appc_store_dir="/tmp/mesos/store/appc" --authenticate_http_readonly="true" --authenticate_http_readwrite="true"
--authenticatee="crammd5" --authentication_backoff_factor="1secs" --authorizer="local" --cgroups_cpu_enable_pids_and_tids_count="false"
--cgroups_enable_cfs="false" --cgroups_hierarchy="/sys/fs/cgroup" --cgroups_limit_swap="false"
--cgroups_root="mesos" --container_disk_watch_interval="15secs" --containerizers="mesos" --credential="/tmp/Endpoint_SlaveEndpointTest_AuthorizedRequest_2_m279Ix/credential"
--default_role="*" --disk_watch_interval="1mins" --docker="docker" --docker_kill_orphans="true"
--docker_registry="https://registry-1.docker.io" --docker_remove_delay="6hrs" --docker_socket="/var/run/docker.sock"
--docker_stop_timeout="0ns" --docker_store_dir="/tmp/mesos/store/docker" --docker_volume_checkpoint_dir="/var/run/mesos/isolators/docker/volume"
--enforce_container_disk_quota="false" --executor_registration_timeout="1mins" --executor_shutdown_grace_period="5secs"
--fetcher_cache_dir="/tmp/Endpoint_SlaveEndpointTest_AuthorizedRequest_2_m279Ix/fetch" --fetcher_cache_size="2GB"
--frameworks_home="" --gc_delay="1weeks" --gc_disk_headroom="0.1" --hadoop_home="" --help="false"
--hostname_lookup="true" --http_authenticators="basic" --http_command_executor="false" --http_credentials="/tmp/Endpoint_SlaveEndpointTest_AuthorizedRequest_2_m279Ix/http_credentials"
--http_heartbeat_interval="30secs" --image_provisioner_backend="copy" --initialize_driver_logging="true"
--isolation="posix/cpu,posix/mem" --launcher="posix" --launcher_dir="/mesos/build/src" --logbufsecs="0"
--logging_level="INFO" --max_completed_executors_per_framework="150" --oversubscribed_resources_interval="15secs"
--perf_duration="10secs" --perf_interval="1mins" --qos_correction_interval_min="0ns" --quiet="false"
--recover="reconnect" --recovery_timeout="15mins" --registration_backoff_factor="10ms" --resources="cpus:2;gpus:0;mem:1024;disk:1024;ports:[31000-32000]"
--revocable_cpu_low_priority="true" --runtime_dir="/tmp/Endpoint_SlaveEndpointTest_AuthorizedRequest_2_m279Ix"
--sandbox_directory="/mnt/mesos/sandbox" --strict="true" --switch_user="true" --systemd_enable_support="true"
--systemd_runtime_directory="/run/systemd/system" --version="false" --work_dir="/tmp/Endpoint_SlaveEndpointTest_AuthorizedRequest_2_Gy08SG"
I1215 19:48:20.841446 26150 credentials.hpp:86] Loading credential for authentication from
'/tmp/Endpoint_SlaveEndpointTest_AuthorizedRequest_2_m279Ix/credential'
I1215 19:48:20.841552 26150 slave.cpp:352] Agent using credential for: test-principal
I1215 19:48:20.841569 26150 credentials.hpp:37] Loading credentials for authentication from
'/tmp/Endpoint_SlaveEndpointTest_AuthorizedRequest_2_m279Ix/http_credentials'
I1215 19:48:20.841696 26150 http.cpp:922] Using default 'basic' HTTP authenticator for realm
'mesos-agent-readonly'
I1215 19:48:20.841753 26150 http.cpp:922] Using default 'basic' HTTP authenticator for realm
'mesos-agent-readwrite'
I1215 19:48:20.842191 26150 slave.cpp:539] Agent resources: cpus(*):2; mem(*):1024; disk(*):1024;
ports(*):[31000-32000]
I1215 19:48:20.842236 26150 slave.cpp:547] Agent attributes: [  ]
I1215 19:48:20.842252 26150 slave.cpp:552] Agent hostname: 2f17514ee6e7
I1215 19:48:20.842679 26150 state.cpp:57] Recovering state from '/tmp/Endpoint_SlaveEndpointTest_AuthorizedRequest_2_Gy08SG/meta'
I1215 19:48:20.842826 26150 status_update_manager.cpp:203] Recovering status update manager
I1215 19:48:20.842980 26137 containerizer.cpp:594] Recovering containerizer
I1215 19:48:20.843643 26138 provisioner.cpp:253] Provisioner recovery complete
I1215 19:48:20.843904 26145 slave.cpp:5408] Finished recovery
I1215 19:48:20.844311 26145 slave.cpp:5582] Querying resource estimator for oversubscribable
resources
I1215 19:48:20.844640 26148 slave.cpp:5596] Received oversubscribable resources {} from the
resource estimator
I1215 19:48:20.845371 26140 process.cpp:3679] Handling HTTP event for process 'slave(668)'
with path: '/slave(668)/containers'
I1215 19:48:20.846076 26146 http.cpp:874] Authorizing principal 'test-principal' to GET the
'/containers' endpoint
I1215 19:48:20.848029 26144 slave.cpp:796] Agent terminating
[       OK ] Endpoint/SlaveEndpointTest.AuthorizedRequest/2 (14 ms)
[ RUN      ] Endpoint/SlaveEndpointTest.UnauthorizedRequest/0
I1215 19:48:20.855134 26135 containerizer.cpp:220] Using isolation: posix/cpu,posix/mem,filesystem/posix,network/cni
W1215 19:48:20.855660 26135 backend.cpp:76] Failed to create 'aufs' backend: AufsBackend requires
root privileges, but is running as user mesos
W1215 19:48:20.855794 26135 backend.cpp:76] Failed to create 'bind' backend: BindBackend requires
root privileges
I1215 19:48:20.857221 26145 slave.cpp:209] Mesos agent started on (669)@172.17.0.3:38261
I1215 19:48:20.857244 26145 slave.cpp:210] Flags at startup: --acls="" --appc_simple_discovery_uri_prefix="http://"
--appc_store_dir="/tmp/mesos/store/appc" --authenticate_http_readonly="true" --authenticate_http_readwrite="true"
--authenticatee="crammd5" --authentication_backoff_factor="1secs" --authorizer="local" --cgroups_cpu_enable_pids_and_tids_count="false"
--cgroups_enable_cfs="false" --cgroups_hierarchy="/sys/fs/cgroup" --cgroups_limit_swap="false"
--cgroups_root="mesos" --container_disk_watch_interval="15secs" --containerizers="mesos" --credential="/tmp/Endpoint_SlaveEndpointTest_UnauthorizedRequest_0_x4jwdX/credential"
--default_role="*" --disk_watch_interval="1mins" --docker="docker" --docker_kill_orphans="true"
--docker_registry="https://registry-1.docker.io" --docker_remove_delay="6hrs" --docker_socket="/var/run/docker.sock"
--docker_stop_timeout="0ns" --docker_store_dir="/tmp/mesos/store/docker" --docker_volume_checkpoint_dir="/var/run/mesos/isolators/docker/volume"
--enforce_container_disk_quota="false" --executor_registration_timeout="1mins" --executor_shutdown_grace_period="5secs"
--fetcher_cache_dir="/tmp/Endpoint_SlaveEndpointTest_UnauthorizedRequest_0_x4jwdX/fetch" --fetcher_cache_size="2GB"
--frameworks_home="" --gc_delay="1weeks" --gc_disk_headroom="0.1" --hadoop_home="" --help="false"
--hostname_lookup="true" --http_authenticators="basic" --http_command_executor="false" --http_credentials="/tmp/Endpoint_SlaveEndpointTest_UnauthorizedRequest_0_x4jwdX/http_credentials"
--http_heartbeat_interval="30secs" --image_provisioner_backend="copy" --initialize_driver_logging="true"
--isolation="posix/cpu,posix/mem" --launcher="posix" --launcher_dir="/mesos/build/src" --logbufsecs="0"
--logging_level="INFO" --max_completed_executors_per_framework="150" --oversubscribed_resources_interval="15secs"
--perf_duration="10secs" --perf_interval="1mins" --qos_correction_interval_min="0ns" --quiet="false"
--recover="reconnect" --recovery_timeout="15mins" --registration_backoff_factor="10ms" --resources="cpus:2;gpus:0;mem:1024;disk:1024;ports:[31000-32000]"
--revocable_cpu_low_priority="true" --runtime_dir="/tmp/Endpoint_SlaveEndpointTest_UnauthorizedRequest_0_x4jwdX"
--sandbox_directory="/mnt/mesos/sandbox" --strict="true" --switch_user="true" --systemd_enable_support="true"
--systemd_runtime_directory="/run/systemd/system" --version="false" --work_dir="/tmp/Endpoint_SlaveEndpointTest_UnauthorizedRequest_0_2ie0k6"
I1215 19:48:20.857691 26145 credentials.hpp:86] Loading credential for authentication from
'/tmp/Endpoint_SlaveEndpointTest_UnauthorizedRequest_0_x4jwdX/credential'
I1215 19:48:20.857794 26145 slave.cpp:352] Agent using credential for: test-principal
I1215 19:48:20.857815 26145 credentials.hpp:37] Loading credentials for authentication from
'/tmp/Endpoint_SlaveEndpointTest_UnauthorizedRequest_0_x4jwdX/http_credentials'
I1215 19:48:20.857944 26145 http.cpp:922] Using default 'basic' HTTP authenticator for realm
'mesos-agent-readonly'
I1215 19:48:20.858038 26145 http.cpp:922] Using default 'basic' HTTP authenticator for realm
'mesos-agent-readwrite'
I1215 19:48:20.858454 26145 slave.cpp:539] Agent resources: cpus(*):2; mem(*):1024; disk(*):1024;
ports(*):[31000-32000]
I1215 19:48:20.858496 26145 slave.cpp:547] Agent attributes: [  ]
I1215 19:48:20.858507 26145 slave.cpp:552] Agent hostname: 2f17514ee6e7
I1215 19:48:20.858927 26147 state.cpp:57] Recovering state from '/tmp/Endpoint_SlaveEndpointTest_UnauthorizedRequest_0_2ie0k6/meta'
I1215 19:48:20.859184 26143 status_update_manager.cpp:203] Recovering status update manager
I1215 19:48:20.859300 26136 containerizer.cpp:594] Recovering containerizer
I1215 19:48:20.860142 26151 provisioner.cpp:253] Provisioner recovery complete
I1215 19:48:20.860442 26139 slave.cpp:5408] Finished recovery
I1215 19:48:20.860859 26139 slave.cpp:5582] Querying resource estimator for oversubscribable
resources
I1215 19:48:20.861027 26150 slave.cpp:5596] Received oversubscribable resources {} from the
resource estimator
I1215 19:48:20.861702 26151 process.cpp:3679] Handling HTTP event for process 'slave(669)'
with path: '/slave(669)/monitor/statistics'
I1215 19:48:20.862221 26145 http.cpp:874] Authorizing principal 'test-principal' to GET the
'/monitor/statistics' endpoint
I1215 19:48:20.863245 26147 slave.cpp:796] Agent terminating
[       OK ] Endpoint/SlaveEndpointTest.UnauthorizedRequest/0 (14 ms)
[ RUN      ] Endpoint/SlaveEndpointTest.UnauthorizedRequest/1
I1215 19:48:20.869945 26135 containerizer.cpp:220] Using isolation: posix/cpu,posix/mem,filesystem/posix,network/cni
W1215 19:48:20.870443 26135 backend.cpp:76] Failed to create 'aufs' backend: AufsBackend requires
root privileges, but is running as user mesos
W1215 19:48:20.870558 26135 backend.cpp:76] Failed to create 'bind' backend: BindBackend requires
root privileges
I1215 19:48:20.872352 26151 slave.cpp:209] Mesos agent started on (670)@172.17.0.3:38261
I1215 19:48:20.872380 26151 slave.cpp:210] Flags at startup: --acls="" --appc_simple_discovery_uri_prefix="http://"
--appc_store_dir="/tmp/mesos/store/appc" --authenticate_http_readonly="true" --authenticate_http_readwrite="true"
--authenticatee="crammd5" --authentication_backoff_factor="1secs" --authorizer="local" --cgroups_cpu_enable_pids_and_tids_count="false"
--cgroups_enable_cfs="false" --cgroups_hierarchy="/sys/fs/cgroup" --cgroups_limit_swap="false"
--cgroups_root="mesos" --container_disk_watch_interval="15secs" --containerizers="mesos" --credential="/tmp/Endpoint_SlaveEndpointTest_UnauthorizedRequest_1_PtCVRm/credential"
--default_role="*" --disk_watch_interval="1mins" --docker="docker" --docker_kill_orphans="true"
--docker_registry="https://registry-1.docker.io" --docker_remove_delay="6hrs" --docker_socket="/var/run/docker.sock"
--docker_stop_timeout="0ns" --docker_store_dir="/tmp/mesos/store/docker" --docker_volume_checkpoint_dir="/var/run/mesos/isolators/docker/volume"
--enforce_container_disk_quota="false" --executor_registration_timeout="1mins" --executor_shutdown_grace_period="5secs"
--fetcher_cache_dir="/tmp/Endpoint_SlaveEndpointTest_UnauthorizedRequest_1_PtCVRm/fetch" --fetcher_cache_size="2GB"
--frameworks_home="" --gc_delay="1weeks" --gc_disk_headroom="0.1" --hadoop_home="" --help="false"
--hostname_lookup="true" --http_authenticators="basic" --http_command_executor="false" --http_credentials="/tmp/Endpoint_SlaveEndpointTest_UnauthorizedRequest_1_PtCVRm/http_credentials"
--http_heartbeat_interval="30secs" --image_provisioner_backend="copy" --initialize_driver_logging="true"
--isolation="posix/cpu,posix/mem" --launcher="posix" --launcher_dir="/mesos/build/src" --logbufsecs="0"
--logging_level="INFO" --max_completed_executors_per_framework="150" --oversubscribed_resources_interval="15secs"
--perf_duration="10secs" --perf_interval="1mins" --qos_correction_interval_min="0ns" --quiet="false"
--recover="reconnect" --recovery_timeout="15mins" --registration_backoff_factor="10ms" --resources="cpus:2;gpus:0;mem:1024;disk:1024;ports:[31000-32000]"
--revocable_cpu_low_priority="true" --runtime_dir="/tmp/Endpoint_SlaveEndpointTest_UnauthorizedRequest_1_PtCVRm"
--sandbox_directory="/mnt/mesos/sandbox" --strict="true" --switch_user="true" --systemd_enable_support="true"
--systemd_runtime_directory="/run/systemd/system" --version="false" --work_dir="/tmp/Endpoint_SlaveEndpointTest_UnauthorizedRequest_1_vuzXWv"
I1215 19:48:20.872788 26151 credentials.hpp:86] Loading credential for authentication from
'/tmp/Endpoint_SlaveEndpointTest_UnauthorizedRequest_1_PtCVRm/credential'
I1215 19:48:20.872889 26151 slave.cpp:352] Agent using credential for: test-principal
I1215 19:48:20.872905 26151 credentials.hpp:37] Loading credentials for authentication from
'/tmp/Endpoint_SlaveEndpointTest_UnauthorizedRequest_1_PtCVRm/http_credentials'
I1215 19:48:20.873035 26151 http.cpp:922] Using default 'basic' HTTP authenticator for realm
'mesos-agent-readonly'
I1215 19:48:20.873087 26151 http.cpp:922] Using default 'basic' HTTP authenticator for realm
'mesos-agent-readwrite'
I1215 19:48:20.873559 26151 slave.cpp:539] Agent resources: cpus(*):2; mem(*):1024; disk(*):1024;
ports(*):[31000-32000]
I1215 19:48:20.873603 26151 slave.cpp:547] Agent attributes: [  ]
I1215 19:48:20.873610 26151 slave.cpp:552] Agent hostname: 2f17514ee6e7
I1215 19:48:20.874100 26145 state.cpp:57] Recovering state from '/tmp/Endpoint_SlaveEndpointTest_UnauthorizedRequest_1_vuzXWv/meta'
I1215 19:48:20.874264 26136 status_update_manager.cpp:203] Recovering status update manager
I1215 19:48:20.874404 26149 containerizer.cpp:594] Recovering containerizer
I1215 19:48:20.875071 26138 provisioner.cpp:253] Provisioner recovery complete
I1215 19:48:20.875356 26149 slave.cpp:5408] Finished recovery
I1215 19:48:20.875810 26149 slave.cpp:5582] Querying resource estimator for oversubscribable
resources
I1215 19:48:20.875951 26137 slave.cpp:5596] Received oversubscribable resources {} from the
resource estimator
I1215 19:48:20.876590 26148 process.cpp:3679] Handling HTTP event for process 'slave(670)'
with path: '/slave(670)/monitor/statistics.json'
I1215 19:48:20.877081 26137 http.cpp:874] Authorizing principal 'test-principal' to GET the
'/monitor/statistics.json' endpoint
I1215 19:48:20.878288 26145 slave.cpp:796] Agent terminating
[       OK ] Endpoint/SlaveEndpointTest.UnauthorizedRequest/1 (14 ms)
[ RUN      ] Endpoint/SlaveEndpointTest.UnauthorizedRequest/2
I1215 19:48:20.882802 26135 containerizer.cpp:220] Using isolation: posix/cpu,posix/mem,filesystem/posix,network/cni
W1215 19:48:20.883090 26135 backend.cpp:76] Failed to create 'aufs' backend: AufsBackend requires
root privileges, but is running as user mesos
W1215 19:48:20.883167 26135 backend.cpp:76] Failed to create 'bind' backend: BindBackend requires
root privileges
I1215 19:48:20.884093 26138 slave.cpp:209] Mesos agent started on (671)@172.17.0.3:38261
I1215 19:48:20.884109 26138 slave.cpp:210] Flags at startup: --acls="" --appc_simple_discovery_uri_prefix="http://"
--appc_store_dir="/tmp/mesos/store/appc" --authenticate_http_readonly="true" --authenticate_http_readwrite="true"
--authenticatee="crammd5" --authentication_backoff_factor="1secs" --authorizer="local" --cgroups_cpu_enable_pids_and_tids_count="false"
--cgroups_enable_cfs="false" --cgroups_hierarchy="/sys/fs/cgroup" --cgroups_limit_swap="false"
--cgroups_root="mesos" --container_disk_watch_interval="15secs" --containerizers="mesos" --credential="/tmp/Endpoint_SlaveEndpointTest_UnauthorizedRequest_2_PsusFM/credential"
--default_role="*" --disk_watch_interval="1mins" --docker="docker" --docker_kill_orphans="true"
--docker_registry="https://registry-1.docker.io" --docker_remove_delay="6hrs" --docker_socket="/var/run/docker.sock"
--docker_stop_timeout="0ns" --docker_store_dir="/tmp/mesos/store/docker" --docker_volume_checkpoint_dir="/var/run/mesos/isolators/docker/volume"
--enforce_container_disk_quota="false" --executor_registration_timeout="1mins" --executor_shutdown_grace_period="5secs"
--fetcher_cache_dir="/tmp/Endpoint_SlaveEndpointTest_UnauthorizedRequest_2_PsusFM/fetch" --fetcher_cache_size="2GB"
--frameworks_home="" --gc_delay="1weeks" --gc_disk_headroom="0.1" --hadoop_home="" --help="false"
--hostname_lookup="true" --http_authenticators="basic" --http_command_executor="false" --http_credentials="/tmp/Endpoint_SlaveEndpointTest_UnauthorizedRequest_2_PsusFM/http_credentials"
--http_heartbeat_interval="30secs" --image_provisioner_backend="copy" --initialize_driver_logging="true"
--isolation="posix/cpu,posix/mem" --launcher="posix" --launcher_dir="/mesos/build/src" --logbufsecs="0"
--logging_level="INFO" --max_completed_executors_per_framework="150" --oversubscribed_resources_interval="15secs"
--perf_duration="10secs" --perf_interval="1mins" --qos_correction_interval_min="0ns" --quiet="false"
--recover="reconnect" --recovery_timeout="15mins" --registration_backoff_factor="10ms" --resources="cpus:2;gpus:0;mem:1024;disk:1024;ports:[31000-32000]"
--revocable_cpu_low_priority="true" --runtime_dir="/tmp/Endpoint_SlaveEndpointTest_UnauthorizedRequest_2_PsusFM"
--sandbox_directory="/mnt/mesos/sandbox" --strict="true" --switch_user="true" --systemd_enable_support="true"
--systemd_runtime_directory="/run/systemd/system" --version="false" --work_dir="/tmp/Endpoint_SlaveEndpointTest_UnauthorizedRequest_2_sPciIV"
I1215 19:48:20.884598 26138 credentials.hpp:86] Loading credential for authentication from
'/tmp/Endpoint_SlaveEndpointTest_UnauthorizedRequest_2_PsusFM/credential'
I1215 19:48:20.884702 26138 slave.cpp:352] Agent using credential for: test-principal
I1215 19:48:20.884719 26138 credentials.hpp:37] Loading credentials for authentication from
'/tmp/Endpoint_SlaveEndpointTest_UnauthorizedRequest_2_PsusFM/http_credentials'
I1215 19:48:20.884855 26138 http.cpp:922] Using default 'basic' HTTP authenticator for realm
'mesos-agent-readonly'
I1215 19:48:20.884913 26138 http.cpp:922] Using default 'basic' HTTP authenticator for realm
'mesos-agent-readwrite'
I1215 19:48:20.885448 26138 slave.cpp:539] Agent resources: cpus(*):2; mem(*):1024; disk(*):1024;
ports(*):[31000-32000]
I1215 19:48:20.885499 26138 slave.cpp:547] Agent attributes: [  ]
I1215 19:48:20.885511 26138 slave.cpp:552] Agent hostname: 2f17514ee6e7
I1215 19:48:20.885956 26148 state.cpp:57] Recovering state from '/tmp/Endpoint_SlaveEndpointTest_UnauthorizedRequest_2_sPciIV/meta'
I1215 19:48:20.886071 26148 status_update_manager.cpp:203] Recovering status update manager
I1215 19:48:20.886198 26146 containerizer.cpp:594] Recovering containerizer
I1215 19:48:20.886725 26143 provisioner.cpp:253] Provisioner recovery complete
I1215 19:48:20.886961 26146 slave.cpp:5408] Finished recovery
I1215 19:48:20.887372 26146 slave.cpp:5582] Querying resource estimator for oversubscribable
resources
I1215 19:48:20.887651 26146 slave.cpp:5596] Received oversubscribable resources {} from the
resource estimator
I1215 19:48:20.888303 26136 process.cpp:3679] Handling HTTP event for process 'slave(671)'
with path: '/slave(671)/containers'
I1215 19:48:20.888754 26140 http.cpp:874] Authorizing principal 'test-principal' to GET the
'/containers' endpoint
I1215 19:48:20.890048 26135 slave.cpp:796] Agent terminating
[       OK ] Endpoint/SlaveEndpointTest.UnauthorizedRequest/2 (12 ms)
[ RUN      ] Endpoint/SlaveEndpointTest.NoAuthorizer/0
I1215 19:48:20.894928 26135 containerizer.cpp:220] Using isolation: posix/cpu,posix/mem,filesystem/posix,network/cni
W1215 19:48:20.895319 26135 backend.cpp:76] Failed to create 'aufs' backend: AufsBackend requires
root privileges, but is running as user mesos
W1215 19:48:20.895431 26135 backend.cpp:76] Failed to create 'bind' backend: BindBackend requires
root privileges
I1215 19:48:20.896051 26135 cluster.cpp:446] Creating default 'local' authorizer
I1215 19:48:20.896739 26146 slave.cpp:209] Mesos agent started on (672)@172.17.0.3:38261
I1215 19:48:20.896761 26146 slave.cpp:210] Flags at startup: --acls="" --appc_simple_discovery_uri_prefix="http://"
--appc_store_dir="/tmp/mesos/store/appc" --authenticate_http_readonly="true" --authenticate_http_readwrite="true"
--authenticatee="crammd5" --authentication_backoff_factor="1secs" --authorizer="local" --cgroups_cpu_enable_pids_and_tids_count="false"
--cgroups_enable_cfs="false" --cgroups_hierarchy="/sys/fs/cgroup" --cgroups_limit_swap="false"
--cgroups_root="mesos" --container_disk_watch_interval="15secs" --containerizers="mesos" --credential="/tmp/Endpoint_SlaveEndpointTest_NoAuthorizer_0_8pfBAc/credential"
--default_role="*" --disk_watch_interval="1mins" --docker="docker" --docker_kill_orphans="true"
--docker_registry="https://registry-1.docker.io" --docker_remove_delay="6hrs" --docker_socket="/var/run/docker.sock"
--docker_stop_timeout="0ns" --docker_store_dir="/tmp/mesos/store/docker" --docker_volume_checkpoint_dir="/var/run/mesos/isolators/docker/volume"
--enforce_container_disk_quota="false" --executor_registration_timeout="1mins" --executor_shutdown_grace_period="5secs"
--fetcher_cache_dir="/tmp/Endpoint_SlaveEndpointTest_NoAuthorizer_0_8pfBAc/fetch" --fetcher_cache_size="2GB"
--frameworks_home="" --gc_delay="1weeks" --gc_disk_headroom="0.1" --hadoop_home="" --help="false"
--hostname_lookup="true" --http_authenticators="basic" --http_command_executor="false" --http_credentials="/tmp/Endpoint_SlaveEndpointTest_NoAuthorizer_0_8pfBAc/http_credentials"
--http_heartbeat_interval="30secs" --image_provisioner_backend="copy" --initialize_driver_logging="true"
--isolation="posix/cpu,posix/mem" --launcher="posix" --launcher_dir="/mesos/build/src" --logbufsecs="0"
--logging_level="INFO" --max_completed_executors_per_framework="150" --oversubscribed_resources_interval="15secs"
--perf_duration="10secs" --perf_interval="1mins" --qos_correction_interval_min="0ns" --quiet="false"
--recover="reconnect" --recovery_timeout="15mins" --registration_backoff_factor="10ms" --resources="cpus:2;gpus:0;mem:1024;disk:1024;ports:[31000-32000]"
--revocable_cpu_low_priority="true" --runtime_dir="/tmp/Endpoint_SlaveEndpointTest_NoAuthorizer_0_8pfBAc"
--sandbox_directory="/mnt/mesos/sandbox" --strict="true" --switch_user="true" --systemd_enable_support="true"
--systemd_runtime_directory="/run/systemd/system" --version="false" --work_dir="/tmp/Endpoint_SlaveEndpointTest_NoAuthorizer_0_XWbwBl"
I1215 19:48:20.897217 26146 credentials.hpp:86] Loading credential for authentication from
'/tmp/Endpoint_SlaveEndpointTest_NoAuthorizer_0_8pfBAc/credential'
I1215 19:48:20.897325 26146 slave.cpp:352] Agent using credential for: test-principal
I1215 19:48:20.897338 26146 credentials.hpp:37] Loading credentials for authentication from
'/tmp/Endpoint_SlaveEndpointTest_NoAuthorizer_0_8pfBAc/http_credentials'
I1215 19:48:20.897450 26146 http.cpp:922] Using default 'basic' HTTP authenticator for realm
'mesos-agent-readonly'
I1215 19:48:20.897497 26146 http.cpp:922] Using default 'basic' HTTP authenticator for realm
'mesos-agent-readwrite'
I1215 19:48:20.897961 26146 slave.cpp:539] Agent resources: cpus(*):2; mem(*):1024; disk(*):1024;
ports(*):[31000-32000]
I1215 19:48:20.898005 26146 slave.cpp:547] Agent attributes: [  ]
I1215 19:48:20.898011 26146 slave.cpp:552] Agent hostname: 2f17514ee6e7
I1215 19:48:20.898495 26138 state.cpp:57] Recovering state from '/tmp/Endpoint_SlaveEndpointTest_NoAuthorizer_0_XWbwBl/meta'
I1215 19:48:20.898735 26151 status_update_manager.cpp:203] Recovering status update manager
I1215 19:48:20.898838 26149 containerizer.cpp:594] Recovering containerizer
I1215 19:48:20.899422 26150 provisioner.cpp:253] Provisioner recovery complete
I1215 19:48:20.899588 26148 slave.cpp:5408] Finished recovery
I1215 19:48:20.900081 26148 slave.cpp:5582] Querying resource estimator for oversubscribable
resources
I1215 19:48:20.900284 26139 slave.cpp:5596] Received oversubscribable resources {} from the
resource estimator
I1215 19:48:20.900996 26136 process.cpp:3679] Handling HTTP event for process 'slave(672)'
with path: '/slave(672)/monitor/statistics'
I1215 19:48:20.901473 26151 http.cpp:874] Authorizing principal 'test-principal' to GET the
'/monitor/statistics' endpoint
I1215 19:48:20.902931 26139 slave.cpp:796] Agent terminating
[       OK ] Endpoint/SlaveEndpointTest.NoAuthorizer/0 (13 ms)
[ RUN      ] Endpoint/SlaveEndpointTest.NoAuthorizer/1
I1215 19:48:20.908965 26135 containerizer.cpp:220] Using isolation: posix/cpu,posix/mem,filesystem/posix,network/cni
W1215 19:48:20.909363 26135 backend.cpp:76] Failed to create 'aufs' backend: AufsBackend requires
root privileges, but is running as user mesos
W1215 19:48:20.909466 26135 backend.cpp:76] Failed to create 'bind' backend: BindBackend requires
root privileges
I1215 19:48:20.910363 26135 cluster.cpp:446] Creating default 'local' authorizer
I1215 19:48:20.910915 26137 slave.cpp:209] Mesos agent started on (673)@172.17.0.3:38261
I1215 19:48:20.910933 26137 slave.cpp:210] Flags at startup: --acls="" --appc_simple_discovery_uri_prefix="http://"
--appc_store_dir="/tmp/mesos/store/appc" --authenticate_http_readonly="true" --authenticate_http_readwrite="true"
--authenticatee="crammd5" --authentication_backoff_factor="1secs" --authorizer="local" --cgroups_cpu_enable_pids_and_tids_count="false"
--cgroups_enable_cfs="false" --cgroups_hierarchy="/sys/fs/cgroup" --cgroups_limit_swap="false"
--cgroups_root="mesos" --container_disk_watch_interval="15secs" --containerizers="mesos" --credential="/tmp/Endpoint_SlaveEndpointTest_NoAuthorizer_1_QU6uEC/credential"
--default_role="*" --disk_watch_interval="1mins" --docker="docker" --docker_kill_orphans="true"
--docker_registry="https://registry-1.docker.io" --docker_remove_delay="6hrs" --docker_socket="/var/run/docker.sock"
--docker_stop_timeout="0ns" --docker_store_dir="/tmp/mesos/store/docker" --docker_volume_checkpoint_dir="/var/run/mesos/isolators/docker/volume"
--enforce_container_disk_quota="false" --executor_registration_timeout="1mins" --executor_shutdown_grace_period="5secs"
--fetcher_cache_dir="/tmp/Endpoint_SlaveEndpointTest_NoAuthorizer_1_QU6uEC/fetch" --fetcher_cache_size="2GB"
--frameworks_home="" --gc_delay="1weeks" --gc_disk_headroom="0.1" --hadoop_home="" --help="false"
--hostname_lookup="true" --http_authenticators="basic" --http_command_executor="false" --http_credentials="/tmp/Endpoint_SlaveEndpointTest_NoAuthorizer_1_QU6uEC/http_credentials"
--http_heartbeat_interval="30secs" --image_provisioner_backend="copy" --initialize_driver_logging="true"
--isolation="posix/cpu,posix/mem" --launcher="posix" --launcher_dir="/mesos/build/src" --logbufsecs="0"
--logging_level="INFO" --max_completed_executors_per_framework="150" --oversubscribed_resources_interval="15secs"
--perf_duration="10secs" --perf_interval="1mins" --qos_correction_interval_min="0ns" --quiet="false"
--recover="reconnect" --recovery_timeout="15mins" --registration_backoff_factor="10ms" --resources="cpus:2;gpus:0;mem:1024;disk:1024;ports:[31000-32000]"
--revocable_cpu_low_priority="true" --runtime_dir="/tmp/Endpoint_SlaveEndpointTest_NoAuthorizer_1_QU6uEC"
--sandbox_directory="/mnt/mesos/sandbox" --strict="true" --switch_user="true" --systemd_enable_support="true"
--systemd_runtime_directory="/run/systemd/system" --version="false" --work_dir="/tmp/Endpoint_SlaveEndpointTest_NoAuthorizer_1_7WYaDL"
I1215 19:48:20.911330 26137 credentials.hpp:86] Loading credential for authentication from
'/tmp/Endpoint_SlaveEndpointTest_NoAuthorizer_1_QU6uEC/credential'
I1215 19:48:20.911440 26137 slave.cpp:352] Agent using credential for: test-principal
I1215 19:48:20.911456 26137 credentials.hpp:37] Loading credentials for authentication from
'/tmp/Endpoint_SlaveEndpointTest_NoAuthorizer_1_QU6uEC/http_credentials'
I1215 19:48:20.911572 26137 http.cpp:922] Using default 'basic' HTTP authenticator for realm
'mesos-agent-readonly'
I1215 19:48:20.911628 26137 http.cpp:922] Using default 'basic' HTTP authenticator for realm
'mesos-agent-readwrite'
I1215 19:48:20.912006 26137 slave.cpp:539] Agent resources: cpus(*):2; mem(*):1024; disk(*):1024;
ports(*):[31000-32000]
I1215 19:48:20.912050 26137 slave.cpp:547] Agent attributes: [  ]
I1215 19:48:20.912060 26137 slave.cpp:552] Agent hostname: 2f17514ee6e7
I1215 19:48:20.912478 26148 state.cpp:57] Recovering state from '/tmp/Endpoint_SlaveEndpointTest_NoAuthorizer_1_7WYaDL/meta'
I1215 19:48:20.912747 26149 status_update_manager.cpp:203] Recovering status update manager
I1215 19:48:20.912837 26149 containerizer.cpp:594] Recovering containerizer
I1215 19:48:20.913446 26142 provisioner.cpp:253] Provisioner recovery complete
I1215 19:48:20.913673 26149 slave.cpp:5408] Finished recovery
I1215 19:48:20.914160 26149 slave.cpp:5582] Querying resource estimator for oversubscribable
resources
I1215 19:48:20.914283 26136 slave.cpp:5596] Received oversubscribable resources {} from the
resource estimator
I1215 19:48:20.914927 26139 process.cpp:3679] Handling HTTP event for process 'slave(673)'
with path: '/slave(673)/monitor/statistics.json'
I1215 19:48:20.915382 26149 http.cpp:874] Authorizing principal 'test-principal' to GET the
'/monitor/statistics.json' endpoint
I1215 19:48:20.916764 26137 slave.cpp:796] Agent terminating
[       OK ] Endpoint/SlaveEndpointTest.NoAuthorizer/1 (13 ms)
[ RUN      ] Endpoint/SlaveEndpointTest.NoAuthorizer/2
I1215 19:48:20.922791 26135 containerizer.cpp:220] Using isolation: posix/cpu,posix/mem,filesystem/posix,network/cni
W1215 19:48:20.923192 26135 backend.cpp:76] Failed to create 'aufs' backend: AufsBackend requires
root privileges, but is running as user mesos
W1215 19:48:20.923305 26135 backend.cpp:76] Failed to create 'bind' backend: BindBackend requires
root privileges
I1215 19:48:20.923921 26135 cluster.cpp:446] Creating default 'local' authorizer
I1215 19:48:20.924387 26144 slave.cpp:209] Mesos agent started on (674)@172.17.0.3:38261
I1215 19:48:20.924407 26144 slave.cpp:210] Flags at startup: --acls="" --appc_simple_discovery_uri_prefix="http://"
--appc_store_dir="/tmp/mesos/store/appc" --authenticate_http_readonly="true" --authenticate_http_readwrite="true"
--authenticatee="crammd5" --authentication_backoff_factor="1secs" --authorizer="local" --cgroups_cpu_enable_pids_and_tids_count="false"
--cgroups_enable_cfs="false" --cgroups_hierarchy="/sys/fs/cgroup" --cgroups_limit_swap="false"
--cgroups_root="mesos" --container_disk_watch_interval="15secs" --containerizers="mesos" --credential="/tmp/Endpoint_SlaveEndpointTest_NoAuthorizer_2_x0yqR2/credential"
--default_role="*" --disk_watch_interval="1mins" --docker="docker" --docker_kill_orphans="true"
--docker_registry="https://registry-1.docker.io" --docker_remove_delay="6hrs" --docker_socket="/var/run/docker.sock"
--docker_stop_timeout="0ns" --docker_store_dir="/tmp/mesos/store/docker" --docker_volume_checkpoint_dir="/var/run/mesos/isolators/docker/volume"
--enforce_container_disk_quota="false" --executor_registration_timeout="1mins" --executor_shutdown_grace_period="5secs"
--fetcher_cache_dir="/tmp/Endpoint_SlaveEndpointTest_NoAuthorizer_2_x0yqR2/fetch" --fetcher_cache_size="2GB"
--frameworks_home="" --gc_delay="1weeks" --gc_disk_headroom="0.1" --hadoop_home="" --help="false"
--hostname_lookup="true" --http_authenticators="basic" --http_command_executor="false" --http_credentials="/tmp/Endpoint_SlaveEndpointTest_NoAuthorizer_2_x0yqR2/http_credentials"
--http_heartbeat_interval="30secs" --image_provisioner_backend="copy" --initialize_driver_logging="true"
--isolation="posix/cpu,posix/mem" --launcher="posix" --launcher_dir="/mesos/build/src" --logbufsecs="0"
--logging_level="INFO" --max_completed_executors_per_framework="150" --oversubscribed_resources_interval="15secs"
--perf_duration="10secs" --perf_interval="1mins" --qos_correction_interval_min="0ns" --quiet="false"
--recover="reconnect" --recovery_timeout="15mins" --registration_backoff_factor="10ms" --resources="cpus:2;gpus:0;mem:1024;disk:1024;ports:[31000-32000]"
--revocable_cpu_low_priority="true" --runtime_dir="/tmp/Endpoint_SlaveEndpointTest_NoAuthorizer_2_x0yqR2"
--sandbox_directory="/mnt/mesos/sandbox" --strict="true" --switch_user="true" --systemd_enable_support="true"
--systemd_runtime_directory="/run/systemd/system" --version="false" --work_dir="/tmp/Endpoint_SlaveEndpointTest_NoAuthorizer_2_WJlRNb"
I1215 19:48:20.924793 26144 credentials.hpp:86] Loading credential for authentication from
'/tmp/Endpoint_SlaveEndpointTest_NoAuthorizer_2_x0yqR2/credential'
I1215 19:48:20.924883 26144 slave.cpp:352] Agent using credential for: test-principal
I1215 19:48:20.924897 26144 credentials.hpp:37] Loading credentials for authentication from
'/tmp/Endpoint_SlaveEndpointTest_NoAuthorizer_2_x0yqR2/http_credentials'
I1215 19:48:20.925026 26144 http.cpp:922] Using default 'basic' HTTP authenticator for realm
'mesos-agent-readonly'
I1215 19:48:20.925073 26144 http.cpp:922] Using default 'basic' HTTP authenticator for realm
'mesos-agent-readwrite'
I1215 19:48:20.925478 26144 slave.cpp:539] Agent resources: cpus(*):2; mem(*):1024; disk(*):1024;
ports(*):[31000-32000]
I1215 19:48:20.925513 26144 slave.cpp:547] Agent attributes: [  ]
I1215 19:48:20.925519 26144 slave.cpp:552] Agent hostname: 2f17514ee6e7
I1215 19:48:20.925917 26138 state.cpp:57] Recovering state from '/tmp/Endpoint_SlaveEndpointTest_NoAuthorizer_2_WJlRNb/meta'
I1215 19:48:20.926115 26138 status_update_manager.cpp:203] Recovering status update manager
I1215 19:48:20.926232 26140 containerizer.cpp:594] Recovering containerizer
I1215 19:48:20.926724 26149 provisioner.cpp:253] Provisioner recovery complete
I1215 19:48:20.926898 26147 slave.cpp:5408] Finished recovery
I1215 19:48:20.927256 26147 slave.cpp:5582] Querying resource estimator for oversubscribable
resources
I1215 19:48:20.927454 26144 slave.cpp:5596] Received oversubscribable resources {} from the
resource estimator
I1215 19:48:20.928005 26151 process.cpp:3679] Handling HTTP event for process 'slave(674)'
with path: '/slave(674)/containers'
I1215 19:48:20.928441 26140 http.cpp:874] Authorizing principal 'test-principal' to GET the
'/containers' endpoint
I1215 19:48:20.929675 26144 slave.cpp:796] Agent terminating
[       OK ] Endpoint/SlaveEndpointTest.NoAuthorizer/2 (11 ms)
[----------] 9 tests from Endpoint/SlaveEndpointTest (126 ms total)

[----------] Global test environment tear-down
[==========] 1390 tests from 158 test cases ran. (180909 ms total)
[  PASSED  ] 1389 tests.
[  FAILED  ] 1 test, listed below:
[  FAILED  ] IOSwitchboardTest.KillSwitchboardContainerDestroyed

 1 FAILED TEST
  YOU HAVE 9 DISABLED TESTS

Inconsistency detected by ld.so: dl-close.c: 762: _dl_close: Assertion `map->l_init_called'
failed!
make[3]: *** [CMakeFiles/check] Error 127
make[3]: Leaving directory `/mesos/build'
make[2]: *** [CMakeFiles/check.dir/all] Error 2
make[2]: Leaving directory `/mesos/build'
make[1]: *** [CMakeFiles/check.dir/rule] Error 2
make[1]: Leaving directory `/mesos/build'
make: *** [check] Error 2
+ docker rmi mesos-1481828531-29263
Untagged: mesos-1481828531-29263:latest
Deleted: sha256:60988c61bed28f32788883ae5491c2c3a5bd1780bf02ee0826d1dc7e89b07e11
Deleted: sha256:9627bef9659b846156a7fbe48ae06b6a739a666ce25191437abe990963ab0dc1
Deleted: sha256:202fcbe3eb126b02ab05cba40a55a144372596b214d85350c7d733d8041701bd
Deleted: sha256:77b557ddc365915dd8a2d19eed9f22532252abf81c13f2f278ce03e0be205eec
Deleted: sha256:9a2d6a225f94ac01dd3c3b43fcdd58d81ed9bbe1613a332a09b8b1320a245060
Deleted: sha256:295bd43aca38db554845a18f31644bc55a674b020bf1f3ab21b7ef9d6a6e27a0
Deleted: sha256:630bcd5ea75652ad11c93a161dd43ffc77299aad1ad3ffe0d7d540e5b6cdfa89
Deleted: sha256:b2ef9c9f61946db10214d8f043bc24337b0a055da1ce3804f00179b1904cb70c
Deleted: sha256:cdd49bdc4516eafc201bcdbf22142a7f52f8c8382946c894e38a8d884c05bc43
Deleted: sha256:14d41554f68a4bce9c6424538596e31d8aa1e9cbe11d41d6cc565c3ccafa95c9
Deleted: sha256:3739425d8fd51e852a0996b8e50b3a84e8c49d6a5f4de9554f40a3a1f903e6dc
Deleted: sha256:21fd413d3faf55cb50e4b0b47b1a5f7e6d1f7ebf79e8570df41c0a2c4848f681
Deleted: sha256:91a49378df6fd00bb0aad79d100bd51994c69d503b40fd0468e7956eaebb5cfe
Deleted: sha256:a9b803384b62a999837df7a07a15920093142aca7385c7bc1edb17e4263cb94a
Deleted: sha256:5a19e7e008312725fc5bbbed7211dd6a0b1a6ae40b2f44b57bab3a5d94d2573b
Deleted: sha256:ad4aaedb047f2085507bb6ebb730820561c144d9208db9fdc937f5d4b3417d88
Deleted: sha256:6e0e99d71a2daa4810664a9e75985b44a62842ca930d6e3d362224fde39cb6e1
Deleted: sha256:be0d34ea06f918733a71499e68ad672f95625656115139424d4b190edb58f5ed
Deleted: sha256:123a317e5348c7b59f13ed2086635d0391e2490b4d0083dd1b9ed8bcf494264c
Deleted: sha256:1830d91533180d819cb9a33802bc64d720e2bb8ba11edc4bd438dad7a5b0f946
Deleted: sha256:5ee5f9548ba4328ae817fe95742beeb51c76549a034e6157bf3d14ee733d12d2
Deleted: sha256:c179b877a44c7d1ef984955e6924e3b710bb9efc2dd515fedab7e111cc2017ca
Deleted: sha256:d33169967456ff4cb7bc6ea806cd6803004ef3a58e32dd72e830d95f69f255a0
Deleted: sha256:95d99a29ccd079fbe983d06a55d253b4c02e32109b6b5b8c837312222f0fa72a
Build step 'Execute shell' marked build as failure

Mime
View raw message