mesos-builds mailing list archives

Site index · List index
Message view « Date » · « Thread »
Top « Date » · « Thread »
From Apache Jenkins Server <jenk...@builds.apache.org>
Subject Build failed in Jenkins: Mesos » cmake,gcc,--verbose --enable-libevent --enable-ssl,GLOG_v=1 MESOS_VERBOSE=1,ubuntu:14.04,(docker||Hadoop)&&(!ubuntu-us1)&&(!ubuntu-6)&&(!ubuntu-eu2) #3040
Date Fri, 16 Dec 2016 01:47:14 GMT
See <https://builds.apache.org/job/Mesos/BUILDTOOL=cmake,COMPILER=gcc,CONFIGURATION=--verbose%20--enable-libevent%20--enable-ssl,ENVIRONMENT=GLOG_v=1%20MESOS_VERBOSE=1,OS=ubuntu%3A14.04,label_exp=(docker%7C%7CHadoop)&&(!ubuntu-us1)&&(!ubuntu-6)&&(!ubuntu-eu2)/3040/changes>

Changes:

[mpark] Specified that we search for the query parameter in the request body.

[josephwu] Fixed builds with HAS_AUTHENTICATION=false.

[josephwu] Windows: Added `recordio_tests.cpp` to test build.

[josephwu] Windows: Added Mesos tests to the build helper.

[josephwu] Windows: Disambiguated `os::write` by adding another overload.

------------------------------------------
[...truncated 175110 lines...]
[ RUN      ] Endpoint/SlaveEndpointTest.AuthorizedRequest/1
I1216 01:46:18.173882 27005 containerizer.cpp:220] Using isolation: posix/cpu,posix/mem,filesystem/posix,network/cni
W1216 01:46:18.174212 27005 backend.cpp:76] Failed to create 'aufs' backend: AufsBackend requires
root privileges, but is running as user mesos
W1216 01:46:18.174289 27005 backend.cpp:76] Failed to create 'bind' backend: BindBackend requires
root privileges
I1216 01:46:18.176000 27007 slave.cpp:209] Mesos agent started on (667)@172.17.0.2:45028
I1216 01:46:18.176026 27007 slave.cpp:210] Flags at startup: --acls="" --appc_simple_discovery_uri_prefix="http://"
--appc_store_dir="/tmp/mesos/store/appc" --authenticate_http_readonly="true" --authenticate_http_readwrite="true"
--authenticatee="crammd5" --authentication_backoff_factor="1secs" --authorizer="local" --cgroups_cpu_enable_pids_and_tids_count="false"
--cgroups_enable_cfs="false" --cgroups_hierarchy="/sys/fs/cgroup" --cgroups_limit_swap="false"
--cgroups_root="mesos" --container_disk_watch_interval="15secs" --containerizers="mesos" --credential="/tmp/Endpoint_SlaveEndpointTest_AuthorizedRequest_1_2g4zne/credential"
--default_role="*" --disk_watch_interval="1mins" --docker="docker" --docker_kill_orphans="true"
--docker_registry="https://registry-1.docker.io" --docker_remove_delay="6hrs" --docker_socket="/var/run/docker.sock"
--docker_stop_timeout="0ns" --docker_store_dir="/tmp/mesos/store/docker" --docker_volume_checkpoint_dir="/var/run/mesos/isolators/docker/volume"
--enforce_container_disk_quota="false" --executor_registration_timeout="1mins" --executor_shutdown_grace_period="5secs"
--fetcher_cache_dir="/tmp/Endpoint_SlaveEndpointTest_AuthorizedRequest_1_2g4zne/fetch" --fetcher_cache_size="2GB"
--frameworks_home="" --gc_delay="1weeks" --gc_disk_headroom="0.1" --hadoop_home="" --help="false"
--hostname_lookup="true" --http_authenticators="basic" --http_command_executor="false" --http_credentials="/tmp/Endpoint_SlaveEndpointTest_AuthorizedRequest_1_2g4zne/http_credentials"
--http_heartbeat_interval="30secs" --image_provisioner_backend="copy" --initialize_driver_logging="true"
--isolation="posix/cpu,posix/mem" --launcher="posix" --launcher_dir="/mesos/build/src" --logbufsecs="0"
--logging_level="INFO" --max_completed_executors_per_framework="150" --oversubscribed_resources_interval="15secs"
--perf_duration="10secs" --perf_interval="1mins" --qos_correction_interval_min="0ns" --quiet="false"
--recover="reconnect" --recovery_timeout="15mins" --registration_backoff_factor="10ms" --resources="cpus:2;gpus:0;mem:1024;disk:1024;ports:[31000-32000]"
--revocable_cpu_low_priority="true" --runtime_dir="/tmp/Endpoint_SlaveEndpointTest_AuthorizedRequest_1_2g4zne"
--sandbox_directory="/mnt/mesos/sandbox" --strict="true" --switch_user="true" --systemd_enable_support="true"
--systemd_runtime_directory="/run/systemd/system" --version="false" --work_dir="/tmp/Endpoint_SlaveEndpointTest_AuthorizedRequest_1_3xdgHh"
I1216 01:46:18.176429 27007 credentials.hpp:86] Loading credential for authentication from
'/tmp/Endpoint_SlaveEndpointTest_AuthorizedRequest_1_2g4zne/credential'
I1216 01:46:18.176553 27007 slave.cpp:352] Agent using credential for: test-principal
I1216 01:46:18.176571 27007 credentials.hpp:37] Loading credentials for authentication from
'/tmp/Endpoint_SlaveEndpointTest_AuthorizedRequest_1_2g4zne/http_credentials'
I1216 01:46:18.176704 27007 http.cpp:922] Using default 'basic' HTTP authenticator for realm
'mesos-agent-readonly'
I1216 01:46:18.176769 27007 http.cpp:922] Using default 'basic' HTTP authenticator for realm
'mesos-agent-readwrite'
I1216 01:46:18.177224 27007 slave.cpp:539] Agent resources: cpus(*):2; mem(*):1024; disk(*):1024;
ports(*):[31000-32000]
I1216 01:46:18.177269 27007 slave.cpp:547] Agent attributes: [  ]
I1216 01:46:18.177283 27007 slave.cpp:552] Agent hostname: 7bd114cdc5d6
I1216 01:46:18.177788 27018 state.cpp:57] Recovering state from '/tmp/Endpoint_SlaveEndpointTest_AuthorizedRequest_1_3xdgHh/meta'
I1216 01:46:18.177974 27009 status_update_manager.cpp:203] Recovering status update manager
I1216 01:46:18.178100 27017 containerizer.cpp:594] Recovering containerizer
I1216 01:46:18.178716 27008 provisioner.cpp:253] Provisioner recovery complete
I1216 01:46:18.178927 27019 slave.cpp:5408] Finished recovery
I1216 01:46:18.179368 27019 slave.cpp:5582] Querying resource estimator for oversubscribable
resources
I1216 01:46:18.179505 27010 slave.cpp:5596] Received oversubscribable resources {} from the
resource estimator
I1216 01:46:18.180205 27018 process.cpp:3679] Handling HTTP event for process 'slave(667)'
with path: '/slave(667)/monitor/statistics.json'
I1216 01:46:18.180714 27008 http.cpp:874] Authorizing principal 'test-principal' to GET the
'/monitor/statistics.json' endpoint
I1216 01:46:18.182301 27005 slave.cpp:796] Agent terminating
[       OK ] Endpoint/SlaveEndpointTest.AuthorizedRequest/1 (13 ms)
[ RUN      ] Endpoint/SlaveEndpointTest.AuthorizedRequest/2
I1216 01:46:18.188114 27005 containerizer.cpp:220] Using isolation: posix/cpu,posix/mem,filesystem/posix,network/cni
W1216 01:46:18.188521 27005 backend.cpp:76] Failed to create 'aufs' backend: AufsBackend requires
root privileges, but is running as user mesos
W1216 01:46:18.188621 27005 backend.cpp:76] Failed to create 'bind' backend: BindBackend requires
root privileges
I1216 01:46:18.189792 27019 slave.cpp:209] Mesos agent started on (668)@172.17.0.2:45028
I1216 01:46:18.189815 27019 slave.cpp:210] Flags at startup: --acls="" --appc_simple_discovery_uri_prefix="http://"
--appc_store_dir="/tmp/mesos/store/appc" --authenticate_http_readonly="true" --authenticate_http_readwrite="true"
--authenticatee="crammd5" --authentication_backoff_factor="1secs" --authorizer="local" --cgroups_cpu_enable_pids_and_tids_count="false"
--cgroups_enable_cfs="false" --cgroups_hierarchy="/sys/fs/cgroup" --cgroups_limit_swap="false"
--cgroups_root="mesos" --container_disk_watch_interval="15secs" --containerizers="mesos" --credential="/tmp/Endpoint_SlaveEndpointTest_AuthorizedRequest_2_YLzye1/credential"
--default_role="*" --disk_watch_interval="1mins" --docker="docker" --docker_kill_orphans="true"
--docker_registry="https://registry-1.docker.io" --docker_remove_delay="6hrs" --docker_socket="/var/run/docker.sock"
--docker_stop_timeout="0ns" --docker_store_dir="/tmp/mesos/store/docker" --docker_volume_checkpoint_dir="/var/run/mesos/isolators/docker/volume"
--enforce_container_disk_quota="false" --executor_registration_timeout="1mins" --executor_shutdown_grace_period="5secs"
--fetcher_cache_dir="/tmp/Endpoint_SlaveEndpointTest_AuthorizedRequest_2_YLzye1/fetch" --fetcher_cache_size="2GB"
--frameworks_home="" --gc_delay="1weeks" --gc_disk_headroom="0.1" --hadoop_home="" --help="false"
--hostname_lookup="true" --http_authenticators="basic" --http_command_executor="false" --http_credentials="/tmp/Endpoint_SlaveEndpointTest_AuthorizedRequest_2_YLzye1/http_credentials"
--http_heartbeat_interval="30secs" --image_provisioner_backend="copy" --initialize_driver_logging="true"
--isolation="posix/cpu,posix/mem" --launcher="posix" --launcher_dir="/mesos/build/src" --logbufsecs="0"
--logging_level="INFO" --max_completed_executors_per_framework="150" --oversubscribed_resources_interval="15secs"
--perf_duration="10secs" --perf_interval="1mins" --qos_correction_interval_min="0ns" --quiet="false"
--recover="reconnect" --recovery_timeout="15mins" --registration_backoff_factor="10ms" --resources="cpus:2;gpus:0;mem:1024;disk:1024;ports:[31000-32000]"
--revocable_cpu_low_priority="true" --runtime_dir="/tmp/Endpoint_SlaveEndpointTest_AuthorizedRequest_2_YLzye1"
--sandbox_directory="/mnt/mesos/sandbox" --strict="true" --switch_user="true" --systemd_enable_support="true"
--systemd_runtime_directory="/run/systemd/system" --version="false" --work_dir="/tmp/Endpoint_SlaveEndpointTest_AuthorizedRequest_2_BfqXv4"
I1216 01:46:18.190274 27019 credentials.hpp:86] Loading credential for authentication from
'/tmp/Endpoint_SlaveEndpointTest_AuthorizedRequest_2_YLzye1/credential'
I1216 01:46:18.190379 27019 slave.cpp:352] Agent using credential for: test-principal
I1216 01:46:18.190397 27019 credentials.hpp:37] Loading credentials for authentication from
'/tmp/Endpoint_SlaveEndpointTest_AuthorizedRequest_2_YLzye1/http_credentials'
I1216 01:46:18.190521 27019 http.cpp:922] Using default 'basic' HTTP authenticator for realm
'mesos-agent-readonly'
I1216 01:46:18.190582 27019 http.cpp:922] Using default 'basic' HTTP authenticator for realm
'mesos-agent-readwrite'
I1216 01:46:18.191123 27019 slave.cpp:539] Agent resources: cpus(*):2; mem(*):1024; disk(*):1024;
ports(*):[31000-32000]
I1216 01:46:18.191167 27019 slave.cpp:547] Agent attributes: [  ]
I1216 01:46:18.191181 27019 slave.cpp:552] Agent hostname: 7bd114cdc5d6
I1216 01:46:18.191640 27016 state.cpp:57] Recovering state from '/tmp/Endpoint_SlaveEndpointTest_AuthorizedRequest_2_BfqXv4/meta'
I1216 01:46:18.191886 27021 status_update_manager.cpp:203] Recovering status update manager
I1216 01:46:18.192484 27009 containerizer.cpp:594] Recovering containerizer
I1216 01:46:18.193111 27021 provisioner.cpp:253] Provisioner recovery complete
I1216 01:46:18.193311 27015 slave.cpp:5408] Finished recovery
I1216 01:46:18.193646 27015 slave.cpp:5582] Querying resource estimator for oversubscribable
resources
I1216 01:46:18.193761 27012 slave.cpp:5596] Received oversubscribable resources {} from the
resource estimator
I1216 01:46:18.194388 27017 process.cpp:3679] Handling HTTP event for process 'slave(668)'
with path: '/slave(668)/containers'
I1216 01:46:18.194766 27012 http.cpp:874] Authorizing principal 'test-principal' to GET the
'/containers' endpoint
I1216 01:46:18.196009 27013 slave.cpp:796] Agent terminating
[       OK ] Endpoint/SlaveEndpointTest.AuthorizedRequest/2 (13 ms)
[ RUN      ] Endpoint/SlaveEndpointTest.UnauthorizedRequest/0
I1216 01:46:18.206399 27005 containerizer.cpp:220] Using isolation: posix/cpu,posix/mem,filesystem/posix,network/cni
W1216 01:46:18.206703 27005 backend.cpp:76] Failed to create 'aufs' backend: AufsBackend requires
root privileges, but is running as user mesos
W1216 01:46:18.206773 27005 backend.cpp:76] Failed to create 'bind' backend: BindBackend requires
root privileges
I1216 01:46:18.207808 27020 slave.cpp:209] Mesos agent started on (669)@172.17.0.2:45028
I1216 01:46:18.207839 27020 slave.cpp:210] Flags at startup: --acls="" --appc_simple_discovery_uri_prefix="http://"
--appc_store_dir="/tmp/mesos/store/appc" --authenticate_http_readonly="true" --authenticate_http_readwrite="true"
--authenticatee="crammd5" --authentication_backoff_factor="1secs" --authorizer="local" --cgroups_cpu_enable_pids_and_tids_count="false"
--cgroups_enable_cfs="false" --cgroups_hierarchy="/sys/fs/cgroup" --cgroups_limit_swap="false"
--cgroups_root="mesos" --container_disk_watch_interval="15secs" --containerizers="mesos" --credential="/tmp/Endpoint_SlaveEndpointTest_UnauthorizedRequest_0_SnEWgO/credential"
--default_role="*" --disk_watch_interval="1mins" --docker="docker" --docker_kill_orphans="true"
--docker_registry="https://registry-1.docker.io" --docker_remove_delay="6hrs" --docker_socket="/var/run/docker.sock"
--docker_stop_timeout="0ns" --docker_store_dir="/tmp/mesos/store/docker" --docker_volume_checkpoint_dir="/var/run/mesos/isolators/docker/volume"
--enforce_container_disk_quota="false" --executor_registration_timeout="1mins" --executor_shutdown_grace_period="5secs"
--fetcher_cache_dir="/tmp/Endpoint_SlaveEndpointTest_UnauthorizedRequest_0_SnEWgO/fetch" --fetcher_cache_size="2GB"
--frameworks_home="" --gc_delay="1weeks" --gc_disk_headroom="0.1" --hadoop_home="" --help="false"
--hostname_lookup="true" --http_authenticators="basic" --http_command_executor="false" --http_credentials="/tmp/Endpoint_SlaveEndpointTest_UnauthorizedRequest_0_SnEWgO/http_credentials"
--http_heartbeat_interval="30secs" --image_provisioner_backend="copy" --initialize_driver_logging="true"
--isolation="posix/cpu,posix/mem" --launcher="posix" --launcher_dir="/mesos/build/src" --logbufsecs="0"
--logging_level="INFO" --max_completed_executors_per_framework="150" --oversubscribed_resources_interval="15secs"
--perf_duration="10secs" --perf_interval="1mins" --qos_correction_interval_min="0ns" --quiet="false"
--recover="reconnect" --recovery_timeout="15mins" --registration_backoff_factor="10ms" --resources="cpus:2;gpus:0;mem:1024;disk:1024;ports:[31000-32000]"
--revocable_cpu_low_priority="true" --runtime_dir="/tmp/Endpoint_SlaveEndpointTest_UnauthorizedRequest_0_SnEWgO"
--sandbox_directory="/mnt/mesos/sandbox" --strict="true" --switch_user="true" --systemd_enable_support="true"
--systemd_runtime_directory="/run/systemd/system" --version="false" --work_dir="/tmp/Endpoint_SlaveEndpointTest_UnauthorizedRequest_0_brBkvR"
I1216 01:46:18.208189 27020 credentials.hpp:86] Loading credential for authentication from
'/tmp/Endpoint_SlaveEndpointTest_UnauthorizedRequest_0_SnEWgO/credential'
I1216 01:46:18.208287 27020 slave.cpp:352] Agent using credential for: test-principal
I1216 01:46:18.208302 27020 credentials.hpp:37] Loading credentials for authentication from
'/tmp/Endpoint_SlaveEndpointTest_UnauthorizedRequest_0_SnEWgO/http_credentials'
I1216 01:46:18.208407 27020 http.cpp:922] Using default 'basic' HTTP authenticator for realm
'mesos-agent-readonly'
I1216 01:46:18.208464 27020 http.cpp:922] Using default 'basic' HTTP authenticator for realm
'mesos-agent-readwrite'
I1216 01:46:18.208843 27020 slave.cpp:539] Agent resources: cpus(*):2; mem(*):1024; disk(*):1024;
ports(*):[31000-32000]
I1216 01:46:18.208881 27020 slave.cpp:547] Agent attributes: [  ]
I1216 01:46:18.208889 27020 slave.cpp:552] Agent hostname: 7bd114cdc5d6
I1216 01:46:18.209270 27011 state.cpp:57] Recovering state from '/tmp/Endpoint_SlaveEndpointTest_UnauthorizedRequest_0_brBkvR/meta'
I1216 01:46:18.209484 27016 status_update_manager.cpp:203] Recovering status update manager
I1216 01:46:18.209656 27010 containerizer.cpp:594] Recovering containerizer
I1216 01:46:18.210199 27009 provisioner.cpp:253] Provisioner recovery complete
I1216 01:46:18.210409 27014 slave.cpp:5408] Finished recovery
I1216 01:46:18.210850 27014 slave.cpp:5582] Querying resource estimator for oversubscribable
resources
I1216 01:46:18.210973 27006 slave.cpp:5596] Received oversubscribable resources {} from the
resource estimator
I1216 01:46:18.211563 27007 process.cpp:3679] Handling HTTP event for process 'slave(669)'
with path: '/slave(669)/monitor/statistics'
I1216 01:46:18.212116 27015 http.cpp:874] Authorizing principal 'test-principal' to GET the
'/monitor/statistics' endpoint
I1216 01:46:18.213253 27012 slave.cpp:796] Agent terminating
[       OK ] Endpoint/SlaveEndpointTest.UnauthorizedRequest/0 (11 ms)
[ RUN      ] Endpoint/SlaveEndpointTest.UnauthorizedRequest/1
I1216 01:46:18.222265 27005 containerizer.cpp:220] Using isolation: posix/cpu,posix/mem,filesystem/posix,network/cni
W1216 01:46:18.222600 27005 backend.cpp:76] Failed to create 'aufs' backend: AufsBackend requires
root privileges, but is running as user mesos
W1216 01:46:18.222694 27005 backend.cpp:76] Failed to create 'bind' backend: BindBackend requires
root privileges
I1216 01:46:18.223906 27011 slave.cpp:209] Mesos agent started on (670)@172.17.0.2:45028
I1216 01:46:18.223958 27011 slave.cpp:210] Flags at startup: --acls="" --appc_simple_discovery_uri_prefix="http://"
--appc_store_dir="/tmp/mesos/store/appc" --authenticate_http_readonly="true" --authenticate_http_readwrite="true"
--authenticatee="crammd5" --authentication_backoff_factor="1secs" --authorizer="local" --cgroups_cpu_enable_pids_and_tids_count="false"
--cgroups_enable_cfs="false" --cgroups_hierarchy="/sys/fs/cgroup" --cgroups_limit_swap="false"
--cgroups_root="mesos" --container_disk_watch_interval="15secs" --containerizers="mesos" --credential="/tmp/Endpoint_SlaveEndpointTest_UnauthorizedRequest_1_J6lLtB/credential"
--default_role="*" --disk_watch_interval="1mins" --docker="docker" --docker_kill_orphans="true"
--docker_registry="https://registry-1.docker.io" --docker_remove_delay="6hrs" --docker_socket="/var/run/docker.sock"
--docker_stop_timeout="0ns" --docker_store_dir="/tmp/mesos/store/docker" --docker_volume_checkpoint_dir="/var/run/mesos/isolators/docker/volume"
--enforce_container_disk_quota="false" --executor_registration_timeout="1mins" --executor_shutdown_grace_period="5secs"
--fetcher_cache_dir="/tmp/Endpoint_SlaveEndpointTest_UnauthorizedRequest_1_J6lLtB/fetch" --fetcher_cache_size="2GB"
--frameworks_home="" --gc_delay="1weeks" --gc_disk_headroom="0.1" --hadoop_home="" --help="false"
--hostname_lookup="true" --http_authenticators="basic" --http_command_executor="false" --http_credentials="/tmp/Endpoint_SlaveEndpointTest_UnauthorizedRequest_1_J6lLtB/http_credentials"
--http_heartbeat_interval="30secs" --image_provisioner_backend="copy" --initialize_driver_logging="true"
--isolation="posix/cpu,posix/mem" --launcher="posix" --launcher_dir="/mesos/build/src" --logbufsecs="0"
--logging_level="INFO" --max_completed_executors_per_framework="150" --oversubscribed_resources_interval="15secs"
--perf_duration="10secs" --perf_interval="1mins" --qos_correction_interval_min="0ns" --quiet="false"
--recover="reconnect" --recovery_timeout="15mins" --registration_backoff_factor="10ms" --resources="cpus:2;gpus:0;mem:1024;disk:1024;ports:[31000-32000]"
--revocable_cpu_low_priority="true" --runtime_dir="/tmp/Endpoint_SlaveEndpointTest_UnauthorizedRequest_1_J6lLtB"
--sandbox_directory="/mnt/mesos/sandbox" --strict="true" --switch_user="true" --systemd_enable_support="true"
--systemd_runtime_directory="/run/systemd/system" --version="false" --work_dir="/tmp/Endpoint_SlaveEndpointTest_UnauthorizedRequest_1_F7dBFE"
I1216 01:46:18.224467 27011 credentials.hpp:86] Loading credential for authentication from
'/tmp/Endpoint_SlaveEndpointTest_UnauthorizedRequest_1_J6lLtB/credential'
I1216 01:46:18.224611 27011 slave.cpp:352] Agent using credential for: test-principal
I1216 01:46:18.224625 27011 credentials.hpp:37] Loading credentials for authentication from
'/tmp/Endpoint_SlaveEndpointTest_UnauthorizedRequest_1_J6lLtB/http_credentials'
I1216 01:46:18.224728 27011 http.cpp:922] Using default 'basic' HTTP authenticator for realm
'mesos-agent-readonly'
I1216 01:46:18.224788 27011 http.cpp:922] Using default 'basic' HTTP authenticator for realm
'mesos-agent-readwrite'
I1216 01:46:18.225178 27011 slave.cpp:539] Agent resources: cpus(*):2; mem(*):1024; disk(*):1024;
ports(*):[31000-32000]
I1216 01:46:18.225220 27011 slave.cpp:547] Agent attributes: [  ]
I1216 01:46:18.225231 27011 slave.cpp:552] Agent hostname: 7bd114cdc5d6
I1216 01:46:18.225682 27018 state.cpp:57] Recovering state from '/tmp/Endpoint_SlaveEndpointTest_UnauthorizedRequest_1_F7dBFE/meta'
I1216 01:46:18.225886 27014 status_update_manager.cpp:203] Recovering status update manager
I1216 01:46:18.226023 27020 containerizer.cpp:594] Recovering containerizer
I1216 01:46:18.226657 27017 provisioner.cpp:253] Provisioner recovery complete
I1216 01:46:18.226850 27016 slave.cpp:5408] Finished recovery
I1216 01:46:18.227201 27016 slave.cpp:5582] Querying resource estimator for oversubscribable
resources
I1216 01:46:18.227303 27019 slave.cpp:5596] Received oversubscribable resources {} from the
resource estimator
I1216 01:46:18.228042 27017 process.cpp:3679] Handling HTTP event for process 'slave(670)'
with path: '/slave(670)/monitor/statistics.json'
I1216 01:46:18.228452 27017 http.cpp:874] Authorizing principal 'test-principal' to GET the
'/monitor/statistics.json' endpoint
I1216 01:46:18.229635 27013 slave.cpp:796] Agent terminating
[       OK ] Endpoint/SlaveEndpointTest.UnauthorizedRequest/1 (12 ms)
[ RUN      ] Endpoint/SlaveEndpointTest.UnauthorizedRequest/2
I1216 01:46:18.239032 27005 containerizer.cpp:220] Using isolation: posix/cpu,posix/mem,filesystem/posix,network/cni
W1216 01:46:18.239397 27005 backend.cpp:76] Failed to create 'aufs' backend: AufsBackend requires
root privileges, but is running as user mesos
W1216 01:46:18.239487 27005 backend.cpp:76] Failed to create 'bind' backend: BindBackend requires
root privileges
I1216 01:46:18.240671 27021 slave.cpp:209] Mesos agent started on (671)@172.17.0.2:45028
I1216 01:46:18.240692 27021 slave.cpp:210] Flags at startup: --acls="" --appc_simple_discovery_uri_prefix="http://"
--appc_store_dir="/tmp/mesos/store/appc" --authenticate_http_readonly="true" --authenticate_http_readwrite="true"
--authenticatee="crammd5" --authentication_backoff_factor="1secs" --authorizer="local" --cgroups_cpu_enable_pids_and_tids_count="false"
--cgroups_enable_cfs="false" --cgroups_hierarchy="/sys/fs/cgroup" --cgroups_limit_swap="false"
--cgroups_root="mesos" --container_disk_watch_interval="15secs" --containerizers="mesos" --credential="/tmp/Endpoint_SlaveEndpointTest_UnauthorizedRequest_2_xB5lRo/credential"
--default_role="*" --disk_watch_interval="1mins" --docker="docker" --docker_kill_orphans="true"
--docker_registry="https://registry-1.docker.io" --docker_remove_delay="6hrs" --docker_socket="/var/run/docker.sock"
--docker_stop_timeout="0ns" --docker_store_dir="/tmp/mesos/store/docker" --docker_volume_checkpoint_dir="/var/run/mesos/isolators/docker/volume"
--enforce_container_disk_quota="false" --executor_registration_timeout="1mins" --executor_shutdown_grace_period="5secs"
--fetcher_cache_dir="/tmp/Endpoint_SlaveEndpointTest_UnauthorizedRequest_2_xB5lRo/fetch" --fetcher_cache_size="2GB"
--frameworks_home="" --gc_delay="1weeks" --gc_disk_headroom="0.1" --hadoop_home="" --help="false"
--hostname_lookup="true" --http_authenticators="basic" --http_command_executor="false" --http_credentials="/tmp/Endpoint_SlaveEndpointTest_UnauthorizedRequest_2_xB5lRo/http_credentials"
--http_heartbeat_interval="30secs" --image_provisioner_backend="copy" --initialize_driver_logging="true"
--isolation="posix/cpu,posix/mem" --launcher="posix" --launcher_dir="/mesos/build/src" --logbufsecs="0"
--logging_level="INFO" --max_completed_executors_per_framework="150" --oversubscribed_resources_interval="15secs"
--perf_duration="10secs" --perf_interval="1mins" --qos_correction_interval_min="0ns" --quiet="false"
--recover="reconnect" --recovery_timeout="15mins" --registration_backoff_factor="10ms" --resources="cpus:2;gpus:0;mem:1024;disk:1024;ports:[31000-32000]"
--revocable_cpu_low_priority="true" --runtime_dir="/tmp/Endpoint_SlaveEndpointTest_UnauthorizedRequest_2_xB5lRo"
--sandbox_directory="/mnt/mesos/sandbox" --strict="true" --switch_user="true" --systemd_enable_support="true"
--systemd_runtime_directory="/run/systemd/system" --version="false" --work_dir="/tmp/Endpoint_SlaveEndpointTest_UnauthorizedRequest_2_CrRt0r"
I1216 01:46:18.241133 27021 credentials.hpp:86] Loading credential for authentication from
'/tmp/Endpoint_SlaveEndpointTest_UnauthorizedRequest_2_xB5lRo/credential'
I1216 01:46:18.241221 27021 slave.cpp:352] Agent using credential for: test-principal
I1216 01:46:18.241236 27021 credentials.hpp:37] Loading credentials for authentication from
'/tmp/Endpoint_SlaveEndpointTest_UnauthorizedRequest_2_xB5lRo/http_credentials'
I1216 01:46:18.241364 27021 http.cpp:922] Using default 'basic' HTTP authenticator for realm
'mesos-agent-readonly'
I1216 01:46:18.241433 27021 http.cpp:922] Using default 'basic' HTTP authenticator for realm
'mesos-agent-readwrite'
I1216 01:46:18.241845 27021 slave.cpp:539] Agent resources: cpus(*):2; mem(*):1024; disk(*):1024;
ports(*):[31000-32000]
I1216 01:46:18.241886 27021 slave.cpp:547] Agent attributes: [  ]
I1216 01:46:18.241897 27021 slave.cpp:552] Agent hostname: 7bd114cdc5d6
I1216 01:46:18.242285 27018 state.cpp:57] Recovering state from '/tmp/Endpoint_SlaveEndpointTest_UnauthorizedRequest_2_CrRt0r/meta'
I1216 01:46:18.242408 27013 status_update_manager.cpp:203] Recovering status update manager
I1216 01:46:18.242532 27017 containerizer.cpp:594] Recovering containerizer
I1216 01:46:18.243057 27018 provisioner.cpp:253] Provisioner recovery complete
I1216 01:46:18.243243 27019 slave.cpp:5408] Finished recovery
I1216 01:46:18.243666 27019 slave.cpp:5582] Querying resource estimator for oversubscribable
resources
I1216 01:46:18.243798 27020 slave.cpp:5596] Received oversubscribable resources {} from the
resource estimator
I1216 01:46:18.244452 27015 process.cpp:3679] Handling HTTP event for process 'slave(671)'
with path: '/slave(671)/containers'
I1216 01:46:18.244952 27012 http.cpp:874] Authorizing principal 'test-principal' to GET the
'/containers' endpoint
I1216 01:46:18.245837 27020 slave.cpp:796] Agent terminating
[       OK ] Endpoint/SlaveEndpointTest.UnauthorizedRequest/2 (12 ms)
[ RUN      ] Endpoint/SlaveEndpointTest.NoAuthorizer/0
I1216 01:46:18.251704 27005 containerizer.cpp:220] Using isolation: posix/cpu,posix/mem,filesystem/posix,network/cni
W1216 01:46:18.252148 27005 backend.cpp:76] Failed to create 'aufs' backend: AufsBackend requires
root privileges, but is running as user mesos
W1216 01:46:18.252238 27005 backend.cpp:76] Failed to create 'bind' backend: BindBackend requires
root privileges
I1216 01:46:18.253000 27005 cluster.cpp:446] Creating default 'local' authorizer
I1216 01:46:18.253581 27010 slave.cpp:209] Mesos agent started on (672)@172.17.0.2:45028
I1216 01:46:18.253631 27010 slave.cpp:210] Flags at startup: --acls="" --appc_simple_discovery_uri_prefix="http://"
--appc_store_dir="/tmp/mesos/store/appc" --authenticate_http_readonly="true" --authenticate_http_readwrite="true"
--authenticatee="crammd5" --authentication_backoff_factor="1secs" --authorizer="local" --cgroups_cpu_enable_pids_and_tids_count="false"
--cgroups_enable_cfs="false" --cgroups_hierarchy="/sys/fs/cgroup" --cgroups_limit_swap="false"
--cgroups_root="mesos" --container_disk_watch_interval="15secs" --containerizers="mesos" --credential="/tmp/Endpoint_SlaveEndpointTest_NoAuthorizer_0_iJgInc/credential"
--default_role="*" --disk_watch_interval="1mins" --docker="docker" --docker_kill_orphans="true"
--docker_registry="https://registry-1.docker.io" --docker_remove_delay="6hrs" --docker_socket="/var/run/docker.sock"
--docker_stop_timeout="0ns" --docker_store_dir="/tmp/mesos/store/docker" --docker_volume_checkpoint_dir="/var/run/mesos/isolators/docker/volume"
--enforce_container_disk_quota="false" --executor_registration_timeout="1mins" --executor_shutdown_grace_period="5secs"
--fetcher_cache_dir="/tmp/Endpoint_SlaveEndpointTest_NoAuthorizer_0_iJgInc/fetch" --fetcher_cache_size="2GB"
--frameworks_home="" --gc_delay="1weeks" --gc_disk_headroom="0.1" --hadoop_home="" --help="false"
--hostname_lookup="true" --http_authenticators="basic" --http_command_executor="false" --http_credentials="/tmp/Endpoint_SlaveEndpointTest_NoAuthorizer_0_iJgInc/http_credentials"
--http_heartbeat_interval="30secs" --image_provisioner_backend="copy" --initialize_driver_logging="true"
--isolation="posix/cpu,posix/mem" --launcher="posix" --launcher_dir="/mesos/build/src" --logbufsecs="0"
--logging_level="INFO" --max_completed_executors_per_framework="150" --oversubscribed_resources_interval="15secs"
--perf_duration="10secs" --perf_interval="1mins" --qos_correction_interval_min="0ns" --quiet="false"
--recover="reconnect" --recovery_timeout="15mins" --registration_backoff_factor="10ms" --resources="cpus:2;gpus:0;mem:1024;disk:1024;ports:[31000-32000]"
--revocable_cpu_low_priority="true" --runtime_dir="/tmp/Endpoint_SlaveEndpointTest_NoAuthorizer_0_iJgInc"
--sandbox_directory="/mnt/mesos/sandbox" --strict="true" --switch_user="true" --systemd_enable_support="true"
--systemd_runtime_directory="/run/systemd/system" --version="false" --work_dir="/tmp/Endpoint_SlaveEndpointTest_NoAuthorizer_0_l4eOuf"
I1216 01:46:18.254102 27010 credentials.hpp:86] Loading credential for authentication from
'/tmp/Endpoint_SlaveEndpointTest_NoAuthorizer_0_iJgInc/credential'
I1216 01:46:18.254202 27010 slave.cpp:352] Agent using credential for: test-principal
I1216 01:46:18.254220 27010 credentials.hpp:37] Loading credentials for authentication from
'/tmp/Endpoint_SlaveEndpointTest_NoAuthorizer_0_iJgInc/http_credentials'
I1216 01:46:18.254349 27010 http.cpp:922] Using default 'basic' HTTP authenticator for realm
'mesos-agent-readonly'
I1216 01:46:18.254405 27010 http.cpp:922] Using default 'basic' HTTP authenticator for realm
'mesos-agent-readwrite'
I1216 01:46:18.254813 27010 slave.cpp:539] Agent resources: cpus(*):2; mem(*):1024; disk(*):1024;
ports(*):[31000-32000]
I1216 01:46:18.254855 27010 slave.cpp:547] Agent attributes: [  ]
I1216 01:46:18.254863 27010 slave.cpp:552] Agent hostname: 7bd114cdc5d6
I1216 01:46:18.255229 27015 state.cpp:57] Recovering state from '/tmp/Endpoint_SlaveEndpointTest_NoAuthorizer_0_l4eOuf/meta'
I1216 01:46:18.255395 27008 status_update_manager.cpp:203] Recovering status update manager
I1216 01:46:18.255555 27019 containerizer.cpp:594] Recovering containerizer
I1216 01:46:18.256270 27018 provisioner.cpp:253] Provisioner recovery complete
I1216 01:46:18.256500 27020 slave.cpp:5408] Finished recovery
I1216 01:46:18.256897 27020 slave.cpp:5582] Querying resource estimator for oversubscribable
resources
I1216 01:46:18.256999 27013 slave.cpp:5596] Received oversubscribable resources {} from the
resource estimator
I1216 01:46:18.257637 27013 process.cpp:3679] Handling HTTP event for process 'slave(672)'
with path: '/slave(672)/monitor/statistics'
I1216 01:46:18.258079 27012 http.cpp:874] Authorizing principal 'test-principal' to GET the
'/monitor/statistics' endpoint
I1216 01:46:18.259414 27013 slave.cpp:796] Agent terminating
[       OK ] Endpoint/SlaveEndpointTest.NoAuthorizer/0 (12 ms)
[ RUN      ] Endpoint/SlaveEndpointTest.NoAuthorizer/1
I1216 01:46:18.267418 27005 containerizer.cpp:220] Using isolation: posix/cpu,posix/mem,filesystem/posix,network/cni
W1216 01:46:18.267808 27005 backend.cpp:76] Failed to create 'aufs' backend: AufsBackend requires
root privileges, but is running as user mesos
W1216 01:46:18.267900 27005 backend.cpp:76] Failed to create 'bind' backend: BindBackend requires
root privileges
I1216 01:46:18.268648 27005 cluster.cpp:446] Creating default 'local' authorizer
I1216 01:46:18.269173 27006 slave.cpp:209] Mesos agent started on (673)@172.17.0.2:45028
I1216 01:46:18.269196 27006 slave.cpp:210] Flags at startup: --acls="" --appc_simple_discovery_uri_prefix="http://"
--appc_store_dir="/tmp/mesos/store/appc" --authenticate_http_readonly="true" --authenticate_http_readwrite="true"
--authenticatee="crammd5" --authentication_backoff_factor="1secs" --authorizer="local" --cgroups_cpu_enable_pids_and_tids_count="false"
--cgroups_enable_cfs="false" --cgroups_hierarchy="/sys/fs/cgroup" --cgroups_limit_swap="false"
--cgroups_root="mesos" --container_disk_watch_interval="15secs" --containerizers="mesos" --credential="/tmp/Endpoint_SlaveEndpointTest_NoAuthorizer_1_gJpR3Z/credential"
--default_role="*" --disk_watch_interval="1mins" --docker="docker" --docker_kill_orphans="true"
--docker_registry="https://registry-1.docker.io" --docker_remove_delay="6hrs" --docker_socket="/var/run/docker.sock"
--docker_stop_timeout="0ns" --docker_store_dir="/tmp/mesos/store/docker" --docker_volume_checkpoint_dir="/var/run/mesos/isolators/docker/volume"
--enforce_container_disk_quota="false" --executor_registration_timeout="1mins" --executor_shutdown_grace_period="5secs"
--fetcher_cache_dir="/tmp/Endpoint_SlaveEndpointTest_NoAuthorizer_1_gJpR3Z/fetch" --fetcher_cache_size="2GB"
--frameworks_home="" --gc_delay="1weeks" --gc_disk_headroom="0.1" --hadoop_home="" --help="false"
--hostname_lookup="true" --http_authenticators="basic" --http_command_executor="false" --http_credentials="/tmp/Endpoint_SlaveEndpointTest_NoAuthorizer_1_gJpR3Z/http_credentials"
--http_heartbeat_interval="30secs" --image_provisioner_backend="copy" --initialize_driver_logging="true"
--isolation="posix/cpu,posix/mem" --launcher="posix" --launcher_dir="/mesos/build/src" --logbufsecs="0"
--logging_level="INFO" --max_completed_executors_per_framework="150" --oversubscribed_resources_interval="15secs"
--perf_duration="10secs" --perf_interval="1mins" --qos_correction_interval_min="0ns" --quiet="false"
--recover="reconnect" --recovery_timeout="15mins" --registration_backoff_factor="10ms" --resources="cpus:2;gpus:0;mem:1024;disk:1024;ports:[31000-32000]"
--revocable_cpu_low_priority="true" --runtime_dir="/tmp/Endpoint_SlaveEndpointTest_NoAuthorizer_1_gJpR3Z"
--sandbox_directory="/mnt/mesos/sandbox" --strict="true" --switch_user="true" --systemd_enable_support="true"
--systemd_runtime_directory="/run/systemd/system" --version="false" --work_dir="/tmp/Endpoint_SlaveEndpointTest_NoAuthorizer_1_9Zrp82"
I1216 01:46:18.269614 27006 credentials.hpp:86] Loading credential for authentication from
'/tmp/Endpoint_SlaveEndpointTest_NoAuthorizer_1_gJpR3Z/credential'
I1216 01:46:18.269721 27006 slave.cpp:352] Agent using credential for: test-principal
I1216 01:46:18.269738 27006 credentials.hpp:37] Loading credentials for authentication from
'/tmp/Endpoint_SlaveEndpointTest_NoAuthorizer_1_gJpR3Z/http_credentials'
I1216 01:46:18.269893 27006 http.cpp:922] Using default 'basic' HTTP authenticator for realm
'mesos-agent-readonly'
I1216 01:46:18.269943 27006 http.cpp:922] Using default 'basic' HTTP authenticator for realm
'mesos-agent-readwrite'
I1216 01:46:18.270333 27006 slave.cpp:539] Agent resources: cpus(*):2; mem(*):1024; disk(*):1024;
ports(*):[31000-32000]
I1216 01:46:18.270373 27006 slave.cpp:547] Agent attributes: [  ]
I1216 01:46:18.270381 27006 slave.cpp:552] Agent hostname: 7bd114cdc5d6
I1216 01:46:18.270790 27010 state.cpp:57] Recovering state from '/tmp/Endpoint_SlaveEndpointTest_NoAuthorizer_1_9Zrp82/meta'
I1216 01:46:18.270987 27006 status_update_manager.cpp:203] Recovering status update manager
I1216 01:46:18.271086 27013 containerizer.cpp:594] Recovering containerizer
I1216 01:46:18.271663 27006 provisioner.cpp:253] Provisioner recovery complete
I1216 01:46:18.271951 27007 slave.cpp:5408] Finished recovery
I1216 01:46:18.272349 27007 slave.cpp:5582] Querying resource estimator for oversubscribable
resources
I1216 01:46:18.272511 27020 slave.cpp:5596] Received oversubscribable resources {} from the
resource estimator
I1216 01:46:18.273161 27010 process.cpp:3679] Handling HTTP event for process 'slave(673)'
with path: '/slave(673)/monitor/statistics.json'
I1216 01:46:18.273600 27015 http.cpp:874] Authorizing principal 'test-principal' to GET the
'/monitor/statistics.json' endpoint
I1216 01:46:18.275012 27021 slave.cpp:796] Agent terminating
[       OK ] Endpoint/SlaveEndpointTest.NoAuthorizer/1 (13 ms)
[ RUN      ] Endpoint/SlaveEndpointTest.NoAuthorizer/2
I1216 01:46:18.282445 27005 containerizer.cpp:220] Using isolation: posix/cpu,posix/mem,filesystem/posix,network/cni
W1216 01:46:18.282837 27005 backend.cpp:76] Failed to create 'aufs' backend: AufsBackend requires
root privileges, but is running as user mesos
W1216 01:46:18.282958 27005 backend.cpp:76] Failed to create 'bind' backend: BindBackend requires
root privileges
I1216 01:46:18.283751 27005 cluster.cpp:446] Creating default 'local' authorizer
I1216 01:46:18.284356 27006 slave.cpp:209] Mesos agent started on (674)@172.17.0.2:45028
I1216 01:46:18.284374 27006 slave.cpp:210] Flags at startup: --acls="" --appc_simple_discovery_uri_prefix="http://"
--appc_store_dir="/tmp/mesos/store/appc" --authenticate_http_readonly="true" --authenticate_http_readwrite="true"
--authenticatee="crammd5" --authentication_backoff_factor="1secs" --authorizer="local" --cgroups_cpu_enable_pids_and_tids_count="false"
--cgroups_enable_cfs="false" --cgroups_hierarchy="/sys/fs/cgroup" --cgroups_limit_swap="false"
--cgroups_root="mesos" --container_disk_watch_interval="15secs" --containerizers="mesos" --credential="/tmp/Endpoint_SlaveEndpointTest_NoAuthorizer_2_8Q2RTN/credential"
--default_role="*" --disk_watch_interval="1mins" --docker="docker" --docker_kill_orphans="true"
--docker_registry="https://registry-1.docker.io" --docker_remove_delay="6hrs" --docker_socket="/var/run/docker.sock"
--docker_stop_timeout="0ns" --docker_store_dir="/tmp/mesos/store/docker" --docker_volume_checkpoint_dir="/var/run/mesos/isolators/docker/volume"
--enforce_container_disk_quota="false" --executor_registration_timeout="1mins" --executor_shutdown_grace_period="5secs"
--fetcher_cache_dir="/tmp/Endpoint_SlaveEndpointTest_NoAuthorizer_2_8Q2RTN/fetch" --fetcher_cache_size="2GB"
--frameworks_home="" --gc_delay="1weeks" --gc_disk_headroom="0.1" --hadoop_home="" --help="false"
--hostname_lookup="true" --http_authenticators="basic" --http_command_executor="false" --http_credentials="/tmp/Endpoint_SlaveEndpointTest_NoAuthorizer_2_8Q2RTN/http_credentials"
--http_heartbeat_interval="30secs" --image_provisioner_backend="copy" --initialize_driver_logging="true"
--isolation="posix/cpu,posix/mem" --launcher="posix" --launcher_dir="/mesos/build/src" --logbufsecs="0"
--logging_level="INFO" --max_completed_executors_per_framework="150" --oversubscribed_resources_interval="15secs"
--perf_duration="10secs" --perf_interval="1mins" --qos_correction_interval_min="0ns" --quiet="false"
--recover="reconnect" --recovery_timeout="15mins" --registration_backoff_factor="10ms" --resources="cpus:2;gpus:0;mem:1024;disk:1024;ports:[31000-32000]"
--revocable_cpu_low_priority="true" --runtime_dir="/tmp/Endpoint_SlaveEndpointTest_NoAuthorizer_2_8Q2RTN"
--sandbox_directory="/mnt/mesos/sandbox" --strict="true" --switch_user="true" --systemd_enable_support="true"
--systemd_runtime_directory="/run/systemd/system" --version="false" --work_dir="/tmp/Endpoint_SlaveEndpointTest_NoAuthorizer_2_1ZiYVQ"
I1216 01:46:18.284796 27006 credentials.hpp:86] Loading credential for authentication from
'/tmp/Endpoint_SlaveEndpointTest_NoAuthorizer_2_8Q2RTN/credential'
I1216 01:46:18.284888 27006 slave.cpp:352] Agent using credential for: test-principal
I1216 01:46:18.284904 27006 credentials.hpp:37] Loading credentials for authentication from
'/tmp/Endpoint_SlaveEndpointTest_NoAuthorizer_2_8Q2RTN/http_credentials'
I1216 01:46:18.285032 27006 http.cpp:922] Using default 'basic' HTTP authenticator for realm
'mesos-agent-readonly'
I1216 01:46:18.285086 27006 http.cpp:922] Using default 'basic' HTTP authenticator for realm
'mesos-agent-readwrite'
I1216 01:46:18.285526 27006 slave.cpp:539] Agent resources: cpus(*):2; mem(*):1024; disk(*):1024;
ports(*):[31000-32000]
I1216 01:46:18.285567 27006 slave.cpp:547] Agent attributes: [  ]
I1216 01:46:18.285575 27006 slave.cpp:552] Agent hostname: 7bd114cdc5d6
I1216 01:46:18.285938 27018 state.cpp:57] Recovering state from '/tmp/Endpoint_SlaveEndpointTest_NoAuthorizer_2_1ZiYVQ/meta'
I1216 01:46:18.286098 27019 status_update_manager.cpp:203] Recovering status update manager
I1216 01:46:18.286285 27011 containerizer.cpp:594] Recovering containerizer
I1216 01:46:18.286938 27012 provisioner.cpp:253] Provisioner recovery complete
I1216 01:46:18.287118 27012 slave.cpp:5408] Finished recovery
I1216 01:46:18.287518 27012 slave.cpp:5582] Querying resource estimator for oversubscribable
resources
I1216 01:46:18.287698 27011 slave.cpp:5596] Received oversubscribable resources {} from the
resource estimator
I1216 01:46:18.288406 27021 process.cpp:3679] Handling HTTP event for process 'slave(674)'
with path: '/slave(674)/containers'
I1216 01:46:18.288908 27020 http.cpp:874] Authorizing principal 'test-principal' to GET the
'/containers' endpoint
I1216 01:46:18.290266 27018 slave.cpp:796] Agent terminating
[       OK ] Endpoint/SlaveEndpointTest.NoAuthorizer/2 (13 ms)
[----------] 9 tests from Endpoint/SlaveEndpointTest (136 ms total)

[----------] Global test environment tear-down
[==========] 1390 tests from 158 test cases ran. (285853 ms total)
[  PASSED  ] 1389 tests.
[  FAILED  ] 1 test, listed below:
[  FAILED  ] IOSwitchboardTest.KillSwitchboardContainerDestroyed

 1 FAILED TEST
  YOU HAVE 9 DISABLED TESTS

Inconsistency detected by ld.so: dl-close.c: 762: _dl_close: Assertion `map->l_init_called'
failed!
make[3]: *** [CMakeFiles/check] Error 127
make[3]: Leaving directory `/mesos/build'
make[2]: *** [CMakeFiles/check.dir/all] Error 2
make[2]: Leaving directory `/mesos/build'
make[1]: *** [CMakeFiles/check.dir/rule] Error 2
make[1]: Leaving directory `/mesos/build'
make: *** [check] Error 2
+ docker rmi mesos-1481849603-11903
Untagged: mesos-1481849603-11903:latest
Deleted: sha256:5adf697d25abe4f784b9d8e7c21217b804c5e70aa02be337564b1dcc791f2f19
Deleted: sha256:00bed6920276d0f3a7fd817a595e9375facbb7e5ad886201c6e4c7955add4475
Deleted: sha256:5292a53af62d32562c7b227f05a71ec63e58327e278ea93633ee9b7adc046735
Deleted: sha256:fe1930a1ea79cee2470177d8fea9bc103cbc2cb4ede69315e92114ab9e016e2f
Deleted: sha256:ff60722e168669e36c0cbbca082fcfa4dcb84e6d35d93780e21edd48fe8e7e7b
Deleted: sha256:2f54921b5a06fd8458206cbbb3ce799a962b09a9835f88173d9ba5e3a14011ef
Deleted: sha256:4bdc507db00bcba7efc1a54184eca3ae33477cca04c25b007b5004c69ca9a8ad
Deleted: sha256:3822f3a105552ff0eab2ea8c05110da32dd722cd265369bf2767ab3d9be58684
Deleted: sha256:d888fa2319312840334eb98366f6a172b7e10d14b44957b1a6cfe95d840229f9
Deleted: sha256:60afcaa632cef07a534126e70c87f3b9042803b051678ce3a8208befa449e41f
Deleted: sha256:b96a183a5cbe798054ecbda1319827bc77a1200d778b40401c4b8efd41644605
Deleted: sha256:b828b9e7df29dfb274cc50d218a0dfe68d23bbc26af3c4f3cdd1c051279291b7
Deleted: sha256:c76fffa1c166dbfc34257a6826d99a5b31521165fe62f4088cd75cf727fec344
Deleted: sha256:260d06d891783733a6a1440b45357d0bb1f89f030edfe1f35b66d86b8105bc34
Deleted: sha256:46b59bd3cddbf0ae42a5c586f761f25250462c50bc04704f9de87110d19af0ca
Deleted: sha256:efde2dd17a5462394fa99a9a39bede23dfb5672b457eaafa1cf5614e48e5fada
Deleted: sha256:27c4d81e91265a03f245303473776e9d6551f3a82a88e31b343ed7b6de25192c
Deleted: sha256:8c0f2effd8a309259e4b8ac5f0bb2e68d56896ef2f07370292466493c9c57bfc
Deleted: sha256:4d88dc01eb37dfa8389d5f1ab8a1741a393063bb70467de675f923000a7c076d
Deleted: sha256:c5cbafd9886def44cde56cb74e632c9f18647b5636a631648e80527c849d08c0
Deleted: sha256:b74ecd7592faf1c2b7c5f949021c6d99e1ded217f17e394aeac45c56dba8b9d4
Deleted: sha256:90b77f7ed767f097ba1fcc5f7d2f98b44f1f22a595c71f0e152f68aa27790a0a
Deleted: sha256:236e5bdbeb91f8f7bd540fa293dd80878927b174f098a5395561143eb736502a
Deleted: sha256:7f0ca39c5334a00a26e8f46cd12af6a0d61885f5703a6d649d31a4b4dd04b675
Build step 'Execute shell' marked build as failure

Mime
View raw message