mesos-builds mailing list archives

Site index · List index
Message view « Date » · « Thread »
Top « Date » · « Thread »
From Apache Jenkins Server <jenk...@builds.apache.org>
Subject Build failed in Jenkins: mesos-reviewbot #16390
Date Fri, 09 Dec 2016 16:01:10 GMT
See <https://builds.apache.org/job/mesos-reviewbot/16390/changes>

Changes:

[toenshoff] Improved equality check in SlaveTest.StateEndpoint.

[toenshoff] Removed `using namespace` decl from slave namespace.

[toenshoff] Do not assume std symbols are visible without using FQN.

[toenshoff] Removed using declarations in headers in global scope in libprocess.

[toenshoff] Avoided building glog tests.

------------------------------------------
[...truncated 169097 lines...]
I1209 16:00:16.061444 29695 containerizer.cpp:220] Using isolation: posix/cpu,posix/mem,filesystem/posix,network/cni
W1209 16:00:16.062101 29695 backend.cpp:76] Failed to create 'aufs' backend: AufsBackend requires
root privileges, but is running as user mesos
W1209 16:00:16.062304 29695 backend.cpp:76] Failed to create 'bind' backend: BindBackend requires
root privileges
I1209 16:00:16.066000 29719 slave.cpp:209] Mesos agent started on (662)@172.17.0.2:36670
I1209 16:00:16.066033 29719 slave.cpp:210] Flags at startup: --acls="" --appc_simple_discovery_uri_prefix="http://"
--appc_store_dir="/tmp/mesos/store/appc" --authenticate_http_readonly="true" --authenticate_http_readwrite="true"
--authenticatee="crammd5" --authentication_backoff_factor="1secs" --authorizer="local" --cgroups_cpu_enable_pids_and_tids_count="false"
--cgroups_enable_cfs="false" --cgroups_hierarchy="/sys/fs/cgroup" --cgroups_limit_swap="false"
--cgroups_root="mesos" --container_disk_watch_interval="15secs" --containerizers="mesos" --credential="/tmp/Endpoint_SlaveEndpointTest_AuthorizedRequest_1_JkQqo1/credential"
--default_role="*" --disk_watch_interval="1mins" --docker="docker" --docker_kill_orphans="true"
--docker_registry="https://registry-1.docker.io" --docker_remove_delay="6hrs" --docker_socket="/var/run/docker.sock"
--docker_stop_timeout="0ns" --docker_store_dir="/tmp/mesos/store/docker" --docker_volume_checkpoint_dir="/var/run/mesos/isolators/docker/volume"
--enforce_container_disk_quota="false" --executor_registration_timeout="1mins" --executor_shutdown_grace_period="5secs"
--fetcher_cache_dir="/tmp/Endpoint_SlaveEndpointTest_AuthorizedRequest_1_JkQqo1/fetch" --fetcher_cache_size="2GB"
--frameworks_home="" --gc_delay="1weeks" --gc_disk_headroom="0.1" --hadoop_home="" --help="false"
--hostname_lookup="true" --http_authenticators="basic" --http_command_executor="false" --http_credentials="/tmp/Endpoint_SlaveEndpointTest_AuthorizedRequest_1_JkQqo1/http_credentials"
--image_provisioner_backend="copy" --initialize_driver_logging="true" --io_switchboard_enable_server="true"
--isolation="posix/cpu,posix/mem" --launcher="posix" --launcher_dir="/mesos/mesos-1.2.0/_build/src"
--logbufsecs="0" --logging_level="INFO" --max_completed_executors_per_framework="150" --oversubscribed_resources_interval="15secs"
--perf_duration="10secs" --perf_interval="1mins" --qos_correction_interval_min="0ns" --quiet="false"
--recover="reconnect" --recovery_timeout="15mins" --registration_backoff_factor="10ms" --resources="cpus:2;gpus:0;mem:1024;disk:1024;ports:[31000-32000]"
--revocable_cpu_low_priority="true" --runtime_dir="/tmp/Endpoint_SlaveEndpointTest_AuthorizedRequest_1_JkQqo1"
--sandbox_directory="/mnt/mesos/sandbox" --strict="true" --switch_user="true" --systemd_enable_support="true"
--systemd_runtime_directory="/run/systemd/system" --version="false" --work_dir="/tmp/Endpoint_SlaveEndpointTest_AuthorizedRequest_1_20s8fK"
I1209 16:00:16.066715 29719 credentials.hpp:86] Loading credential for authentication from
'/tmp/Endpoint_SlaveEndpointTest_AuthorizedRequest_1_JkQqo1/credential'
I1209 16:00:16.066874 29719 slave.cpp:347] Agent using credential for: test-principal
I1209 16:00:16.066900 29719 credentials.hpp:37] Loading credentials for authentication from
'/tmp/Endpoint_SlaveEndpointTest_AuthorizedRequest_1_JkQqo1/http_credentials'
I1209 16:00:16.067170 29719 http.cpp:922] Using default 'basic' HTTP authenticator for realm
'mesos-agent-readonly'
I1209 16:00:16.067308 29719 http.cpp:922] Using default 'basic' HTTP authenticator for realm
'mesos-agent-readwrite'
I1209 16:00:16.068625 29719 slave.cpp:534] Agent resources: cpus(*):2; mem(*):1024; disk(*):1024;
ports(*):[31000-32000]
I1209 16:00:16.068725 29719 slave.cpp:542] Agent attributes: [  ]
I1209 16:00:16.068742 29719 slave.cpp:547] Agent hostname: bdbbcd5b8f96
I1209 16:00:16.070252 29723 state.cpp:57] Recovering state from '/tmp/Endpoint_SlaveEndpointTest_AuthorizedRequest_1_20s8fK/meta'
I1209 16:00:16.070516 29717 status_update_manager.cpp:203] Recovering status update manager
I1209 16:00:16.070893 29728 containerizer.cpp:594] Recovering containerizer
I1209 16:00:16.072509 29724 provisioner.cpp:253] Provisioner recovery complete
I1209 16:00:16.072962 29723 slave.cpp:5415] Finished recovery
I1209 16:00:16.073540 29723 slave.cpp:5589] Querying resource estimator for oversubscribable
resources
I1209 16:00:16.073881 29724 slave.cpp:5603] Received oversubscribable resources {} from the
resource estimator
I1209 16:00:16.076346 29728 process.cpp:3679] Handling HTTP event for process 'slave(662)'
with path: '/slave(662)/monitor/statistics.json'
I1209 16:00:16.077793 29719 http.cpp:874] Authorizing principal 'test-principal' to GET the
'/monitor/statistics.json' endpoint
I1209 16:00:16.081832 29725 slave.cpp:791] Agent terminating
[       OK ] Endpoint/SlaveEndpointTest.AuthorizedRequest/1 (31 ms)
[ RUN      ] Endpoint/SlaveEndpointTest.AuthorizedRequest/2
I1209 16:00:16.093014 29695 containerizer.cpp:220] Using isolation: posix/cpu,posix/mem,filesystem/posix,network/cni
W1209 16:00:16.093616 29695 backend.cpp:76] Failed to create 'aufs' backend: AufsBackend requires
root privileges, but is running as user mesos
W1209 16:00:16.093757 29695 backend.cpp:76] Failed to create 'bind' backend: BindBackend requires
root privileges
I1209 16:00:16.096982 29719 slave.cpp:209] Mesos agent started on (663)@172.17.0.2:36670
I1209 16:00:16.097012 29719 slave.cpp:210] Flags at startup: --acls="" --appc_simple_discovery_uri_prefix="http://"
--appc_store_dir="/tmp/mesos/store/appc" --authenticate_http_readonly="true" --authenticate_http_readwrite="true"
--authenticatee="crammd5" --authentication_backoff_factor="1secs" --authorizer="local" --cgroups_cpu_enable_pids_and_tids_count="false"
--cgroups_enable_cfs="false" --cgroups_hierarchy="/sys/fs/cgroup" --cgroups_limit_swap="false"
--cgroups_root="mesos" --container_disk_watch_interval="15secs" --containerizers="mesos" --credential="/tmp/Endpoint_SlaveEndpointTest_AuthorizedRequest_2_DTY9c8/credential"
--default_role="*" --disk_watch_interval="1mins" --docker="docker" --docker_kill_orphans="true"
--docker_registry="https://registry-1.docker.io" --docker_remove_delay="6hrs" --docker_socket="/var/run/docker.sock"
--docker_stop_timeout="0ns" --docker_store_dir="/tmp/mesos/store/docker" --docker_volume_checkpoint_dir="/var/run/mesos/isolators/docker/volume"
--enforce_container_disk_quota="false" --executor_registration_timeout="1mins" --executor_shutdown_grace_period="5secs"
--fetcher_cache_dir="/tmp/Endpoint_SlaveEndpointTest_AuthorizedRequest_2_DTY9c8/fetch" --fetcher_cache_size="2GB"
--frameworks_home="" --gc_delay="1weeks" --gc_disk_headroom="0.1" --hadoop_home="" --help="false"
--hostname_lookup="true" --http_authenticators="basic" --http_command_executor="false" --http_credentials="/tmp/Endpoint_SlaveEndpointTest_AuthorizedRequest_2_DTY9c8/http_credentials"
--image_provisioner_backend="copy" --initialize_driver_logging="true" --io_switchboard_enable_server="true"
--isolation="posix/cpu,posix/mem" --launcher="posix" --launcher_dir="/mesos/mesos-1.2.0/_build/src"
--logbufsecs="0" --logging_level="INFO" --max_completed_executors_per_framework="150" --oversubscribed_resources_interval="15secs"
--perf_duration="10secs" --perf_interval="1mins" --qos_correction_interval_min="0ns" --quiet="false"
--recover="reconnect" --recovery_timeout="15mins" --registration_backoff_factor="10ms" --resources="cpus:2;gpus:0;mem:1024;disk:1024;ports:[31000-32000]"
--revocable_cpu_low_priority="true" --runtime_dir="/tmp/Endpoint_SlaveEndpointTest_AuthorizedRequest_2_DTY9c8"
--sandbox_directory="/mnt/mesos/sandbox" --strict="true" --switch_user="true" --systemd_enable_support="true"
--systemd_runtime_directory="/run/systemd/system" --version="false" --work_dir="/tmp/Endpoint_SlaveEndpointTest_AuthorizedRequest_2_KlEGZQ"
I1209 16:00:16.097676 29719 credentials.hpp:86] Loading credential for authentication from
'/tmp/Endpoint_SlaveEndpointTest_AuthorizedRequest_2_DTY9c8/credential'
I1209 16:00:16.097844 29719 slave.cpp:347] Agent using credential for: test-principal
I1209 16:00:16.097877 29719 credentials.hpp:37] Loading credentials for authentication from
'/tmp/Endpoint_SlaveEndpointTest_AuthorizedRequest_2_DTY9c8/http_credentials'
I1209 16:00:16.098150 29719 http.cpp:922] Using default 'basic' HTTP authenticator for realm
'mesos-agent-readonly'
I1209 16:00:16.098264 29719 http.cpp:922] Using default 'basic' HTTP authenticator for realm
'mesos-agent-readwrite'
I1209 16:00:16.099403 29719 slave.cpp:534] Agent resources: cpus(*):2; mem(*):1024; disk(*):1024;
ports(*):[31000-32000]
I1209 16:00:16.099486 29719 slave.cpp:542] Agent attributes: [  ]
I1209 16:00:16.099500 29719 slave.cpp:547] Agent hostname: bdbbcd5b8f96
I1209 16:00:16.100968 29725 state.cpp:57] Recovering state from '/tmp/Endpoint_SlaveEndpointTest_AuthorizedRequest_2_KlEGZQ/meta'
I1209 16:00:16.101227 29716 status_update_manager.cpp:203] Recovering status update manager
I1209 16:00:16.101701 29718 containerizer.cpp:594] Recovering containerizer
I1209 16:00:16.103531 29728 provisioner.cpp:253] Provisioner recovery complete
I1209 16:00:16.104040 29725 slave.cpp:5415] Finished recovery
I1209 16:00:16.104619 29725 slave.cpp:5589] Querying resource estimator for oversubscribable
resources
I1209 16:00:16.104960 29714 slave.cpp:5603] Received oversubscribable resources {} from the
resource estimator
I1209 16:00:16.107270 29729 process.cpp:3679] Handling HTTP event for process 'slave(663)'
with path: '/slave(663)/containers'
I1209 16:00:16.108489 29720 http.cpp:874] Authorizing principal 'test-principal' to GET the
'/containers' endpoint
I1209 16:00:16.111881 29714 slave.cpp:791] Agent terminating
[       OK ] Endpoint/SlaveEndpointTest.AuthorizedRequest/2 (28 ms)
[ RUN      ] Endpoint/SlaveEndpointTest.UnauthorizedRequest/0
I1209 16:00:16.125762 29695 containerizer.cpp:220] Using isolation: posix/cpu,posix/mem,filesystem/posix,network/cni
W1209 16:00:16.126426 29695 backend.cpp:76] Failed to create 'aufs' backend: AufsBackend requires
root privileges, but is running as user mesos
W1209 16:00:16.126611 29695 backend.cpp:76] Failed to create 'bind' backend: BindBackend requires
root privileges
I1209 16:00:16.130147 29722 slave.cpp:209] Mesos agent started on (664)@172.17.0.2:36670
I1209 16:00:16.130169 29722 slave.cpp:210] Flags at startup: --acls="" --appc_simple_discovery_uri_prefix="http://"
--appc_store_dir="/tmp/mesos/store/appc" --authenticate_http_readonly="true" --authenticate_http_readwrite="true"
--authenticatee="crammd5" --authentication_backoff_factor="1secs" --authorizer="local" --cgroups_cpu_enable_pids_and_tids_count="false"
--cgroups_enable_cfs="false" --cgroups_hierarchy="/sys/fs/cgroup" --cgroups_limit_swap="false"
--cgroups_root="mesos" --container_disk_watch_interval="15secs" --containerizers="mesos" --credential="/tmp/Endpoint_SlaveEndpointTest_UnauthorizedRequest_0_nSUGmf/credential"
--default_role="*" --disk_watch_interval="1mins" --docker="docker" --docker_kill_orphans="true"
--docker_registry="https://registry-1.docker.io" --docker_remove_delay="6hrs" --docker_socket="/var/run/docker.sock"
--docker_stop_timeout="0ns" --docker_store_dir="/tmp/mesos/store/docker" --docker_volume_checkpoint_dir="/var/run/mesos/isolators/docker/volume"
--enforce_container_disk_quota="false" --executor_registration_timeout="1mins" --executor_shutdown_grace_period="5secs"
--fetcher_cache_dir="/tmp/Endpoint_SlaveEndpointTest_UnauthorizedRequest_0_nSUGmf/fetch" --fetcher_cache_size="2GB"
--frameworks_home="" --gc_delay="1weeks" --gc_disk_headroom="0.1" --hadoop_home="" --help="false"
--hostname_lookup="true" --http_authenticators="basic" --http_command_executor="false" --http_credentials="/tmp/Endpoint_SlaveEndpointTest_UnauthorizedRequest_0_nSUGmf/http_credentials"
--image_provisioner_backend="copy" --initialize_driver_logging="true" --io_switchboard_enable_server="true"
--isolation="posix/cpu,posix/mem" --launcher="posix" --launcher_dir="/mesos/mesos-1.2.0/_build/src"
--logbufsecs="0" --logging_level="INFO" --max_completed_executors_per_framework="150" --oversubscribed_resources_interval="15secs"
--perf_duration="10secs" --perf_interval="1mins" --qos_correction_interval_min="0ns" --quiet="false"
--recover="reconnect" --recovery_timeout="15mins" --registration_backoff_factor="10ms" --resources="cpus:2;gpus:0;mem:1024;disk:1024;ports:[31000-32000]"
--revocable_cpu_low_priority="true" --runtime_dir="/tmp/Endpoint_SlaveEndpointTest_UnauthorizedRequest_0_nSUGmf"
--sandbox_directory="/mnt/mesos/sandbox" --strict="true" --switch_user="true" --systemd_enable_support="true"
--systemd_runtime_directory="/run/systemd/system" --version="false" --work_dir="/tmp/Endpoint_SlaveEndpointTest_UnauthorizedRequest_0_coAX3X"
I1209 16:00:16.130756 29722 credentials.hpp:86] Loading credential for authentication from
'/tmp/Endpoint_SlaveEndpointTest_UnauthorizedRequest_0_nSUGmf/credential'
I1209 16:00:16.130928 29722 slave.cpp:347] Agent using credential for: test-principal
I1209 16:00:16.130954 29722 credentials.hpp:37] Loading credentials for authentication from
'/tmp/Endpoint_SlaveEndpointTest_UnauthorizedRequest_0_nSUGmf/http_credentials'
I1209 16:00:16.131232 29722 http.cpp:922] Using default 'basic' HTTP authenticator for realm
'mesos-agent-readonly'
I1209 16:00:16.131408 29722 http.cpp:922] Using default 'basic' HTTP authenticator for realm
'mesos-agent-readwrite'
I1209 16:00:16.132612 29722 slave.cpp:534] Agent resources: cpus(*):2; mem(*):1024; disk(*):1024;
ports(*):[31000-32000]
I1209 16:00:16.132719 29722 slave.cpp:542] Agent attributes: [  ]
I1209 16:00:16.132745 29722 slave.cpp:547] Agent hostname: bdbbcd5b8f96
I1209 16:00:16.134227 29725 state.cpp:57] Recovering state from '/tmp/Endpoint_SlaveEndpointTest_UnauthorizedRequest_0_coAX3X/meta'
I1209 16:00:16.134555 29716 status_update_manager.cpp:203] Recovering status update manager
I1209 16:00:16.134747 29718 containerizer.cpp:594] Recovering containerizer
I1209 16:00:16.135918 29714 provisioner.cpp:253] Provisioner recovery complete
I1209 16:00:16.136291 29725 slave.cpp:5415] Finished recovery
I1209 16:00:16.136682 29725 slave.cpp:5589] Querying resource estimator for oversubscribable
resources
I1209 16:00:16.136900 29718 slave.cpp:5603] Received oversubscribable resources {} from the
resource estimator
I1209 16:00:16.139031 29718 process.cpp:3679] Handling HTTP event for process 'slave(664)'
with path: '/slave(664)/monitor/statistics'
I1209 16:00:16.140382 29714 http.cpp:874] Authorizing principal 'test-principal' to GET the
'/monitor/statistics' endpoint
I1209 16:00:16.143697 29723 slave.cpp:791] Agent terminating
[       OK ] Endpoint/SlaveEndpointTest.UnauthorizedRequest/0 (29 ms)
[ RUN      ] Endpoint/SlaveEndpointTest.UnauthorizedRequest/1
I1209 16:00:16.155714 29695 containerizer.cpp:220] Using isolation: posix/cpu,posix/mem,filesystem/posix,network/cni
W1209 16:00:16.156360 29695 backend.cpp:76] Failed to create 'aufs' backend: AufsBackend requires
root privileges, but is running as user mesos
W1209 16:00:16.156553 29695 backend.cpp:76] Failed to create 'bind' backend: BindBackend requires
root privileges
I1209 16:00:16.160116 29718 slave.cpp:209] Mesos agent started on (665)@172.17.0.2:36670
I1209 16:00:16.160185 29718 slave.cpp:210] Flags at startup: --acls="" --appc_simple_discovery_uri_prefix="http://"
--appc_store_dir="/tmp/mesos/store/appc" --authenticate_http_readonly="true" --authenticate_http_readwrite="true"
--authenticatee="crammd5" --authentication_backoff_factor="1secs" --authorizer="local" --cgroups_cpu_enable_pids_and_tids_count="false"
--cgroups_enable_cfs="false" --cgroups_hierarchy="/sys/fs/cgroup" --cgroups_limit_swap="false"
--cgroups_root="mesos" --container_disk_watch_interval="15secs" --containerizers="mesos" --credential="/tmp/Endpoint_SlaveEndpointTest_UnauthorizedRequest_1_t635Pm/credential"
--default_role="*" --disk_watch_interval="1mins" --docker="docker" --docker_kill_orphans="true"
--docker_registry="https://registry-1.docker.io" --docker_remove_delay="6hrs" --docker_socket="/var/run/docker.sock"
--docker_stop_timeout="0ns" --docker_store_dir="/tmp/mesos/store/docker" --docker_volume_checkpoint_dir="/var/run/mesos/isolators/docker/volume"
--enforce_container_disk_quota="false" --executor_registration_timeout="1mins" --executor_shutdown_grace_period="5secs"
--fetcher_cache_dir="/tmp/Endpoint_SlaveEndpointTest_UnauthorizedRequest_1_t635Pm/fetch" --fetcher_cache_size="2GB"
--frameworks_home="" --gc_delay="1weeks" --gc_disk_headroom="0.1" --hadoop_home="" --help="false"
--hostname_lookup="true" --http_authenticators="basic" --http_command_executor="false" --http_credentials="/tmp/Endpoint_SlaveEndpointTest_UnauthorizedRequest_1_t635Pm/http_credentials"
--image_provisioner_backend="copy" --initialize_driver_logging="true" --io_switchboard_enable_server="true"
--isolation="posix/cpu,posix/mem" --launcher="posix" --launcher_dir="/mesos/mesos-1.2.0/_build/src"
--logbufsecs="0" --logging_level="INFO" --max_completed_executors_per_framework="150" --oversubscribed_resources_interval="15secs"
--perf_duration="10secs" --perf_interval="1mins" --qos_correction_interval_min="0ns" --quiet="false"
--recover="reconnect" --recovery_timeout="15mins" --registration_backoff_factor="10ms" --resources="cpus:2;gpus:0;mem:1024;disk:1024;ports:[31000-32000]"
--revocable_cpu_low_priority="true" --runtime_dir="/tmp/Endpoint_SlaveEndpointTest_UnauthorizedRequest_1_t635Pm"
--sandbox_directory="/mnt/mesos/sandbox" --strict="true" --switch_user="true" --systemd_enable_support="true"
--systemd_runtime_directory="/run/systemd/system" --version="false" --work_dir="/tmp/Endpoint_SlaveEndpointTest_UnauthorizedRequest_1_s37ts5"
I1209 16:00:16.160873 29718 credentials.hpp:86] Loading credential for authentication from
'/tmp/Endpoint_SlaveEndpointTest_UnauthorizedRequest_1_t635Pm/credential'
I1209 16:00:16.161082 29718 slave.cpp:347] Agent using credential for: test-principal
I1209 16:00:16.161109 29718 credentials.hpp:37] Loading credentials for authentication from
'/tmp/Endpoint_SlaveEndpointTest_UnauthorizedRequest_1_t635Pm/http_credentials'
I1209 16:00:16.161393 29718 http.cpp:922] Using default 'basic' HTTP authenticator for realm
'mesos-agent-readonly'
I1209 16:00:16.161569 29718 http.cpp:922] Using default 'basic' HTTP authenticator for realm
'mesos-agent-readwrite'
I1209 16:00:16.162765 29718 slave.cpp:534] Agent resources: cpus(*):2; mem(*):1024; disk(*):1024;
ports(*):[31000-32000]
I1209 16:00:16.162868 29718 slave.cpp:542] Agent attributes: [  ]
I1209 16:00:16.162892 29718 slave.cpp:547] Agent hostname: bdbbcd5b8f96
I1209 16:00:16.164784 29722 state.cpp:57] Recovering state from '/tmp/Endpoint_SlaveEndpointTest_UnauthorizedRequest_1_s37ts5/meta'
I1209 16:00:16.165591 29716 status_update_manager.cpp:203] Recovering status update manager
I1209 16:00:16.165820 29724 containerizer.cpp:594] Recovering containerizer
I1209 16:00:16.167754 29718 provisioner.cpp:253] Provisioner recovery complete
I1209 16:00:16.168360 29714 slave.cpp:5415] Finished recovery
I1209 16:00:16.169227 29714 slave.cpp:5589] Querying resource estimator for oversubscribable
resources
I1209 16:00:16.169539 29715 slave.cpp:5603] Received oversubscribable resources {} from the
resource estimator
I1209 16:00:16.172152 29729 process.cpp:3679] Handling HTTP event for process 'slave(665)'
with path: '/slave(665)/monitor/statistics.json'
I1209 16:00:16.173673 29720 http.cpp:874] Authorizing principal 'test-principal' to GET the
'/monitor/statistics.json' endpoint
I1209 16:00:16.177196 29716 slave.cpp:791] Agent terminating
[       OK ] Endpoint/SlaveEndpointTest.UnauthorizedRequest/1 (33 ms)
[ RUN      ] Endpoint/SlaveEndpointTest.UnauthorizedRequest/2
I1209 16:00:16.188889 29695 containerizer.cpp:220] Using isolation: posix/cpu,posix/mem,filesystem/posix,network/cni
W1209 16:00:16.189545 29695 backend.cpp:76] Failed to create 'aufs' backend: AufsBackend requires
root privileges, but is running as user mesos
W1209 16:00:16.189739 29695 backend.cpp:76] Failed to create 'bind' backend: BindBackend requires
root privileges
I1209 16:00:16.192980 29718 slave.cpp:209] Mesos agent started on (666)@172.17.0.2:36670
I1209 16:00:16.193004 29718 slave.cpp:210] Flags at startup: --acls="" --appc_simple_discovery_uri_prefix="http://"
--appc_store_dir="/tmp/mesos/store/appc" --authenticate_http_readonly="true" --authenticate_http_readwrite="true"
--authenticatee="crammd5" --authentication_backoff_factor="1secs" --authorizer="local" --cgroups_cpu_enable_pids_and_tids_count="false"
--cgroups_enable_cfs="false" --cgroups_hierarchy="/sys/fs/cgroup" --cgroups_limit_swap="false"
--cgroups_root="mesos" --container_disk_watch_interval="15secs" --containerizers="mesos" --credential="/tmp/Endpoint_SlaveEndpointTest_UnauthorizedRequest_2_ZQgREu/credential"
--default_role="*" --disk_watch_interval="1mins" --docker="docker" --docker_kill_orphans="true"
--docker_registry="https://registry-1.docker.io" --docker_remove_delay="6hrs" --docker_socket="/var/run/docker.sock"
--docker_stop_timeout="0ns" --docker_store_dir="/tmp/mesos/store/docker" --docker_volume_checkpoint_dir="/var/run/mesos/isolators/docker/volume"
--enforce_container_disk_quota="false" --executor_registration_timeout="1mins" --executor_shutdown_grace_period="5secs"
--fetcher_cache_dir="/tmp/Endpoint_SlaveEndpointTest_UnauthorizedRequest_2_ZQgREu/fetch" --fetcher_cache_size="2GB"
--frameworks_home="" --gc_delay="1weeks" --gc_disk_headroom="0.1" --hadoop_home="" --help="false"
--hostname_lookup="true" --http_authenticators="basic" --http_command_executor="false" --http_credentials="/tmp/Endpoint_SlaveEndpointTest_UnauthorizedRequest_2_ZQgREu/http_credentials"
--image_provisioner_backend="copy" --initialize_driver_logging="true" --io_switchboard_enable_server="true"
--isolation="posix/cpu,posix/mem" --launcher="posix" --launcher_dir="/mesos/mesos-1.2.0/_build/src"
--logbufsecs="0" --logging_level="INFO" --max_completed_executors_per_framework="150" --oversubscribed_resources_interval="15secs"
--perf_duration="10secs" --perf_interval="1mins" --qos_correction_interval_min="0ns" --quiet="false"
--recover="reconnect" --recovery_timeout="15mins" --registration_backoff_factor="10ms" --resources="cpus:2;gpus:0;mem:1024;disk:1024;ports:[31000-32000]"
--revocable_cpu_low_priority="true" --runtime_dir="/tmp/Endpoint_SlaveEndpointTest_UnauthorizedRequest_2_ZQgREu"
--sandbox_directory="/mnt/mesos/sandbox" --strict="true" --switch_user="true" --systemd_enable_support="true"
--systemd_runtime_directory="/run/systemd/system" --version="false" --work_dir="/tmp/Endpoint_SlaveEndpointTest_UnauthorizedRequest_2_uPDRbd"
I1209 16:00:16.193440 29718 credentials.hpp:86] Loading credential for authentication from
'/tmp/Endpoint_SlaveEndpointTest_UnauthorizedRequest_2_ZQgREu/credential'
I1209 16:00:16.193553 29718 slave.cpp:347] Agent using credential for: test-principal
I1209 16:00:16.193572 29718 credentials.hpp:37] Loading credentials for authentication from
'/tmp/Endpoint_SlaveEndpointTest_UnauthorizedRequest_2_ZQgREu/http_credentials'
I1209 16:00:16.193755 29718 http.cpp:922] Using default 'basic' HTTP authenticator for realm
'mesos-agent-readonly'
I1209 16:00:16.193872 29718 http.cpp:922] Using default 'basic' HTTP authenticator for realm
'mesos-agent-readwrite'
I1209 16:00:16.194829 29718 slave.cpp:534] Agent resources: cpus(*):2; mem(*):1024; disk(*):1024;
ports(*):[31000-32000]
I1209 16:00:16.194933 29718 slave.cpp:542] Agent attributes: [  ]
I1209 16:00:16.194958 29718 slave.cpp:547] Agent hostname: bdbbcd5b8f96
I1209 16:00:16.196560 29721 state.cpp:57] Recovering state from '/tmp/Endpoint_SlaveEndpointTest_UnauthorizedRequest_2_uPDRbd/meta'
I1209 16:00:16.196895 29719 status_update_manager.cpp:203] Recovering status update manager
I1209 16:00:16.197168 29721 containerizer.cpp:594] Recovering containerizer
I1209 16:00:16.198398 29717 provisioner.cpp:253] Provisioner recovery complete
I1209 16:00:16.198784 29721 slave.cpp:5415] Finished recovery
I1209 16:00:16.199241 29721 slave.cpp:5589] Querying resource estimator for oversubscribable
resources
I1209 16:00:16.199515 29726 slave.cpp:5603] Received oversubscribable resources {} from the
resource estimator
I1209 16:00:16.201730 29721 process.cpp:3679] Handling HTTP event for process 'slave(666)'
with path: '/slave(666)/containers'
I1209 16:00:16.203223 29726 http.cpp:874] Authorizing principal 'test-principal' to GET the
'/containers' endpoint
I1209 16:00:16.205464 29720 slave.cpp:791] Agent terminating
[       OK ] Endpoint/SlaveEndpointTest.UnauthorizedRequest/2 (27 ms)
[ RUN      ] Endpoint/SlaveEndpointTest.NoAuthorizer/0
I1209 16:00:16.216068 29695 containerizer.cpp:220] Using isolation: posix/cpu,posix/mem,filesystem/posix,network/cni
W1209 16:00:16.216689 29695 backend.cpp:76] Failed to create 'aufs' backend: AufsBackend requires
root privileges, but is running as user mesos
W1209 16:00:16.216923 29695 backend.cpp:76] Failed to create 'bind' backend: BindBackend requires
root privileges
I1209 16:00:16.219849 29695 cluster.cpp:446] Creating default 'local' authorizer
I1209 16:00:16.221711 29719 slave.cpp:209] Mesos agent started on (667)@172.17.0.2:36670
I1209 16:00:16.221738 29719 slave.cpp:210] Flags at startup: --acls="" --appc_simple_discovery_uri_prefix="http://"
--appc_store_dir="/tmp/mesos/store/appc" --authenticate_http_readonly="true" --authenticate_http_readwrite="true"
--authenticatee="crammd5" --authentication_backoff_factor="1secs" --authorizer="local" --cgroups_cpu_enable_pids_and_tids_count="false"
--cgroups_enable_cfs="false" --cgroups_hierarchy="/sys/fs/cgroup" --cgroups_limit_swap="false"
--cgroups_root="mesos" --container_disk_watch_interval="15secs" --containerizers="mesos" --credential="/tmp/Endpoint_SlaveEndpointTest_NoAuthorizer_0_cHTSLC/credential"
--default_role="*" --disk_watch_interval="1mins" --docker="docker" --docker_kill_orphans="true"
--docker_registry="https://registry-1.docker.io" --docker_remove_delay="6hrs" --docker_socket="/var/run/docker.sock"
--docker_stop_timeout="0ns" --docker_store_dir="/tmp/mesos/store/docker" --docker_volume_checkpoint_dir="/var/run/mesos/isolators/docker/volume"
--enforce_container_disk_quota="false" --executor_registration_timeout="1mins" --executor_shutdown_grace_period="5secs"
--fetcher_cache_dir="/tmp/Endpoint_SlaveEndpointTest_NoAuthorizer_0_cHTSLC/fetch" --fetcher_cache_size="2GB"
--frameworks_home="" --gc_delay="1weeks" --gc_disk_headroom="0.1" --hadoop_home="" --help="false"
--hostname_lookup="true" --http_authenticators="basic" --http_command_executor="false" --http_credentials="/tmp/Endpoint_SlaveEndpointTest_NoAuthorizer_0_cHTSLC/http_credentials"
--image_provisioner_backend="copy" --initialize_driver_logging="true" --io_switchboard_enable_server="true"
--isolation="posix/cpu,posix/mem" --launcher="posix" --launcher_dir="/mesos/mesos-1.2.0/_build/src"
--logbufsecs="0" --logging_level="INFO" --max_completed_executors_per_framework="150" --oversubscribed_resources_interval="15secs"
--perf_duration="10secs" --perf_interval="1mins" --qos_correction_interval_min="0ns" --quiet="false"
--recover="reconnect" --recovery_timeout="15mins" --registration_backoff_factor="10ms" --resources="cpus:2;gpus:0;mem:1024;disk:1024;ports:[31000-32000]"
--revocable_cpu_low_priority="true" --runtime_dir="/tmp/Endpoint_SlaveEndpointTest_NoAuthorizer_0_cHTSLC"
--sandbox_directory="/mnt/mesos/sandbox" --strict="true" --switch_user="true" --systemd_enable_support="true"
--systemd_runtime_directory="/run/systemd/system" --version="false" --work_dir="/tmp/Endpoint_SlaveEndpointTest_NoAuthorizer_0_VDSsel"
I1209 16:00:16.222432 29719 credentials.hpp:86] Loading credential for authentication from
'/tmp/Endpoint_SlaveEndpointTest_NoAuthorizer_0_cHTSLC/credential'
I1209 16:00:16.222601 29719 slave.cpp:347] Agent using credential for: test-principal
I1209 16:00:16.222628 29719 credentials.hpp:37] Loading credentials for authentication from
'/tmp/Endpoint_SlaveEndpointTest_NoAuthorizer_0_cHTSLC/http_credentials'
I1209 16:00:16.222892 29719 http.cpp:922] Using default 'basic' HTTP authenticator for realm
'mesos-agent-readonly'
I1209 16:00:16.223042 29719 http.cpp:922] Using default 'basic' HTTP authenticator for realm
'mesos-agent-readwrite'
I1209 16:00:16.224261 29719 slave.cpp:534] Agent resources: cpus(*):2; mem(*):1024; disk(*):1024;
ports(*):[31000-32000]
I1209 16:00:16.224349 29719 slave.cpp:542] Agent attributes: [  ]
I1209 16:00:16.224364 29719 slave.cpp:547] Agent hostname: bdbbcd5b8f96
I1209 16:00:16.225771 29722 state.cpp:57] Recovering state from '/tmp/Endpoint_SlaveEndpointTest_NoAuthorizer_0_VDSsel/meta'
I1209 16:00:16.226078 29716 status_update_manager.cpp:203] Recovering status update manager
I1209 16:00:16.226280 29714 containerizer.cpp:594] Recovering containerizer
I1209 16:00:16.227704 29714 provisioner.cpp:253] Provisioner recovery complete
I1209 16:00:16.228106 29723 slave.cpp:5415] Finished recovery
I1209 16:00:16.228591 29723 slave.cpp:5589] Querying resource estimator for oversubscribable
resources
I1209 16:00:16.228952 29726 slave.cpp:5603] Received oversubscribable resources {} from the
resource estimator
I1209 16:00:16.230968 29718 process.cpp:3679] Handling HTTP event for process 'slave(667)'
with path: '/slave(667)/monitor/statistics'
I1209 16:00:16.232470 29715 http.cpp:874] Authorizing principal 'test-principal' to GET the
'/monitor/statistics' endpoint
I1209 16:00:16.236508 29728 slave.cpp:791] Agent terminating
[       OK ] Endpoint/SlaveEndpointTest.NoAuthorizer/0 (31 ms)
[ RUN      ] Endpoint/SlaveEndpointTest.NoAuthorizer/1
I1209 16:00:16.249047 29695 containerizer.cpp:220] Using isolation: posix/cpu,posix/mem,filesystem/posix,network/cni
W1209 16:00:16.249763 29695 backend.cpp:76] Failed to create 'aufs' backend: AufsBackend requires
root privileges, but is running as user mesos
W1209 16:00:16.249933 29695 backend.cpp:76] Failed to create 'bind' backend: BindBackend requires
root privileges
I1209 16:00:16.251893 29695 cluster.cpp:446] Creating default 'local' authorizer
I1209 16:00:16.253530 29715 slave.cpp:209] Mesos agent started on (668)@172.17.0.2:36670
I1209 16:00:16.253559 29715 slave.cpp:210] Flags at startup: --acls="" --appc_simple_discovery_uri_prefix="http://"
--appc_store_dir="/tmp/mesos/store/appc" --authenticate_http_readonly="true" --authenticate_http_readwrite="true"
--authenticatee="crammd5" --authentication_backoff_factor="1secs" --authorizer="local" --cgroups_cpu_enable_pids_and_tids_count="false"
--cgroups_enable_cfs="false" --cgroups_hierarchy="/sys/fs/cgroup" --cgroups_limit_swap="false"
--cgroups_root="mesos" --container_disk_watch_interval="15secs" --containerizers="mesos" --credential="/tmp/Endpoint_SlaveEndpointTest_NoAuthorizer_1_kF9qdL/credential"
--default_role="*" --disk_watch_interval="1mins" --docker="docker" --docker_kill_orphans="true"
--docker_registry="https://registry-1.docker.io" --docker_remove_delay="6hrs" --docker_socket="/var/run/docker.sock"
--docker_stop_timeout="0ns" --docker_store_dir="/tmp/mesos/store/docker" --docker_volume_checkpoint_dir="/var/run/mesos/isolators/docker/volume"
--enforce_container_disk_quota="false" --executor_registration_timeout="1mins" --executor_shutdown_grace_period="5secs"
--fetcher_cache_dir="/tmp/Endpoint_SlaveEndpointTest_NoAuthorizer_1_kF9qdL/fetch" --fetcher_cache_size="2GB"
--frameworks_home="" --gc_delay="1weeks" --gc_disk_headroom="0.1" --hadoop_home="" --help="false"
--hostname_lookup="true" --http_authenticators="basic" --http_command_executor="false" --http_credentials="/tmp/Endpoint_SlaveEndpointTest_NoAuthorizer_1_kF9qdL/http_credentials"
--image_provisioner_backend="copy" --initialize_driver_logging="true" --io_switchboard_enable_server="true"
--isolation="posix/cpu,posix/mem" --launcher="posix" --launcher_dir="/mesos/mesos-1.2.0/_build/src"
--logbufsecs="0" --logging_level="INFO" --max_completed_executors_per_framework="150" --oversubscribed_resources_interval="15secs"
--perf_duration="10secs" --perf_interval="1mins" --qos_correction_interval_min="0ns" --quiet="false"
--recover="reconnect" --recovery_timeout="15mins" --registration_backoff_factor="10ms" --resources="cpus:2;gpus:0;mem:1024;disk:1024;ports:[31000-32000]"
--revocable_cpu_low_priority="true" --runtime_dir="/tmp/Endpoint_SlaveEndpointTest_NoAuthorizer_1_kF9qdL"
--sandbox_directory="/mnt/mesos/sandbox" --strict="true" --switch_user="true" --systemd_enable_support="true"
--systemd_runtime_directory="/run/systemd/system" --version="false" --work_dir="/tmp/Endpoint_SlaveEndpointTest_NoAuthorizer_1_7R6JAt"
I1209 16:00:16.254359 29715 credentials.hpp:86] Loading credential for authentication from
'/tmp/Endpoint_SlaveEndpointTest_NoAuthorizer_1_kF9qdL/credential'
I1209 16:00:16.254554 29715 slave.cpp:347] Agent using credential for: test-principal
I1209 16:00:16.254585 29715 credentials.hpp:37] Loading credentials for authentication from
'/tmp/Endpoint_SlaveEndpointTest_NoAuthorizer_1_kF9qdL/http_credentials'
I1209 16:00:16.254931 29715 http.cpp:922] Using default 'basic' HTTP authenticator for realm
'mesos-agent-readonly'
I1209 16:00:16.255091 29715 http.cpp:922] Using default 'basic' HTTP authenticator for realm
'mesos-agent-readwrite'
I1209 16:00:16.256464 29715 slave.cpp:534] Agent resources: cpus(*):2; mem(*):1024; disk(*):1024;
ports(*):[31000-32000]
I1209 16:00:16.256570 29715 slave.cpp:542] Agent attributes: [  ]
I1209 16:00:16.256595 29715 slave.cpp:547] Agent hostname: bdbbcd5b8f96
I1209 16:00:16.258160 29714 state.cpp:57] Recovering state from '/tmp/Endpoint_SlaveEndpointTest_NoAuthorizer_1_7R6JAt/meta'
I1209 16:00:16.258533 29716 status_update_manager.cpp:203] Recovering status update manager
I1209 16:00:16.258786 29715 containerizer.cpp:594] Recovering containerizer
I1209 16:00:16.260470 29719 provisioner.cpp:253] Provisioner recovery complete
I1209 16:00:16.261052 29715 slave.cpp:5415] Finished recovery
I1209 16:00:16.261528 29715 slave.cpp:5589] Querying resource estimator for oversubscribable
resources
I1209 16:00:16.261801 29718 slave.cpp:5603] Received oversubscribable resources {} from the
resource estimator
I1209 16:00:16.264148 29724 process.cpp:3679] Handling HTTP event for process 'slave(668)'
with path: '/slave(668)/monitor/statistics.json'
I1209 16:00:16.265929 29724 http.cpp:874] Authorizing principal 'test-principal' to GET the
'/monitor/statistics.json' endpoint
I1209 16:00:16.270576 29724 slave.cpp:791] Agent terminating
[       OK ] Endpoint/SlaveEndpointTest.NoAuthorizer/1 (34 ms)
[ RUN      ] Endpoint/SlaveEndpointTest.NoAuthorizer/2
I1209 16:00:16.283125 29695 containerizer.cpp:220] Using isolation: posix/cpu,posix/mem,filesystem/posix,network/cni
W1209 16:00:16.283773 29695 backend.cpp:76] Failed to create 'aufs' backend: AufsBackend requires
root privileges, but is running as user mesos
W1209 16:00:16.283951 29695 backend.cpp:76] Failed to create 'bind' backend: BindBackend requires
root privileges
I1209 16:00:16.285918 29695 cluster.cpp:446] Creating default 'local' authorizer
I1209 16:00:16.287827 29722 slave.cpp:209] Mesos agent started on (669)@172.17.0.2:36670
I1209 16:00:16.287859 29722 slave.cpp:210] Flags at startup: --acls="" --appc_simple_discovery_uri_prefix="http://"
--appc_store_dir="/tmp/mesos/store/appc" --authenticate_http_readonly="true" --authenticate_http_readwrite="true"
--authenticatee="crammd5" --authentication_backoff_factor="1secs" --authorizer="local" --cgroups_cpu_enable_pids_and_tids_count="false"
--cgroups_enable_cfs="false" --cgroups_hierarchy="/sys/fs/cgroup" --cgroups_limit_swap="false"
--cgroups_root="mesos" --container_disk_watch_interval="15secs" --containerizers="mesos" --credential="/tmp/Endpoint_SlaveEndpointTest_NoAuthorizer_2_0dD10T/credential"
--default_role="*" --disk_watch_interval="1mins" --docker="docker" --docker_kill_orphans="true"
--docker_registry="https://registry-1.docker.io" --docker_remove_delay="6hrs" --docker_socket="/var/run/docker.sock"
--docker_stop_timeout="0ns" --docker_store_dir="/tmp/mesos/store/docker" --docker_volume_checkpoint_dir="/var/run/mesos/isolators/docker/volume"
--enforce_container_disk_quota="false" --executor_registration_timeout="1mins" --executor_shutdown_grace_period="5secs"
--fetcher_cache_dir="/tmp/Endpoint_SlaveEndpointTest_NoAuthorizer_2_0dD10T/fetch" --fetcher_cache_size="2GB"
--frameworks_home="" --gc_delay="1weeks" --gc_disk_headroom="0.1" --hadoop_home="" --help="false"
--hostname_lookup="true" --http_authenticators="basic" --http_command_executor="false" --http_credentials="/tmp/Endpoint_SlaveEndpointTest_NoAuthorizer_2_0dD10T/http_credentials"
--image_provisioner_backend="copy" --initialize_driver_logging="true" --io_switchboard_enable_server="true"
--isolation="posix/cpu,posix/mem" --launcher="posix" --launcher_dir="/mesos/mesos-1.2.0/_build/src"
--logbufsecs="0" --logging_level="INFO" --max_completed_executors_per_framework="150" --oversubscribed_resources_interval="15secs"
--perf_duration="10secs" --perf_interval="1mins" --qos_correction_interval_min="0ns" --quiet="false"
--recover="reconnect" --recovery_timeout="15mins" --registration_backoff_factor="10ms" --resources="cpus:2;gpus:0;mem:1024;disk:1024;ports:[31000-32000]"
--revocable_cpu_low_priority="true" --runtime_dir="/tmp/Endpoint_SlaveEndpointTest_NoAuthorizer_2_0dD10T"
--sandbox_directory="/mnt/mesos/sandbox" --strict="true" --switch_user="true" --systemd_enable_support="true"
--systemd_runtime_directory="/run/systemd/system" --version="false" --work_dir="/tmp/Endpoint_SlaveEndpointTest_NoAuthorizer_2_fLsMiC"
I1209 16:00:16.288388 29722 credentials.hpp:86] Loading credential for authentication from
'/tmp/Endpoint_SlaveEndpointTest_NoAuthorizer_2_0dD10T/credential'
I1209 16:00:16.288519 29722 slave.cpp:347] Agent using credential for: test-principal
I1209 16:00:16.288543 29722 credentials.hpp:37] Loading credentials for authentication from
'/tmp/Endpoint_SlaveEndpointTest_NoAuthorizer_2_0dD10T/http_credentials'
I1209 16:00:16.288758 29722 http.cpp:922] Using default 'basic' HTTP authenticator for realm
'mesos-agent-readonly'
I1209 16:00:16.288887 29722 http.cpp:922] Using default 'basic' HTTP authenticator for realm
'mesos-agent-readwrite'
I1209 16:00:16.289881 29722 slave.cpp:534] Agent resources: cpus(*):2; mem(*):1024; disk(*):1024;
ports(*):[31000-32000]
I1209 16:00:16.289963 29722 slave.cpp:542] Agent attributes: [  ]
I1209 16:00:16.289981 29722 slave.cpp:547] Agent hostname: bdbbcd5b8f96
I1209 16:00:16.291406 29729 state.cpp:57] Recovering state from '/tmp/Endpoint_SlaveEndpointTest_NoAuthorizer_2_fLsMiC/meta'
I1209 16:00:16.291654 29727 status_update_manager.cpp:203] Recovering status update manager
I1209 16:00:16.291995 29721 containerizer.cpp:594] Recovering containerizer
I1209 16:00:16.293287 29729 provisioner.cpp:253] Provisioner recovery complete
I1209 16:00:16.293731 29723 slave.cpp:5415] Finished recovery
I1209 16:00:16.294277 29723 slave.cpp:5589] Querying resource estimator for oversubscribable
resources
I1209 16:00:16.294836 29729 slave.cpp:5603] Received oversubscribable resources {} from the
resource estimator
I1209 16:00:16.296769 29726 process.cpp:3679] Handling HTTP event for process 'slave(669)'
with path: '/slave(669)/containers'
I1209 16:00:16.298203 29715 http.cpp:874] Authorizing principal 'test-principal' to GET the
'/containers' endpoint
I1209 16:00:16.302237 29727 slave.cpp:791] Agent terminating
[       OK ] Endpoint/SlaveEndpointTest.NoAuthorizer/2 (30 ms)
[----------] 9 tests from Endpoint/SlaveEndpointTest (287 ms total)

[----------] Global test environment tear-down
[==========] 1423 tests from 164 test cases ran. (553024 ms total)
[  PASSED  ] 1422 tests.
[  FAILED  ] 1 test, listed below:
[  FAILED  ] ContentType/SchedulerTest.TaskRunning/0, where GetParam() = application/x-protobuf

 1 FAILED TEST
  YOU HAVE 9 DISABLED TESTS

make[4]: *** [check-local] Error 1
make[4]: Leaving directory `/mesos/mesos-1.2.0/_build/src'
make[3]: *** [check-am] Error 2
make[3]: Leaving directory `/mesos/mesos-1.2.0/_build/src'
make[2]: *** [check] Error 2
make[2]: Leaving directory `/mesos/mesos-1.2.0/_build/src'
make[1]: *** [check-recursive] Error 1
make[1]: Leaving directory `/mesos/mesos-1.2.0/_build'
make: *** [distcheck] Error 1
+ docker rmi mesos-1481295739-30532
Untagged: mesos-1481295739-30532:latest
Deleted: sha256:cb81367d9fbdac79b3eb78de1befba01438682fdae4f5792d9b4dda7b48eb30f
Deleted: sha256:e613ec80970901406df69a75496897782b5dceffa1e6b78e543e17e9cdb66f05
Deleted: sha256:4034450bcd4006075d1f9f8f7c69e20bc848ae9a0e4f53238658ee379dbeb130
Deleted: sha256:b76d5573da9bf1f2548864e7dab18c13d589d6adac3fdfb8852a315680e2e221
Deleted: sha256:9f60bc5924e42fe34c6faa1bbfafda7463088d217d8dbf41284d3f990d7ba6ab
Deleted: sha256:feaf685f0787af131c4dc2f6fd7a10cba49811bde6c53fe409fe3ea874baeb43
Deleted: sha256:46c50b091048eebbc8a51bb821c38b4d90f5c849d3f483ac8008ee5f7f4f7210
Deleted: sha256:47f4c17c4d88fd0beddc1196282eccfe4e17c8f7374fefdc7eab2c148e0e997f
Deleted: sha256:c248c64b367a63885b948f55b2bc36756dbb2571cb36d31f427219207727a809
Deleted: sha256:ba4107a4183d8fb9ffd3ab4fdee33cb46ff039d5c264b9a466f42762768764cf
Deleted: sha256:1ca5dc4a080e251db9e18e8f6a03fe743d401f82262efcaadd66ab69259264bf
Deleted: sha256:45c33fd4567ce8eaeee797925ea7dd6c1fdb82f28fe1d85bbaab96d6854938dc
Deleted: sha256:78e363205dcdacd4be65401075b8d0813fe4b4b5fc4d494511339d724f9f0904
Deleted: sha256:907dc23ed0ce4b5d57e09b81b33d4259a1ee5878b2a72c92825a2746a9bd2288
Deleted: sha256:68f9f0537444430598b2dd191e05c2c3fd8ba4088ced5707787959ff76018f7e
Deleted: sha256:a42ec06d42a94e9d577b592a4add9fcac8500ce688f15a1f6c206c8481988bae
Deleted: sha256:af13627628a5b8f15b8044d8c2db1be9d98f09afc6173dc8f19745e2afaa67ac
Deleted: sha256:de4adde72092282ae720f605a72e0be9c898bdb3383cbfa91de9013cf9afa122
Deleted: sha256:022e240e4d62f604c9ed9b7c279ebcc88f14876db0da773486d87c79c44c4b30
Deleted: sha256:a61da0861f45fb59d6420335ea21b3f5fb2bef4300ebf24c808e8f87550a5530
Deleted: sha256:6e8da9842118b67b1963c9224cdf3735b856bf44d2b8282e5a578cc3a6e5df41
Deleted: sha256:7491833f6114b75db8eed1e01332f9f2d536e41de1c1de1f843d2e4e790691f0
Deleted: sha256:193630819c0a9e4919fe3ddbb8735723d17836f1ec65ac73e82966560afd800c
Deleted: sha256:8e4da9d4c5e05f0d162979e29d6cb91885eb347f922e1986636bd09998a6df34
Build step 'Execute shell' marked build as failure

Mime
View raw message