mesos-builds mailing list archives

Site index · List index
Message view « Date » · « Thread »
Top « Date » · « Thread »
From Apache Jenkins Server <jenk...@builds.apache.org>
Subject Build failed in Jenkins: Mesos » cmake,clang,--verbose,GLOG_v=1 MESOS_VERBOSE=1,ubuntu:14.04,(docker||Hadoop)&&(!ubuntu-us1)&&(!ubuntu-6)&&(!ubuntu-eu2) #3034
Date Wed, 14 Dec 2016 01:15:28 GMT
See <https://builds.apache.org/job/Mesos/BUILDTOOL=cmake,COMPILER=clang,CONFIGURATION=--verbose,ENVIRONMENT=GLOG_v=1%20MESOS_VERBOSE=1,OS=ubuntu%3A14.04,label_exp=(docker%7C%7CHadoop)&&(!ubuntu-us1)&&(!ubuntu-6)&&(!ubuntu-eu2)/3034/changes>

Changes:

[yujie.jay] Fixed the environment overriding order in MesosContainerizer.

[yujie.jay] Moved IOSwitchboardServerFlags nested inside IOSwitchboardServer.

[yujie.jay] Made some IOSwitchboardServer flags optional.

[yujie.jay] Fixed the tests by turning off agent subsystems in IOSwitchboard tests.

[yujie.jay] Added a TODO about agent subsystems check.

[vinodkone] Moved the `IOSwitchboardServer::isRequired` to `IOSwitchBoard`.

[vinodkone] Moved `IOSwitchboard::requiresServer()` implementation to cpp.

[alexr] Added John Kordich to contributors.

[toenshoff] Fixed tests by turning off agent subsystems in IOSwitchboard tests.

[anand] Acked correct task id in DefaultExecutorTest.KillTaskGroupOnTaskFailure.

[anand] Acked correct task id in DefaultExecutorTest.KillTask test.

[mpark] Windows: Fix build break in libprocess tests.

[adam] Fixed bug that prevented window size updates in the IOSwitchboard.

[anand] Removed test assumptions about arrival order of status updates.

------------------------------------------
[...truncated 161673 lines...]
[       OK ] Endpoint/SlaveEndpointTest.AuthorizedRequest/0 (14 ms)
[ RUN      ] Endpoint/SlaveEndpointTest.AuthorizedRequest/1
I1214 01:12:48.421620 24723 containerizer.cpp:220] Using isolation: posix/cpu,posix/mem,filesystem/posix,network/cni
W1214 01:12:48.422003 24723 backend.cpp:76] Failed to create 'aufs' backend: AufsBackend requires
root privileges, but is running as user mesos
W1214 01:12:48.422108 24723 backend.cpp:76] Failed to create 'bind' backend: BindBackend requires
root privileges
I1214 01:12:48.423820 24724 slave.cpp:209] Mesos agent started on (667)@172.17.0.3:33802
I1214 01:12:48.423853 24724 slave.cpp:210] Flags at startup: --acls="" --appc_simple_discovery_uri_prefix="http://"
--appc_store_dir="/tmp/mesos/store/appc" --authenticate_http_readonly="true" --authenticate_http_readwrite="true"
--authenticatee="crammd5" --authentication_backoff_factor="1secs" --authorizer="local" --cgroups_cpu_enable_pids_and_tids_count="false"
--cgroups_enable_cfs="false" --cgroups_hierarchy="/sys/fs/cgroup" --cgroups_limit_swap="false"
--cgroups_root="mesos" --container_disk_watch_interval="15secs" --containerizers="mesos" --credential="/tmp/Endpoint_SlaveEndpointTest_AuthorizedRequest_1_oO36e5/credential"
--default_role="*" --disk_watch_interval="1mins" --docker="docker" --docker_kill_orphans="true"
--docker_registry="https://registry-1.docker.io" --docker_remove_delay="6hrs" --docker_socket="/var/run/docker.sock"
--docker_stop_timeout="0ns" --docker_store_dir="/tmp/mesos/store/docker" --docker_volume_checkpoint_dir="/var/run/mesos/isolators/docker/volume"
--enforce_container_disk_quota="false" --executor_registration_timeout="1mins" --executor_shutdown_grace_period="5secs"
--fetcher_cache_dir="/tmp/Endpoint_SlaveEndpointTest_AuthorizedRequest_1_oO36e5/fetch" --fetcher_cache_size="2GB"
--frameworks_home="" --gc_delay="1weeks" --gc_disk_headroom="0.1" --hadoop_home="" --help="false"
--hostname_lookup="true" --http_authenticators="basic" --http_command_executor="false" --http_credentials="/tmp/Endpoint_SlaveEndpointTest_AuthorizedRequest_1_oO36e5/http_credentials"
--http_heartbeat_interval="30secs" --image_provisioner_backend="copy" --initialize_driver_logging="true"
--isolation="posix/cpu,posix/mem" --launcher="posix" --launcher_dir="/mesos/build/src" --logbufsecs="0"
--logging_level="INFO" --max_completed_executors_per_framework="150" --oversubscribed_resources_interval="15secs"
--perf_duration="10secs" --perf_interval="1mins" --qos_correction_interval_min="0ns" --quiet="false"
--recover="reconnect" --recovery_timeout="15mins" --registration_backoff_factor="10ms" --resources="cpus:2;gpus:0;mem:1024;disk:1024;ports:[31000-32000]"
--revocable_cpu_low_priority="true" --runtime_dir="/tmp/Endpoint_SlaveEndpointTest_AuthorizedRequest_1_oO36e5"
--sandbox_directory="/mnt/mesos/sandbox" --strict="true" --switch_user="true" --systemd_enable_support="true"
--systemd_runtime_directory="/run/systemd/system" --version="false" --work_dir="/tmp/Endpoint_SlaveEndpointTest_AuthorizedRequest_1_xZW0ZG"
I1214 01:12:48.424378 24724 credentials.hpp:86] Loading credential for authentication from
'/tmp/Endpoint_SlaveEndpointTest_AuthorizedRequest_1_oO36e5/credential'
I1214 01:12:48.424489 24724 slave.cpp:352] Agent using credential for: test-principal
I1214 01:12:48.424507 24724 credentials.hpp:37] Loading credentials for authentication from
'/tmp/Endpoint_SlaveEndpointTest_AuthorizedRequest_1_oO36e5/http_credentials'
I1214 01:12:48.424619 24724 http.cpp:922] Using default 'basic' HTTP authenticator for realm
'mesos-agent-readonly'
I1214 01:12:48.424667 24724 http.cpp:922] Using default 'basic' HTTP authenticator for realm
'mesos-agent-readwrite'
I1214 01:12:48.424968 24724 slave.cpp:539] Agent resources: cpus(*):2; mem(*):1024; disk(*):1024;
ports(*):[31000-32000]
I1214 01:12:48.424998 24724 slave.cpp:547] Agent attributes: [  ]
I1214 01:12:48.425004 24724 slave.cpp:552] Agent hostname: 33c94b1eb72f
I1214 01:12:48.425416 24731 state.cpp:57] Recovering state from '/tmp/Endpoint_SlaveEndpointTest_AuthorizedRequest_1_xZW0ZG/meta'
I1214 01:12:48.425565 24735 status_update_manager.cpp:203] Recovering status update manager
I1214 01:12:48.425748 24730 containerizer.cpp:594] Recovering containerizer
I1214 01:12:48.426363 24732 provisioner.cpp:253] Provisioner recovery complete
I1214 01:12:48.426645 24734 slave.cpp:5420] Finished recovery
I1214 01:12:48.427085 24734 slave.cpp:5594] Querying resource estimator for oversubscribable
resources
I1214 01:12:48.427278 24736 slave.cpp:5608] Received oversubscribable resources {} from the
resource estimator
I1214 01:12:48.427968 24726 process.cpp:3679] Handling HTTP event for process 'slave(667)'
with path: '/slave(667)/monitor/statistics.json'
I1214 01:12:48.428423 24734 http.cpp:874] Authorizing principal 'test-principal' to GET the
'/monitor/statistics.json' endpoint
I1214 01:12:48.430052 24735 slave.cpp:796] Agent terminating
[       OK ] Endpoint/SlaveEndpointTest.AuthorizedRequest/1 (15 ms)
[ RUN      ] Endpoint/SlaveEndpointTest.AuthorizedRequest/2
I1214 01:12:48.447090 24723 containerizer.cpp:220] Using isolation: posix/cpu,posix/mem,filesystem/posix,network/cni
W1214 01:12:48.447520 24723 backend.cpp:76] Failed to create 'aufs' backend: AufsBackend requires
root privileges, but is running as user mesos
W1214 01:12:48.447631 24723 backend.cpp:76] Failed to create 'bind' backend: BindBackend requires
root privileges
I1214 01:12:48.449921 24737 slave.cpp:209] Mesos agent started on (668)@172.17.0.3:33802
I1214 01:12:48.449954 24737 slave.cpp:210] Flags at startup: --acls="" --appc_simple_discovery_uri_prefix="http://"
--appc_store_dir="/tmp/mesos/store/appc" --authenticate_http_readonly="true" --authenticate_http_readwrite="true"
--authenticatee="crammd5" --authentication_backoff_factor="1secs" --authorizer="local" --cgroups_cpu_enable_pids_and_tids_count="false"
--cgroups_enable_cfs="false" --cgroups_hierarchy="/sys/fs/cgroup" --cgroups_limit_swap="false"
--cgroups_root="mesos" --container_disk_watch_interval="15secs" --containerizers="mesos" --credential="/tmp/Endpoint_SlaveEndpointTest_AuthorizedRequest_2_YO4EpE/credential"
--default_role="*" --disk_watch_interval="1mins" --docker="docker" --docker_kill_orphans="true"
--docker_registry="https://registry-1.docker.io" --docker_remove_delay="6hrs" --docker_socket="/var/run/docker.sock"
--docker_stop_timeout="0ns" --docker_store_dir="/tmp/mesos/store/docker" --docker_volume_checkpoint_dir="/var/run/mesos/isolators/docker/volume"
--enforce_container_disk_quota="false" --executor_registration_timeout="1mins" --executor_shutdown_grace_period="5secs"
--fetcher_cache_dir="/tmp/Endpoint_SlaveEndpointTest_AuthorizedRequest_2_YO4EpE/fetch" --fetcher_cache_size="2GB"
--frameworks_home="" --gc_delay="1weeks" --gc_disk_headroom="0.1" --hadoop_home="" --help="false"
--hostname_lookup="true" --http_authenticators="basic" --http_command_executor="false" --http_credentials="/tmp/Endpoint_SlaveEndpointTest_AuthorizedRequest_2_YO4EpE/http_credentials"
--http_heartbeat_interval="30secs" --image_provisioner_backend="copy" --initialize_driver_logging="true"
--isolation="posix/cpu,posix/mem" --launcher="posix" --launcher_dir="/mesos/build/src" --logbufsecs="0"
--logging_level="INFO" --max_completed_executors_per_framework="150" --oversubscribed_resources_interval="15secs"
--perf_duration="10secs" --perf_interval="1mins" --qos_correction_interval_min="0ns" --quiet="false"
--recover="reconnect" --recovery_timeout="15mins" --registration_backoff_factor="10ms" --resources="cpus:2;gpus:0;mem:1024;disk:1024;ports:[31000-32000]"
--revocable_cpu_low_priority="true" --runtime_dir="/tmp/Endpoint_SlaveEndpointTest_AuthorizedRequest_2_YO4EpE"
--sandbox_directory="/mnt/mesos/sandbox" --strict="true" --switch_user="true" --systemd_enable_support="true"
--systemd_runtime_directory="/run/systemd/system" --version="false" --work_dir="/tmp/Endpoint_SlaveEndpointTest_AuthorizedRequest_2_JzPC6f"
I1214 01:12:48.450446 24737 credentials.hpp:86] Loading credential for authentication from
'/tmp/Endpoint_SlaveEndpointTest_AuthorizedRequest_2_YO4EpE/credential'
I1214 01:12:48.450556 24737 slave.cpp:352] Agent using credential for: test-principal
I1214 01:12:48.450572 24737 credentials.hpp:37] Loading credentials for authentication from
'/tmp/Endpoint_SlaveEndpointTest_AuthorizedRequest_2_YO4EpE/http_credentials'
I1214 01:12:48.450690 24737 http.cpp:922] Using default 'basic' HTTP authenticator for realm
'mesos-agent-readonly'
I1214 01:12:48.450745 24737 http.cpp:922] Using default 'basic' HTTP authenticator for realm
'mesos-agent-readwrite'
I1214 01:12:48.451172 24737 slave.cpp:539] Agent resources: cpus(*):2; mem(*):1024; disk(*):1024;
ports(*):[31000-32000]
I1214 01:12:48.451215 24737 slave.cpp:547] Agent attributes: [  ]
I1214 01:12:48.451221 24737 slave.cpp:552] Agent hostname: 33c94b1eb72f
I1214 01:12:48.452052 24739 state.cpp:57] Recovering state from '/tmp/Endpoint_SlaveEndpointTest_AuthorizedRequest_2_JzPC6f/meta'
I1214 01:12:48.452534 24735 status_update_manager.cpp:203] Recovering status update manager
I1214 01:12:48.452708 24735 containerizer.cpp:594] Recovering containerizer
I1214 01:12:48.453727 24736 provisioner.cpp:253] Provisioner recovery complete
I1214 01:12:48.454165 24732 slave.cpp:5420] Finished recovery
I1214 01:12:48.454696 24732 slave.cpp:5594] Querying resource estimator for oversubscribable
resources
I1214 01:12:48.455102 24726 slave.cpp:5608] Received oversubscribable resources {} from the
resource estimator
I1214 01:12:48.455899 24732 process.cpp:3679] Handling HTTP event for process 'slave(668)'
with path: '/slave(668)/containers'
I1214 01:12:48.456488 24738 http.cpp:874] Authorizing principal 'test-principal' to GET the
'/containers' endpoint
I1214 01:12:48.458837 24733 slave.cpp:796] Agent terminating
[       OK ] Endpoint/SlaveEndpointTest.AuthorizedRequest/2 (22 ms)
[ RUN      ] Endpoint/SlaveEndpointTest.UnauthorizedRequest/0
I1214 01:12:48.466981 24723 containerizer.cpp:220] Using isolation: posix/cpu,posix/mem,filesystem/posix,network/cni
W1214 01:12:48.467356 24723 backend.cpp:76] Failed to create 'aufs' backend: AufsBackend requires
root privileges, but is running as user mesos
W1214 01:12:48.467466 24723 backend.cpp:76] Failed to create 'bind' backend: BindBackend requires
root privileges
I1214 01:12:48.469249 24726 slave.cpp:209] Mesos agent started on (669)@172.17.0.3:33802
I1214 01:12:48.469281 24726 slave.cpp:210] Flags at startup: --acls="" --appc_simple_discovery_uri_prefix="http://"
--appc_store_dir="/tmp/mesos/store/appc" --authenticate_http_readonly="true" --authenticate_http_readwrite="true"
--authenticatee="crammd5" --authentication_backoff_factor="1secs" --authorizer="local" --cgroups_cpu_enable_pids_and_tids_count="false"
--cgroups_enable_cfs="false" --cgroups_hierarchy="/sys/fs/cgroup" --cgroups_limit_swap="false"
--cgroups_root="mesos" --container_disk_watch_interval="15secs" --containerizers="mesos" --credential="/tmp/Endpoint_SlaveEndpointTest_UnauthorizedRequest_0_8tLwPd/credential"
--default_role="*" --disk_watch_interval="1mins" --docker="docker" --docker_kill_orphans="true"
--docker_registry="https://registry-1.docker.io" --docker_remove_delay="6hrs" --docker_socket="/var/run/docker.sock"
--docker_stop_timeout="0ns" --docker_store_dir="/tmp/mesos/store/docker" --docker_volume_checkpoint_dir="/var/run/mesos/isolators/docker/volume"
--enforce_container_disk_quota="false" --executor_registration_timeout="1mins" --executor_shutdown_grace_period="5secs"
--fetcher_cache_dir="/tmp/Endpoint_SlaveEndpointTest_UnauthorizedRequest_0_8tLwPd/fetch" --fetcher_cache_size="2GB"
--frameworks_home="" --gc_delay="1weeks" --gc_disk_headroom="0.1" --hadoop_home="" --help="false"
--hostname_lookup="true" --http_authenticators="basic" --http_command_executor="false" --http_credentials="/tmp/Endpoint_SlaveEndpointTest_UnauthorizedRequest_0_8tLwPd/http_credentials"
--http_heartbeat_interval="30secs" --image_provisioner_backend="copy" --initialize_driver_logging="true"
--isolation="posix/cpu,posix/mem" --launcher="posix" --launcher_dir="/mesos/build/src" --logbufsecs="0"
--logging_level="INFO" --max_completed_executors_per_framework="150" --oversubscribed_resources_interval="15secs"
--perf_duration="10secs" --perf_interval="1mins" --qos_correction_interval_min="0ns" --quiet="false"
--recover="reconnect" --recovery_timeout="15mins" --registration_backoff_factor="10ms" --resources="cpus:2;gpus:0;mem:1024;disk:1024;ports:[31000-32000]"
--revocable_cpu_low_priority="true" --runtime_dir="/tmp/Endpoint_SlaveEndpointTest_UnauthorizedRequest_0_8tLwPd"
--sandbox_directory="/mnt/mesos/sandbox" --strict="true" --switch_user="true" --systemd_enable_support="true"
--systemd_runtime_directory="/run/systemd/system" --version="false" --work_dir="/tmp/Endpoint_SlaveEndpointTest_UnauthorizedRequest_0_D2a4sP"
I1214 01:12:48.469722 24726 credentials.hpp:86] Loading credential for authentication from
'/tmp/Endpoint_SlaveEndpointTest_UnauthorizedRequest_0_8tLwPd/credential'
I1214 01:12:48.469853 24726 slave.cpp:352] Agent using credential for: test-principal
I1214 01:12:48.469871 24726 credentials.hpp:37] Loading credentials for authentication from
'/tmp/Endpoint_SlaveEndpointTest_UnauthorizedRequest_0_8tLwPd/http_credentials'
I1214 01:12:48.470028 24726 http.cpp:922] Using default 'basic' HTTP authenticator for realm
'mesos-agent-readonly'
I1214 01:12:48.470088 24726 http.cpp:922] Using default 'basic' HTTP authenticator for realm
'mesos-agent-readwrite'
I1214 01:12:48.470664 24726 slave.cpp:539] Agent resources: cpus(*):2; mem(*):1024; disk(*):1024;
ports(*):[31000-32000]
I1214 01:12:48.470706 24726 slave.cpp:547] Agent attributes: [  ]
I1214 01:12:48.470713 24726 slave.cpp:552] Agent hostname: 33c94b1eb72f
I1214 01:12:48.471405 24727 state.cpp:57] Recovering state from '/tmp/Endpoint_SlaveEndpointTest_UnauthorizedRequest_0_D2a4sP/meta'
I1214 01:12:48.471542 24726 status_update_manager.cpp:203] Recovering status update manager
I1214 01:12:48.471707 24728 containerizer.cpp:594] Recovering containerizer
I1214 01:12:48.472466 24724 provisioner.cpp:253] Provisioner recovery complete
I1214 01:12:48.472710 24736 slave.cpp:5420] Finished recovery
I1214 01:12:48.473191 24736 slave.cpp:5594] Querying resource estimator for oversubscribable
resources
I1214 01:12:48.473338 24726 slave.cpp:5608] Received oversubscribable resources {} from the
resource estimator
I1214 01:12:48.474284 24735 process.cpp:3679] Handling HTTP event for process 'slave(669)'
with path: '/slave(669)/monitor/statistics'
I1214 01:12:48.475142 24727 http.cpp:874] Authorizing principal 'test-principal' to GET the
'/monitor/statistics' endpoint
I1214 01:12:48.476696 24737 slave.cpp:796] Agent terminating
[       OK ] Endpoint/SlaveEndpointTest.UnauthorizedRequest/0 (15 ms)
[ RUN      ] Endpoint/SlaveEndpointTest.UnauthorizedRequest/1
I1214 01:12:48.483395 24723 containerizer.cpp:220] Using isolation: posix/cpu,posix/mem,filesystem/posix,network/cni
W1214 01:12:48.483762 24723 backend.cpp:76] Failed to create 'aufs' backend: AufsBackend requires
root privileges, but is running as user mesos
W1214 01:12:48.483893 24723 backend.cpp:76] Failed to create 'bind' backend: BindBackend requires
root privileges
I1214 01:12:48.485239 24733 slave.cpp:209] Mesos agent started on (670)@172.17.0.3:33802
I1214 01:12:48.485270 24733 slave.cpp:210] Flags at startup: --acls="" --appc_simple_discovery_uri_prefix="http://"
--appc_store_dir="/tmp/mesos/store/appc" --authenticate_http_readonly="true" --authenticate_http_readwrite="true"
--authenticatee="crammd5" --authentication_backoff_factor="1secs" --authorizer="local" --cgroups_cpu_enable_pids_and_tids_count="false"
--cgroups_enable_cfs="false" --cgroups_hierarchy="/sys/fs/cgroup" --cgroups_limit_swap="false"
--cgroups_root="mesos" --container_disk_watch_interval="15secs" --containerizers="mesos" --credential="/tmp/Endpoint_SlaveEndpointTest_UnauthorizedRequest_1_AIdvqN/credential"
--default_role="*" --disk_watch_interval="1mins" --docker="docker" --docker_kill_orphans="true"
--docker_registry="https://registry-1.docker.io" --docker_remove_delay="6hrs" --docker_socket="/var/run/docker.sock"
--docker_stop_timeout="0ns" --docker_store_dir="/tmp/mesos/store/docker" --docker_volume_checkpoint_dir="/var/run/mesos/isolators/docker/volume"
--enforce_container_disk_quota="false" --executor_registration_timeout="1mins" --executor_shutdown_grace_period="5secs"
--fetcher_cache_dir="/tmp/Endpoint_SlaveEndpointTest_UnauthorizedRequest_1_AIdvqN/fetch" --fetcher_cache_size="2GB"
--frameworks_home="" --gc_delay="1weeks" --gc_disk_headroom="0.1" --hadoop_home="" --help="false"
--hostname_lookup="true" --http_authenticators="basic" --http_command_executor="false" --http_credentials="/tmp/Endpoint_SlaveEndpointTest_UnauthorizedRequest_1_AIdvqN/http_credentials"
--http_heartbeat_interval="30secs" --image_provisioner_backend="copy" --initialize_driver_logging="true"
--isolation="posix/cpu,posix/mem" --launcher="posix" --launcher_dir="/mesos/build/src" --logbufsecs="0"
--logging_level="INFO" --max_completed_executors_per_framework="150" --oversubscribed_resources_interval="15secs"
--perf_duration="10secs" --perf_interval="1mins" --qos_correction_interval_min="0ns" --quiet="false"
--recover="reconnect" --recovery_timeout="15mins" --registration_backoff_factor="10ms" --resources="cpus:2;gpus:0;mem:1024;disk:1024;ports:[31000-32000]"
--revocable_cpu_low_priority="true" --runtime_dir="/tmp/Endpoint_SlaveEndpointTest_UnauthorizedRequest_1_AIdvqN"
--sandbox_directory="/mnt/mesos/sandbox" --strict="true" --switch_user="true" --systemd_enable_support="true"
--systemd_runtime_directory="/run/systemd/system" --version="false" --work_dir="/tmp/Endpoint_SlaveEndpointTest_UnauthorizedRequest_1_JAIl1o"
I1214 01:12:48.485746 24733 credentials.hpp:86] Loading credential for authentication from
'/tmp/Endpoint_SlaveEndpointTest_UnauthorizedRequest_1_AIdvqN/credential'
I1214 01:12:48.485854 24733 slave.cpp:352] Agent using credential for: test-principal
I1214 01:12:48.485870 24733 credentials.hpp:37] Loading credentials for authentication from
'/tmp/Endpoint_SlaveEndpointTest_UnauthorizedRequest_1_AIdvqN/http_credentials'
I1214 01:12:48.485988 24733 http.cpp:922] Using default 'basic' HTTP authenticator for realm
'mesos-agent-readonly'
I1214 01:12:48.486040 24733 http.cpp:922] Using default 'basic' HTTP authenticator for realm
'mesos-agent-readwrite'
I1214 01:12:48.486438 24733 slave.cpp:539] Agent resources: cpus(*):2; mem(*):1024; disk(*):1024;
ports(*):[31000-32000]
I1214 01:12:48.486480 24733 slave.cpp:547] Agent attributes: [  ]
I1214 01:12:48.486487 24733 slave.cpp:552] Agent hostname: 33c94b1eb72f
I1214 01:12:48.486954 24733 state.cpp:57] Recovering state from '/tmp/Endpoint_SlaveEndpointTest_UnauthorizedRequest_1_JAIl1o/meta'
I1214 01:12:48.487167 24737 status_update_manager.cpp:203] Recovering status update manager
I1214 01:12:48.487301 24725 containerizer.cpp:594] Recovering containerizer
I1214 01:12:48.487927 24737 provisioner.cpp:253] Provisioner recovery complete
I1214 01:12:48.488279 24731 slave.cpp:5420] Finished recovery
I1214 01:12:48.488710 24731 slave.cpp:5594] Querying resource estimator for oversubscribable
resources
I1214 01:12:48.488884 24737 slave.cpp:5608] Received oversubscribable resources {} from the
resource estimator
I1214 01:12:48.489689 24732 process.cpp:3679] Handling HTTP event for process 'slave(670)'
with path: '/slave(670)/monitor/statistics.json'
I1214 01:12:48.490162 24739 http.cpp:874] Authorizing principal 'test-principal' to GET the
'/monitor/statistics.json' endpoint
I1214 01:12:48.491477 24738 slave.cpp:796] Agent terminating
[       OK ] Endpoint/SlaveEndpointTest.UnauthorizedRequest/1 (14 ms)
[ RUN      ] Endpoint/SlaveEndpointTest.UnauthorizedRequest/2
I1214 01:12:48.528033 24723 containerizer.cpp:220] Using isolation: posix/cpu,posix/mem,filesystem/posix,network/cni
W1214 01:12:48.528453 24723 backend.cpp:76] Failed to create 'aufs' backend: AufsBackend requires
root privileges, but is running as user mesos
W1214 01:12:48.528550 24723 backend.cpp:76] Failed to create 'bind' backend: BindBackend requires
root privileges
I1214 01:12:48.529971 24726 slave.cpp:209] Mesos agent started on (671)@172.17.0.3:33802
I1214 01:12:48.530000 24726 slave.cpp:210] Flags at startup: --acls="" --appc_simple_discovery_uri_prefix="http://"
--appc_store_dir="/tmp/mesos/store/appc" --authenticate_http_readonly="true" --authenticate_http_readwrite="true"
--authenticatee="crammd5" --authentication_backoff_factor="1secs" --authorizer="local" --cgroups_cpu_enable_pids_and_tids_count="false"
--cgroups_enable_cfs="false" --cgroups_hierarchy="/sys/fs/cgroup" --cgroups_limit_swap="false"
--cgroups_root="mesos" --container_disk_watch_interval="15secs" --containerizers="mesos" --credential="/tmp/Endpoint_SlaveEndpointTest_UnauthorizedRequest_2_uG3Gpn/credential"
--default_role="*" --disk_watch_interval="1mins" --docker="docker" --docker_kill_orphans="true"
--docker_registry="https://registry-1.docker.io" --docker_remove_delay="6hrs" --docker_socket="/var/run/docker.sock"
--docker_stop_timeout="0ns" --docker_store_dir="/tmp/mesos/store/docker" --docker_volume_checkpoint_dir="/var/run/mesos/isolators/docker/volume"
--enforce_container_disk_quota="false" --executor_registration_timeout="1mins" --executor_shutdown_grace_period="5secs"
--fetcher_cache_dir="/tmp/Endpoint_SlaveEndpointTest_UnauthorizedRequest_2_uG3Gpn/fetch" --fetcher_cache_size="2GB"
--frameworks_home="" --gc_delay="1weeks" --gc_disk_headroom="0.1" --hadoop_home="" --help="false"
--hostname_lookup="true" --http_authenticators="basic" --http_command_executor="false" --http_credentials="/tmp/Endpoint_SlaveEndpointTest_UnauthorizedRequest_2_uG3Gpn/http_credentials"
--http_heartbeat_interval="30secs" --image_provisioner_backend="copy" --initialize_driver_logging="true"
--isolation="posix/cpu,posix/mem" --launcher="posix" --launcher_dir="/mesos/build/src" --logbufsecs="0"
--logging_level="INFO" --max_completed_executors_per_framework="150" --oversubscribed_resources_interval="15secs"
--perf_duration="10secs" --perf_interval="1mins" --qos_correction_interval_min="0ns" --quiet="false"
--recover="reconnect" --recovery_timeout="15mins" --registration_backoff_factor="10ms" --resources="cpus:2;gpus:0;mem:1024;disk:1024;ports:[31000-32000]"
--revocable_cpu_low_priority="true" --runtime_dir="/tmp/Endpoint_SlaveEndpointTest_UnauthorizedRequest_2_uG3Gpn"
--sandbox_directory="/mnt/mesos/sandbox" --strict="true" --switch_user="true" --systemd_enable_support="true"
--systemd_runtime_directory="/run/systemd/system" --version="false" --work_dir="/tmp/Endpoint_SlaveEndpointTest_UnauthorizedRequest_2_ns6iTY"
I1214 01:12:48.530413 24726 credentials.hpp:86] Loading credential for authentication from
'/tmp/Endpoint_SlaveEndpointTest_UnauthorizedRequest_2_uG3Gpn/credential'
I1214 01:12:48.530516 24726 slave.cpp:352] Agent using credential for: test-principal
I1214 01:12:48.530535 24726 credentials.hpp:37] Loading credentials for authentication from
'/tmp/Endpoint_SlaveEndpointTest_UnauthorizedRequest_2_uG3Gpn/http_credentials'
I1214 01:12:48.530668 24726 http.cpp:922] Using default 'basic' HTTP authenticator for realm
'mesos-agent-readonly'
I1214 01:12:48.530733 24726 http.cpp:922] Using default 'basic' HTTP authenticator for realm
'mesos-agent-readwrite'
I1214 01:12:48.531158 24726 slave.cpp:539] Agent resources: cpus(*):2; mem(*):1024; disk(*):1024;
ports(*):[31000-32000]
I1214 01:12:48.531204 24726 slave.cpp:547] Agent attributes: [  ]
I1214 01:12:48.531215 24726 slave.cpp:552] Agent hostname: 33c94b1eb72f
I1214 01:12:48.531710 24732 state.cpp:57] Recovering state from '/tmp/Endpoint_SlaveEndpointTest_UnauthorizedRequest_2_ns6iTY/meta'
I1214 01:12:48.531898 24724 status_update_manager.cpp:203] Recovering status update manager
I1214 01:12:48.532142 24725 containerizer.cpp:594] Recovering containerizer
I1214 01:12:48.532887 24737 provisioner.cpp:253] Provisioner recovery complete
I1214 01:12:48.533143 24725 slave.cpp:5420] Finished recovery
I1214 01:12:48.533581 24725 slave.cpp:5594] Querying resource estimator for oversubscribable
resources
I1214 01:12:48.533807 24728 slave.cpp:5608] Received oversubscribable resources {} from the
resource estimator
I1214 01:12:48.534479 24735 process.cpp:3679] Handling HTTP event for process 'slave(671)'
with path: '/slave(671)/containers'
I1214 01:12:48.535020 24732 http.cpp:874] Authorizing principal 'test-principal' to GET the
'/containers' endpoint
I1214 01:12:48.536561 24736 slave.cpp:796] Agent terminating
[       OK ] Endpoint/SlaveEndpointTest.UnauthorizedRequest/2 (14 ms)
[ RUN      ] Endpoint/SlaveEndpointTest.NoAuthorizer/0
I1214 01:12:48.548629 24723 containerizer.cpp:220] Using isolation: posix/cpu,posix/mem,filesystem/posix,network/cni
W1214 01:12:48.549005 24723 backend.cpp:76] Failed to create 'aufs' backend: AufsBackend requires
root privileges, but is running as user mesos
W1214 01:12:48.549094 24723 backend.cpp:76] Failed to create 'bind' backend: BindBackend requires
root privileges
I1214 01:12:48.549968 24723 cluster.cpp:446] Creating default 'local' authorizer
I1214 01:12:48.550735 24729 slave.cpp:209] Mesos agent started on (672)@172.17.0.3:33802
I1214 01:12:48.550770 24729 slave.cpp:210] Flags at startup: --acls="" --appc_simple_discovery_uri_prefix="http://"
--appc_store_dir="/tmp/mesos/store/appc" --authenticate_http_readonly="true" --authenticate_http_readwrite="true"
--authenticatee="crammd5" --authentication_backoff_factor="1secs" --authorizer="local" --cgroups_cpu_enable_pids_and_tids_count="false"
--cgroups_enable_cfs="false" --cgroups_hierarchy="/sys/fs/cgroup" --cgroups_limit_swap="false"
--cgroups_root="mesos" --container_disk_watch_interval="15secs" --containerizers="mesos" --credential="/tmp/Endpoint_SlaveEndpointTest_NoAuthorizer_0_Gmz5FX/credential"
--default_role="*" --disk_watch_interval="1mins" --docker="docker" --docker_kill_orphans="true"
--docker_registry="https://registry-1.docker.io" --docker_remove_delay="6hrs" --docker_socket="/var/run/docker.sock"
--docker_stop_timeout="0ns" --docker_store_dir="/tmp/mesos/store/docker" --docker_volume_checkpoint_dir="/var/run/mesos/isolators/docker/volume"
--enforce_container_disk_quota="false" --executor_registration_timeout="1mins" --executor_shutdown_grace_period="5secs"
--fetcher_cache_dir="/tmp/Endpoint_SlaveEndpointTest_NoAuthorizer_0_Gmz5FX/fetch" --fetcher_cache_size="2GB"
--frameworks_home="" --gc_delay="1weeks" --gc_disk_headroom="0.1" --hadoop_home="" --help="false"
--hostname_lookup="true" --http_authenticators="basic" --http_command_executor="false" --http_credentials="/tmp/Endpoint_SlaveEndpointTest_NoAuthorizer_0_Gmz5FX/http_credentials"
--http_heartbeat_interval="30secs" --image_provisioner_backend="copy" --initialize_driver_logging="true"
--isolation="posix/cpu,posix/mem" --launcher="posix" --launcher_dir="/mesos/build/src" --logbufsecs="0"
--logging_level="INFO" --max_completed_executors_per_framework="150" --oversubscribed_resources_interval="15secs"
--perf_duration="10secs" --perf_interval="1mins" --qos_correction_interval_min="0ns" --quiet="false"
--recover="reconnect" --recovery_timeout="15mins" --registration_backoff_factor="10ms" --resources="cpus:2;gpus:0;mem:1024;disk:1024;ports:[31000-32000]"
--revocable_cpu_low_priority="true" --runtime_dir="/tmp/Endpoint_SlaveEndpointTest_NoAuthorizer_0_Gmz5FX"
--sandbox_directory="/mnt/mesos/sandbox" --strict="true" --switch_user="true" --systemd_enable_support="true"
--systemd_runtime_directory="/run/systemd/system" --version="false" --work_dir="/tmp/Endpoint_SlaveEndpointTest_NoAuthorizer_0_rlro6y"
I1214 01:12:48.551362 24729 credentials.hpp:86] Loading credential for authentication from
'/tmp/Endpoint_SlaveEndpointTest_NoAuthorizer_0_Gmz5FX/credential'
I1214 01:12:48.551498 24729 slave.cpp:352] Agent using credential for: test-principal
I1214 01:12:48.551520 24729 credentials.hpp:37] Loading credentials for authentication from
'/tmp/Endpoint_SlaveEndpointTest_NoAuthorizer_0_Gmz5FX/http_credentials'
I1214 01:12:48.551666 24729 http.cpp:922] Using default 'basic' HTTP authenticator for realm
'mesos-agent-readonly'
I1214 01:12:48.551730 24729 http.cpp:922] Using default 'basic' HTTP authenticator for realm
'mesos-agent-readwrite'
I1214 01:12:48.552320 24729 slave.cpp:539] Agent resources: cpus(*):2; mem(*):1024; disk(*):1024;
ports(*):[31000-32000]
I1214 01:12:48.552364 24729 slave.cpp:547] Agent attributes: [  ]
I1214 01:12:48.552371 24729 slave.cpp:552] Agent hostname: 33c94b1eb72f
I1214 01:12:48.552884 24727 state.cpp:57] Recovering state from '/tmp/Endpoint_SlaveEndpointTest_NoAuthorizer_0_rlro6y/meta'
I1214 01:12:48.553078 24739 status_update_manager.cpp:203] Recovering status update manager
I1214 01:12:48.553369 24733 containerizer.cpp:594] Recovering containerizer
I1214 01:12:48.553995 24733 provisioner.cpp:253] Provisioner recovery complete
I1214 01:12:48.554199 24739 slave.cpp:5420] Finished recovery
I1214 01:12:48.554683 24739 slave.cpp:5594] Querying resource estimator for oversubscribable
resources
I1214 01:12:48.554819 24731 slave.cpp:5608] Received oversubscribable resources {} from the
resource estimator
I1214 01:12:48.555596 24738 process.cpp:3679] Handling HTTP event for process 'slave(672)'
with path: '/slave(672)/monitor/statistics'
I1214 01:12:48.556219 24729 http.cpp:874] Authorizing principal 'test-principal' to GET the
'/monitor/statistics' endpoint
I1214 01:12:48.557929 24730 slave.cpp:796] Agent terminating
[       OK ] Endpoint/SlaveEndpointTest.NoAuthorizer/0 (16 ms)
[ RUN      ] Endpoint/SlaveEndpointTest.NoAuthorizer/1
I1214 01:12:48.565595 24723 containerizer.cpp:220] Using isolation: posix/cpu,posix/mem,filesystem/posix,network/cni
W1214 01:12:48.566002 24723 backend.cpp:76] Failed to create 'aufs' backend: AufsBackend requires
root privileges, but is running as user mesos
W1214 01:12:48.566097 24723 backend.cpp:76] Failed to create 'bind' backend: BindBackend requires
root privileges
I1214 01:12:48.566761 24723 cluster.cpp:446] Creating default 'local' authorizer
I1214 01:12:48.567360 24727 slave.cpp:209] Mesos agent started on (673)@172.17.0.3:33802
I1214 01:12:48.567391 24727 slave.cpp:210] Flags at startup: --acls="" --appc_simple_discovery_uri_prefix="http://"
--appc_store_dir="/tmp/mesos/store/appc" --authenticate_http_readonly="true" --authenticate_http_readwrite="true"
--authenticatee="crammd5" --authentication_backoff_factor="1secs" --authorizer="local" --cgroups_cpu_enable_pids_and_tids_count="false"
--cgroups_enable_cfs="false" --cgroups_hierarchy="/sys/fs/cgroup" --cgroups_limit_swap="false"
--cgroups_root="mesos" --container_disk_watch_interval="15secs" --containerizers="mesos" --credential="/tmp/Endpoint_SlaveEndpointTest_NoAuthorizer_1_oc9h8x/credential"
--default_role="*" --disk_watch_interval="1mins" --docker="docker" --docker_kill_orphans="true"
--docker_registry="https://registry-1.docker.io" --docker_remove_delay="6hrs" --docker_socket="/var/run/docker.sock"
--docker_stop_timeout="0ns" --docker_store_dir="/tmp/mesos/store/docker" --docker_volume_checkpoint_dir="/var/run/mesos/isolators/docker/volume"
--enforce_container_disk_quota="false" --executor_registration_timeout="1mins" --executor_shutdown_grace_period="5secs"
--fetcher_cache_dir="/tmp/Endpoint_SlaveEndpointTest_NoAuthorizer_1_oc9h8x/fetch" --fetcher_cache_size="2GB"
--frameworks_home="" --gc_delay="1weeks" --gc_disk_headroom="0.1" --hadoop_home="" --help="false"
--hostname_lookup="true" --http_authenticators="basic" --http_command_executor="false" --http_credentials="/tmp/Endpoint_SlaveEndpointTest_NoAuthorizer_1_oc9h8x/http_credentials"
--http_heartbeat_interval="30secs" --image_provisioner_backend="copy" --initialize_driver_logging="true"
--isolation="posix/cpu,posix/mem" --launcher="posix" --launcher_dir="/mesos/build/src" --logbufsecs="0"
--logging_level="INFO" --max_completed_executors_per_framework="150" --oversubscribed_resources_interval="15secs"
--perf_duration="10secs" --perf_interval="1mins" --qos_correction_interval_min="0ns" --quiet="false"
--recover="reconnect" --recovery_timeout="15mins" --registration_backoff_factor="10ms" --resources="cpus:2;gpus:0;mem:1024;disk:1024;ports:[31000-32000]"
--revocable_cpu_low_priority="true" --runtime_dir="/tmp/Endpoint_SlaveEndpointTest_NoAuthorizer_1_oc9h8x"
--sandbox_directory="/mnt/mesos/sandbox" --strict="true" --switch_user="true" --systemd_enable_support="true"
--systemd_runtime_directory="/run/systemd/system" --version="false" --work_dir="/tmp/Endpoint_SlaveEndpointTest_NoAuthorizer_1_dmaOv9"
I1214 01:12:48.567914 24727 credentials.hpp:86] Loading credential for authentication from
'/tmp/Endpoint_SlaveEndpointTest_NoAuthorizer_1_oc9h8x/credential'
I1214 01:12:48.568011 24727 slave.cpp:352] Agent using credential for: test-principal
I1214 01:12:48.568023 24727 credentials.hpp:37] Loading credentials for authentication from
'/tmp/Endpoint_SlaveEndpointTest_NoAuthorizer_1_oc9h8x/http_credentials'
I1214 01:12:48.568116 24727 http.cpp:922] Using default 'basic' HTTP authenticator for realm
'mesos-agent-readonly'
I1214 01:12:48.568158 24727 http.cpp:922] Using default 'basic' HTTP authenticator for realm
'mesos-agent-readwrite'
I1214 01:12:48.568780 24727 slave.cpp:539] Agent resources: cpus(*):2; mem(*):1024; disk(*):1024;
ports(*):[31000-32000]
I1214 01:12:48.568825 24727 slave.cpp:547] Agent attributes: [  ]
I1214 01:12:48.568831 24727 slave.cpp:552] Agent hostname: 33c94b1eb72f
I1214 01:12:48.569350 24727 state.cpp:57] Recovering state from '/tmp/Endpoint_SlaveEndpointTest_NoAuthorizer_1_dmaOv9/meta'
I1214 01:12:48.569485 24731 status_update_manager.cpp:203] Recovering status update manager
I1214 01:12:48.569625 24730 containerizer.cpp:594] Recovering containerizer
I1214 01:12:48.570237 24736 provisioner.cpp:253] Provisioner recovery complete
I1214 01:12:48.570468 24733 slave.cpp:5420] Finished recovery
I1214 01:12:48.571015 24733 slave.cpp:5594] Querying resource estimator for oversubscribable
resources
I1214 01:12:48.571141 24729 slave.cpp:5608] Received oversubscribable resources {} from the
resource estimator
I1214 01:12:48.571959 24727 process.cpp:3679] Handling HTTP event for process 'slave(673)'
with path: '/slave(673)/monitor/statistics.json'
I1214 01:12:48.572450 24729 http.cpp:874] Authorizing principal 'test-principal' to GET the
'/monitor/statistics.json' endpoint
I1214 01:12:48.574290 24735 slave.cpp:796] Agent terminating
[       OK ] Endpoint/SlaveEndpointTest.NoAuthorizer/1 (15 ms)
[ RUN      ] Endpoint/SlaveEndpointTest.NoAuthorizer/2
I1214 01:12:48.582407 24723 containerizer.cpp:220] Using isolation: posix/cpu,posix/mem,filesystem/posix,network/cni
W1214 01:12:48.582777 24723 backend.cpp:76] Failed to create 'aufs' backend: AufsBackend requires
root privileges, but is running as user mesos
W1214 01:12:48.582865 24723 backend.cpp:76] Failed to create 'bind' backend: BindBackend requires
root privileges
I1214 01:12:48.583645 24723 cluster.cpp:446] Creating default 'local' authorizer
I1214 01:12:48.584332 24726 slave.cpp:209] Mesos agent started on (674)@172.17.0.3:33802
I1214 01:12:48.584360 24726 slave.cpp:210] Flags at startup: --acls="" --appc_simple_discovery_uri_prefix="http://"
--appc_store_dir="/tmp/mesos/store/appc" --authenticate_http_readonly="true" --authenticate_http_readwrite="true"
--authenticatee="crammd5" --authentication_backoff_factor="1secs" --authorizer="local" --cgroups_cpu_enable_pids_and_tids_count="false"
--cgroups_enable_cfs="false" --cgroups_hierarchy="/sys/fs/cgroup" --cgroups_limit_swap="false"
--cgroups_root="mesos" --container_disk_watch_interval="15secs" --containerizers="mesos" --credential="/tmp/Endpoint_SlaveEndpointTest_NoAuthorizer_2_I0shL8/credential"
--default_role="*" --disk_watch_interval="1mins" --docker="docker" --docker_kill_orphans="true"
--docker_registry="https://registry-1.docker.io" --docker_remove_delay="6hrs" --docker_socket="/var/run/docker.sock"
--docker_stop_timeout="0ns" --docker_store_dir="/tmp/mesos/store/docker" --docker_volume_checkpoint_dir="/var/run/mesos/isolators/docker/volume"
--enforce_container_disk_quota="false" --executor_registration_timeout="1mins" --executor_shutdown_grace_period="5secs"
--fetcher_cache_dir="/tmp/Endpoint_SlaveEndpointTest_NoAuthorizer_2_I0shL8/fetch" --fetcher_cache_size="2GB"
--frameworks_home="" --gc_delay="1weeks" --gc_disk_headroom="0.1" --hadoop_home="" --help="false"
--hostname_lookup="true" --http_authenticators="basic" --http_command_executor="false" --http_credentials="/tmp/Endpoint_SlaveEndpointTest_NoAuthorizer_2_I0shL8/http_credentials"
--http_heartbeat_interval="30secs" --image_provisioner_backend="copy" --initialize_driver_logging="true"
--isolation="posix/cpu,posix/mem" --launcher="posix" --launcher_dir="/mesos/build/src" --logbufsecs="0"
--logging_level="INFO" --max_completed_executors_per_framework="150" --oversubscribed_resources_interval="15secs"
--perf_duration="10secs" --perf_interval="1mins" --qos_correction_interval_min="0ns" --quiet="false"
--recover="reconnect" --recovery_timeout="15mins" --registration_backoff_factor="10ms" --resources="cpus:2;gpus:0;mem:1024;disk:1024;ports:[31000-32000]"
--revocable_cpu_low_priority="true" --runtime_dir="/tmp/Endpoint_SlaveEndpointTest_NoAuthorizer_2_I0shL8"
--sandbox_directory="/mnt/mesos/sandbox" --strict="true" --switch_user="true" --systemd_enable_support="true"
--systemd_runtime_directory="/run/systemd/system" --version="false" --work_dir="/tmp/Endpoint_SlaveEndpointTest_NoAuthorizer_2_zW645J"
I1214 01:12:48.584761 24726 credentials.hpp:86] Loading credential for authentication from
'/tmp/Endpoint_SlaveEndpointTest_NoAuthorizer_2_I0shL8/credential'
I1214 01:12:48.584862 24726 slave.cpp:352] Agent using credential for: test-principal
I1214 01:12:48.584877 24726 credentials.hpp:37] Loading credentials for authentication from
'/tmp/Endpoint_SlaveEndpointTest_NoAuthorizer_2_I0shL8/http_credentials'
I1214 01:12:48.585039 24726 http.cpp:922] Using default 'basic' HTTP authenticator for realm
'mesos-agent-readonly'
I1214 01:12:48.585091 24726 http.cpp:922] Using default 'basic' HTTP authenticator for realm
'mesos-agent-readwrite'
I1214 01:12:48.585463 24726 slave.cpp:539] Agent resources: cpus(*):2; mem(*):1024; disk(*):1024;
ports(*):[31000-32000]
I1214 01:12:48.585505 24726 slave.cpp:547] Agent attributes: [  ]
I1214 01:12:48.585510 24726 slave.cpp:552] Agent hostname: 33c94b1eb72f
I1214 01:12:48.585932 24736 state.cpp:57] Recovering state from '/tmp/Endpoint_SlaveEndpointTest_NoAuthorizer_2_zW645J/meta'
I1214 01:12:48.586093 24725 status_update_manager.cpp:203] Recovering status update manager
I1214 01:12:48.586483 24730 containerizer.cpp:594] Recovering containerizer
I1214 01:12:48.587082 24734 provisioner.cpp:253] Provisioner recovery complete
I1214 01:12:48.587235 24732 slave.cpp:5420] Finished recovery
I1214 01:12:48.587683 24732 slave.cpp:5594] Querying resource estimator for oversubscribable
resources
I1214 01:12:48.587806 24728 slave.cpp:5608] Received oversubscribable resources {} from the
resource estimator
I1214 01:12:48.588500 24731 process.cpp:3679] Handling HTTP event for process 'slave(674)'
with path: '/slave(674)/containers'
I1214 01:12:48.588968 24730 http.cpp:874] Authorizing principal 'test-principal' to GET the
'/containers' endpoint
I1214 01:12:48.590457 24727 slave.cpp:796] Agent terminating
[       OK ] Endpoint/SlaveEndpointTest.NoAuthorizer/2 (14 ms)
[----------] 9 tests from Endpoint/SlaveEndpointTest (196 ms total)

[----------] Global test environment tear-down
[==========] 1384 tests from 158 test cases ran. (268035 ms total)
[  PASSED  ] 1383 tests.
[  FAILED  ] 1 test, listed below:
[  FAILED  ] IOSwitchboardTest.KillSwitchboardContainerDestroyed

 1 FAILED TEST
  YOU HAVE 9 DISABLED TESTS

make[3]: *** [CMakeFiles/check] Error 1
make[3]: Leaving directory `/mesos/build'
make[2]: *** [CMakeFiles/check.dir/all] Error 2
make[2]: Leaving directory `/mesos/build'
make[1]: Leaving directory `/mesos/build'
make[1]: *** [CMakeFiles/check.dir/rule] Error 2
make: *** [check] Error 2
+ docker rmi mesos-1481675490-22788
Untagged: mesos-1481675490-22788:latest
Deleted: sha256:4c0be650bb232239ec45604ce610fcfef18f2f969a1a48cf4c08814c0cd37b22
Deleted: sha256:a92832ac9090ee4d5b389717328ab042d75159831ff6516ac6c8f4591dd9960c
Deleted: sha256:f4bb545a64f75edd5e5eb2988cf486ff64f4a57a428d13d8074cc855f3add91b
Deleted: sha256:21a649a5a122c5f7aabe5c3c42640c57ba049f36a4f06871b1311ec11358e0c3
Deleted: sha256:50ab6fab30280ba86aee69e9fe182bdf0d7a5ec1832c2febe640dec9e7d04f0c
Deleted: sha256:bfecda3b0d21b09c23b0bc68a1917543af780b44a8d483e118999e4a85b65ca3
Deleted: sha256:ea6c39e0692635cd187bf5ecbc8184ec0c0f8830829775a14888f21ed605abec
Deleted: sha256:b9fbe2e02d84a86f18a707bebb3a85194c058a9ccbabbcb90122bb70c4561d5f
Deleted: sha256:47fabe5a27b92023092401ac4c9b2c9b782b9bd8e78479978a9ede38e2449de5
Deleted: sha256:efc8cc4e160c2dcf4d4a48f4ab0c5af58714d463f44e7823837ec1ff1c1af372
Deleted: sha256:721fe3fbc080c504fcfe65b6f3d237e8f2d3b3ea0d4d5388a8437181ce28a1ac
Deleted: sha256:81f7a736e7a75702ea70a0a7245b170b555b3eb96c4a042220594b8721e42c81
Deleted: sha256:18290097ba4e039dad76141cb7dbdc10bce30acac6c8a2772440dbfa16b443f6
Deleted: sha256:df2ff243135dd2f6397a55052b2c2491155bbba06cac4d4b903e817a1a5e785b
Deleted: sha256:b517cef24a59f9a70a823da25e2eae29df23df2b209384e674990daf37d07057
Deleted: sha256:dd922328c91c7b81a015c519a3f0f14e5e426845d43f2a898420fac53b01b0d0
Deleted: sha256:b5b68556f0fef2251eed524a197861ea8db08bdaf0992f12060b62361275b454
Deleted: sha256:6f7072dcfeb516de7ce04a283991687b16ebe10ff006288df39d63f43c6ff501
Deleted: sha256:9d3db6f684590dacc4c3f78334e23e6ecd2a06382c06f77145c7deb9e3b2408c
Deleted: sha256:84d879263069597337f1dfaa393ee395271276aecdc53ed88c595846f17459b9
Deleted: sha256:df4df8d481aaaa8ce9ebe0cecd535aef7552b113641f479016d5ca31c1b84475
Deleted: sha256:09731f0763247487105e0457f1903b21ebed8b7bfdc7724a4b643c74bdb72ae8
Deleted: sha256:d2e24cacd7513ebdd224006fc5970173c6370cfc5a9eeb7eeca3dcca6f4e90ba
Deleted: sha256:1f63b98a7c60b025076f12a4c8b28b7e74a9fe0f1c226f661fecbfa3a39bfd72
Build step 'Execute shell' marked build as failure

Mime
View raw message