mesos-builds mailing list archives

Site index · List index
Message view « Date » · « Thread »
Top « Date » · « Thread »
From Apache Jenkins Server <jenk...@builds.apache.org>
Subject Build failed in Jenkins: Mesos » cmake,gcc,--verbose --enable-libevent --enable-ssl,GLOG_v=1 MESOS_VERBOSE=1,ubuntu:14.04,(docker||Hadoop)&&(!ubuntu-us1)&&(!ubuntu-6)&&(!ubuntu-eu2) #3021
Date Thu, 08 Dec 2016 19:29:30 GMT
See <https://builds.apache.org/job/Mesos/BUILDTOOL=cmake,COMPILER=gcc,CONFIGURATION=--verbose%20--enable-libevent%20--enable-ssl,ENVIRONMENT=GLOG_v=1%20MESOS_VERBOSE=1,OS=ubuntu%3A14.04,label_exp=(docker%7C%7CHadoop)&&(!ubuntu-us1)&&(!ubuntu-6)&&(!ubuntu-eu2)/3021/changes>

Changes:

[mpark] Fixed some formatting in `os/windows/socket.hpp`.

------------------------------------------
[...truncated 172751 lines...]
I1208 19:29:21.775527 27591 http.cpp:874] Authorizing principal 'test-principal' to GET the
'/monitor/statistics' endpoint
I1208 19:29:21.777083 27597 slave.cpp:790] Agent terminating
[       OK ] Endpoint/SlaveEndpointTest.AuthorizedRequest/0 (11 ms)
[ RUN      ] Endpoint/SlaveEndpointTest.AuthorizedRequest/1
I1208 19:29:21.781251 27588 containerizer.cpp:217] Using isolation: posix/cpu,posix/mem,filesystem/posix,network/cni
W1208 19:29:21.781657 27588 backend.cpp:76] Failed to create 'aufs' backend: AufsBackend requires
root privileges, but is running as user mesos
W1208 19:29:21.781746 27588 backend.cpp:76] Failed to create 'bind' backend: BindBackend requires
root privileges
I1208 19:29:21.782637 27590 slave.cpp:208] Mesos agent started on (659)@172.17.0.3:56320
I1208 19:29:21.782655 27590 slave.cpp:209] Flags at startup: --acls="" --appc_simple_discovery_uri_prefix="http://"
--appc_store_dir="/tmp/mesos/store/appc" --authenticate_http_readonly="true" --authenticate_http_readwrite="true"
--authenticatee="crammd5" --authentication_backoff_factor="1secs" --authorizer="local" --cgroups_cpu_enable_pids_and_tids_count="false"
--cgroups_enable_cfs="false" --cgroups_hierarchy="/sys/fs/cgroup" --cgroups_limit_swap="false"
--cgroups_root="mesos" --container_disk_watch_interval="15secs" --containerizers="mesos" --credential="/tmp/Endpoint_SlaveEndpointTest_AuthorizedRequest_1_VyV5o5/credential"
--default_role="*" --disk_watch_interval="1mins" --docker="docker" --docker_kill_orphans="true"
--docker_registry="https://registry-1.docker.io" --docker_remove_delay="6hrs" --docker_socket="/var/run/docker.sock"
--docker_stop_timeout="0ns" --docker_store_dir="/tmp/mesos/store/docker" --docker_volume_checkpoint_dir="/var/run/mesos/isolators/docker/volume"
--enforce_container_disk_quota="false" --executor_registration_timeout="1mins" --executor_shutdown_grace_period="5secs"
--fetcher_cache_dir="/tmp/Endpoint_SlaveEndpointTest_AuthorizedRequest_1_VyV5o5/fetch" --fetcher_cache_size="2GB"
--frameworks_home="" --gc_delay="1weeks" --gc_disk_headroom="0.1" --hadoop_home="" --help="false"
--hostname_lookup="true" --http_authenticators="basic" --http_command_executor="false" --http_credentials="/tmp/Endpoint_SlaveEndpointTest_AuthorizedRequest_1_VyV5o5/http_credentials"
--image_provisioner_backend="copy" --initialize_driver_logging="true" --io_switchboard_enable_server="true"
--isolation="posix/cpu,posix/mem" --launcher="posix" --launcher_dir="/mesos/build/src" --logbufsecs="0"
--logging_level="INFO" --max_completed_executors_per_framework="150" --oversubscribed_resources_interval="15secs"
--perf_duration="10secs" --perf_interval="1mins" --qos_correction_interval_min="0ns" --quiet="false"
--recover="reconnect" --recovery_timeout="15mins" --registration_backoff_factor="10ms" --resources="cpus:2;gpus:0;mem:1024;disk:1024;ports:[31000-32000]"
--revocable_cpu_low_priority="true" --runtime_dir="/tmp/Endpoint_SlaveEndpointTest_AuthorizedRequest_1_VyV5o5"
--sandbox_directory="/mnt/mesos/sandbox" --strict="true" --switch_user="true" --systemd_enable_support="true"
--systemd_runtime_directory="/run/systemd/system" --version="false" --work_dir="/tmp/Endpoint_SlaveEndpointTest_AuthorizedRequest_1_FlLwb5"
I1208 19:29:21.782965 27590 credentials.hpp:86] Loading credential for authentication from
'/tmp/Endpoint_SlaveEndpointTest_AuthorizedRequest_1_VyV5o5/credential'
I1208 19:29:21.783036 27590 slave.cpp:346] Agent using credential for: test-principal
I1208 19:29:21.783052 27590 credentials.hpp:37] Loading credentials for authentication from
'/tmp/Endpoint_SlaveEndpointTest_AuthorizedRequest_1_VyV5o5/http_credentials'
I1208 19:29:21.783149 27590 http.cpp:922] Using default 'basic' HTTP authenticator for realm
'mesos-agent-readonly'
I1208 19:29:21.783201 27590 http.cpp:922] Using default 'basic' HTTP authenticator for realm
'mesos-agent-readwrite'
I1208 19:29:21.783617 27590 slave.cpp:533] Agent resources: cpus(*):2; mem(*):1024; disk(*):1024;
ports(*):[31000-32000]
I1208 19:29:21.783651 27590 slave.cpp:541] Agent attributes: [  ]
I1208 19:29:21.783658 27590 slave.cpp:546] Agent hostname: 780193c2f403
I1208 19:29:21.783970 27590 state.cpp:57] Recovering state from '/tmp/Endpoint_SlaveEndpointTest_AuthorizedRequest_1_FlLwb5/meta'
I1208 19:29:21.784096 27590 status_update_manager.cpp:203] Recovering status update manager
I1208 19:29:21.784265 27596 containerizer.cpp:591] Recovering containerizer
I1208 19:29:21.784888 27591 provisioner.cpp:253] Provisioner recovery complete
I1208 19:29:21.785037 27603 slave.cpp:5414] Finished recovery
I1208 19:29:21.785498 27603 slave.cpp:5588] Querying resource estimator for oversubscribable
resources
I1208 19:29:21.785629 27601 slave.cpp:5602] Received oversubscribable resources {} from the
resource estimator
I1208 19:29:21.786347 27595 process.cpp:3679] Handling HTTP event for process 'slave(659)'
with path: '/slave(659)/monitor/statistics.json'
I1208 19:29:21.786836 27595 http.cpp:874] Authorizing principal 'test-principal' to GET the
'/monitor/statistics.json' endpoint
I1208 19:29:21.788199 27594 slave.cpp:790] Agent terminating
[       OK ] Endpoint/SlaveEndpointTest.AuthorizedRequest/1 (11 ms)
[ RUN      ] Endpoint/SlaveEndpointTest.AuthorizedRequest/2
I1208 19:29:21.793028 27588 containerizer.cpp:217] Using isolation: posix/cpu,posix/mem,filesystem/posix,network/cni
W1208 19:29:21.793310 27588 backend.cpp:76] Failed to create 'aufs' backend: AufsBackend requires
root privileges, but is running as user mesos
W1208 19:29:21.793390 27588 backend.cpp:76] Failed to create 'bind' backend: BindBackend requires
root privileges
I1208 19:29:21.794745 27591 slave.cpp:208] Mesos agent started on (660)@172.17.0.3:56320
I1208 19:29:21.794770 27591 slave.cpp:209] Flags at startup: --acls="" --appc_simple_discovery_uri_prefix="http://"
--appc_store_dir="/tmp/mesos/store/appc" --authenticate_http_readonly="true" --authenticate_http_readwrite="true"
--authenticatee="crammd5" --authentication_backoff_factor="1secs" --authorizer="local" --cgroups_cpu_enable_pids_and_tids_count="false"
--cgroups_enable_cfs="false" --cgroups_hierarchy="/sys/fs/cgroup" --cgroups_limit_swap="false"
--cgroups_root="mesos" --container_disk_watch_interval="15secs" --containerizers="mesos" --credential="/tmp/Endpoint_SlaveEndpointTest_AuthorizedRequest_2_dGvQn6/credential"
--default_role="*" --disk_watch_interval="1mins" --docker="docker" --docker_kill_orphans="true"
--docker_registry="https://registry-1.docker.io" --docker_remove_delay="6hrs" --docker_socket="/var/run/docker.sock"
--docker_stop_timeout="0ns" --docker_store_dir="/tmp/mesos/store/docker" --docker_volume_checkpoint_dir="/var/run/mesos/isolators/docker/volume"
--enforce_container_disk_quota="false" --executor_registration_timeout="1mins" --executor_shutdown_grace_period="5secs"
--fetcher_cache_dir="/tmp/Endpoint_SlaveEndpointTest_AuthorizedRequest_2_dGvQn6/fetch" --fetcher_cache_size="2GB"
--frameworks_home="" --gc_delay="1weeks" --gc_disk_headroom="0.1" --hadoop_home="" --help="false"
--hostname_lookup="true" --http_authenticators="basic" --http_command_executor="false" --http_credentials="/tmp/Endpoint_SlaveEndpointTest_AuthorizedRequest_2_dGvQn6/http_credentials"
--image_provisioner_backend="copy" --initialize_driver_logging="true" --io_switchboard_enable_server="true"
--isolation="posix/cpu,posix/mem" --launcher="posix" --launcher_dir="/mesos/build/src" --logbufsecs="0"
--logging_level="INFO" --max_completed_executors_per_framework="150" --oversubscribed_resources_interval="15secs"
--perf_duration="10secs" --perf_interval="1mins" --qos_correction_interval_min="0ns" --quiet="false"
--recover="reconnect" --recovery_timeout="15mins" --registration_backoff_factor="10ms" --resources="cpus:2;gpus:0;mem:1024;disk:1024;ports:[31000-32000]"
--revocable_cpu_low_priority="true" --runtime_dir="/tmp/Endpoint_SlaveEndpointTest_AuthorizedRequest_2_dGvQn6"
--sandbox_directory="/mnt/mesos/sandbox" --strict="true" --switch_user="true" --systemd_enable_support="true"
--systemd_runtime_directory="/run/systemd/system" --version="false" --work_dir="/tmp/Endpoint_SlaveEndpointTest_AuthorizedRequest_2_9wnl85"
I1208 19:29:21.795127 27591 credentials.hpp:86] Loading credential for authentication from
'/tmp/Endpoint_SlaveEndpointTest_AuthorizedRequest_2_dGvQn6/credential'
I1208 19:29:21.795228 27591 slave.cpp:346] Agent using credential for: test-principal
I1208 19:29:21.795248 27591 credentials.hpp:37] Loading credentials for authentication from
'/tmp/Endpoint_SlaveEndpointTest_AuthorizedRequest_2_dGvQn6/http_credentials'
I1208 19:29:21.795374 27591 http.cpp:922] Using default 'basic' HTTP authenticator for realm
'mesos-agent-readonly'
I1208 19:29:21.795464 27591 http.cpp:922] Using default 'basic' HTTP authenticator for realm
'mesos-agent-readwrite'
I1208 19:29:21.795830 27591 slave.cpp:533] Agent resources: cpus(*):2; mem(*):1024; disk(*):1024;
ports(*):[31000-32000]
I1208 19:29:21.795873 27591 slave.cpp:541] Agent attributes: [  ]
I1208 19:29:21.795886 27591 slave.cpp:546] Agent hostname: 780193c2f403
I1208 19:29:21.796330 27595 state.cpp:57] Recovering state from '/tmp/Endpoint_SlaveEndpointTest_AuthorizedRequest_2_9wnl85/meta'
I1208 19:29:21.796489 27591 status_update_manager.cpp:203] Recovering status update manager
I1208 19:29:21.796604 27596 containerizer.cpp:591] Recovering containerizer
I1208 19:29:21.797170 27604 provisioner.cpp:253] Provisioner recovery complete
I1208 19:29:21.797407 27598 slave.cpp:5414] Finished recovery
I1208 19:29:21.797786 27598 slave.cpp:5588] Querying resource estimator for oversubscribable
resources
I1208 19:29:21.797905 27592 slave.cpp:5602] Received oversubscribable resources {} from the
resource estimator
I1208 19:29:21.798569 27604 process.cpp:3679] Handling HTTP event for process 'slave(660)'
with path: '/slave(660)/containers'
I1208 19:29:21.798966 27604 http.cpp:874] Authorizing principal 'test-principal' to GET the
'/containers' endpoint
I1208 19:29:21.800293 27592 slave.cpp:790] Agent terminating
[       OK ] Endpoint/SlaveEndpointTest.AuthorizedRequest/2 (12 ms)
[ RUN      ] Endpoint/SlaveEndpointTest.UnauthorizedRequest/0
I1208 19:29:21.805824 27588 containerizer.cpp:217] Using isolation: posix/cpu,posix/mem,filesystem/posix,network/cni
W1208 19:29:21.806193 27588 backend.cpp:76] Failed to create 'aufs' backend: AufsBackend requires
root privileges, but is running as user mesos
W1208 19:29:21.806296 27588 backend.cpp:76] Failed to create 'bind' backend: BindBackend requires
root privileges
I1208 19:29:21.807520 27601 slave.cpp:208] Mesos agent started on (661)@172.17.0.3:56320
I1208 19:29:21.807541 27601 slave.cpp:209] Flags at startup: --acls="" --appc_simple_discovery_uri_prefix="http://"
--appc_store_dir="/tmp/mesos/store/appc" --authenticate_http_readonly="true" --authenticate_http_readwrite="true"
--authenticatee="crammd5" --authentication_backoff_factor="1secs" --authorizer="local" --cgroups_cpu_enable_pids_and_tids_count="false"
--cgroups_enable_cfs="false" --cgroups_hierarchy="/sys/fs/cgroup" --cgroups_limit_swap="false"
--cgroups_root="mesos" --container_disk_watch_interval="15secs" --containerizers="mesos" --credential="/tmp/Endpoint_SlaveEndpointTest_UnauthorizedRequest_0_jtbFu7/credential"
--default_role="*" --disk_watch_interval="1mins" --docker="docker" --docker_kill_orphans="true"
--docker_registry="https://registry-1.docker.io" --docker_remove_delay="6hrs" --docker_socket="/var/run/docker.sock"
--docker_stop_timeout="0ns" --docker_store_dir="/tmp/mesos/store/docker" --docker_volume_checkpoint_dir="/var/run/mesos/isolators/docker/volume"
--enforce_container_disk_quota="false" --executor_registration_timeout="1mins" --executor_shutdown_grace_period="5secs"
--fetcher_cache_dir="/tmp/Endpoint_SlaveEndpointTest_UnauthorizedRequest_0_jtbFu7/fetch" --fetcher_cache_size="2GB"
--frameworks_home="" --gc_delay="1weeks" --gc_disk_headroom="0.1" --hadoop_home="" --help="false"
--hostname_lookup="true" --http_authenticators="basic" --http_command_executor="false" --http_credentials="/tmp/Endpoint_SlaveEndpointTest_UnauthorizedRequest_0_jtbFu7/http_credentials"
--image_provisioner_backend="copy" --initialize_driver_logging="true" --io_switchboard_enable_server="true"
--isolation="posix/cpu,posix/mem" --launcher="posix" --launcher_dir="/mesos/build/src" --logbufsecs="0"
--logging_level="INFO" --max_completed_executors_per_framework="150" --oversubscribed_resources_interval="15secs"
--perf_duration="10secs" --perf_interval="1mins" --qos_correction_interval_min="0ns" --quiet="false"
--recover="reconnect" --recovery_timeout="15mins" --registration_backoff_factor="10ms" --resources="cpus:2;gpus:0;mem:1024;disk:1024;ports:[31000-32000]"
--revocable_cpu_low_priority="true" --runtime_dir="/tmp/Endpoint_SlaveEndpointTest_UnauthorizedRequest_0_jtbFu7"
--sandbox_directory="/mnt/mesos/sandbox" --strict="true" --switch_user="true" --systemd_enable_support="true"
--systemd_runtime_directory="/run/systemd/system" --version="false" --work_dir="/tmp/Endpoint_SlaveEndpointTest_UnauthorizedRequest_0_jpr8c7"
I1208 19:29:21.807941 27601 credentials.hpp:86] Loading credential for authentication from
'/tmp/Endpoint_SlaveEndpointTest_UnauthorizedRequest_0_jtbFu7/credential'
I1208 19:29:21.808045 27601 slave.cpp:346] Agent using credential for: test-principal
I1208 19:29:21.808068 27601 credentials.hpp:37] Loading credentials for authentication from
'/tmp/Endpoint_SlaveEndpointTest_UnauthorizedRequest_0_jtbFu7/http_credentials'
I1208 19:29:21.808251 27601 http.cpp:922] Using default 'basic' HTTP authenticator for realm
'mesos-agent-readonly'
I1208 19:29:21.808351 27601 http.cpp:922] Using default 'basic' HTTP authenticator for realm
'mesos-agent-readwrite'
I1208 19:29:21.808827 27601 slave.cpp:533] Agent resources: cpus(*):2; mem(*):1024; disk(*):1024;
ports(*):[31000-32000]
I1208 19:29:21.808871 27601 slave.cpp:541] Agent attributes: [  ]
I1208 19:29:21.808882 27601 slave.cpp:546] Agent hostname: 780193c2f403
I1208 19:29:21.809222 27595 state.cpp:57] Recovering state from '/tmp/Endpoint_SlaveEndpointTest_UnauthorizedRequest_0_jpr8c7/meta'
I1208 19:29:21.809494 27590 status_update_manager.cpp:203] Recovering status update manager
I1208 19:29:21.809568 27590 containerizer.cpp:591] Recovering containerizer
I1208 19:29:21.809998 27602 provisioner.cpp:253] Provisioner recovery complete
I1208 19:29:21.810236 27596 slave.cpp:5414] Finished recovery
I1208 19:29:21.810601 27596 slave.cpp:5588] Querying resource estimator for oversubscribable
resources
I1208 19:29:21.810732 27597 slave.cpp:5602] Received oversubscribable resources {} from the
resource estimator
I1208 19:29:21.811444 27592 process.cpp:3679] Handling HTTP event for process 'slave(661)'
with path: '/slave(661)/monitor/statistics'
I1208 19:29:21.811951 27590 http.cpp:874] Authorizing principal 'test-principal' to GET the
'/monitor/statistics' endpoint
I1208 19:29:21.812872 27596 slave.cpp:790] Agent terminating
[       OK ] Endpoint/SlaveEndpointTest.UnauthorizedRequest/0 (12 ms)
[ RUN      ] Endpoint/SlaveEndpointTest.UnauthorizedRequest/1
I1208 19:29:21.818048 27588 containerizer.cpp:217] Using isolation: posix/cpu,posix/mem,filesystem/posix,network/cni
W1208 19:29:21.818403 27588 backend.cpp:76] Failed to create 'aufs' backend: AufsBackend requires
root privileges, but is running as user mesos
W1208 19:29:21.818496 27588 backend.cpp:76] Failed to create 'bind' backend: BindBackend requires
root privileges
I1208 19:29:21.819581 27601 slave.cpp:208] Mesos agent started on (662)@172.17.0.3:56320
I1208 19:29:21.819597 27601 slave.cpp:209] Flags at startup: --acls="" --appc_simple_discovery_uri_prefix="http://"
--appc_store_dir="/tmp/mesos/store/appc" --authenticate_http_readonly="true" --authenticate_http_readwrite="true"
--authenticatee="crammd5" --authentication_backoff_factor="1secs" --authorizer="local" --cgroups_cpu_enable_pids_and_tids_count="false"
--cgroups_enable_cfs="false" --cgroups_hierarchy="/sys/fs/cgroup" --cgroups_limit_swap="false"
--cgroups_root="mesos" --container_disk_watch_interval="15secs" --containerizers="mesos" --credential="/tmp/Endpoint_SlaveEndpointTest_UnauthorizedRequest_1_ucjxJ8/credential"
--default_role="*" --disk_watch_interval="1mins" --docker="docker" --docker_kill_orphans="true"
--docker_registry="https://registry-1.docker.io" --docker_remove_delay="6hrs" --docker_socket="/var/run/docker.sock"
--docker_stop_timeout="0ns" --docker_store_dir="/tmp/mesos/store/docker" --docker_volume_checkpoint_dir="/var/run/mesos/isolators/docker/volume"
--enforce_container_disk_quota="false" --executor_registration_timeout="1mins" --executor_shutdown_grace_period="5secs"
--fetcher_cache_dir="/tmp/Endpoint_SlaveEndpointTest_UnauthorizedRequest_1_ucjxJ8/fetch" --fetcher_cache_size="2GB"
--frameworks_home="" --gc_delay="1weeks" --gc_disk_headroom="0.1" --hadoop_home="" --help="false"
--hostname_lookup="true" --http_authenticators="basic" --http_command_executor="false" --http_credentials="/tmp/Endpoint_SlaveEndpointTest_UnauthorizedRequest_1_ucjxJ8/http_credentials"
--image_provisioner_backend="copy" --initialize_driver_logging="true" --io_switchboard_enable_server="true"
--isolation="posix/cpu,posix/mem" --launcher="posix" --launcher_dir="/mesos/build/src" --logbufsecs="0"
--logging_level="INFO" --max_completed_executors_per_framework="150" --oversubscribed_resources_interval="15secs"
--perf_duration="10secs" --perf_interval="1mins" --qos_correction_interval_min="0ns" --quiet="false"
--recover="reconnect" --recovery_timeout="15mins" --registration_backoff_factor="10ms" --resources="cpus:2;gpus:0;mem:1024;disk:1024;ports:[31000-32000]"
--revocable_cpu_low_priority="true" --runtime_dir="/tmp/Endpoint_SlaveEndpointTest_UnauthorizedRequest_1_ucjxJ8"
--sandbox_directory="/mnt/mesos/sandbox" --strict="true" --switch_user="true" --systemd_enable_support="true"
--systemd_runtime_directory="/run/systemd/system" --version="false" --work_dir="/tmp/Endpoint_SlaveEndpointTest_UnauthorizedRequest_1_UKk1p8"
I1208 19:29:21.819952 27601 credentials.hpp:86] Loading credential for authentication from
'/tmp/Endpoint_SlaveEndpointTest_UnauthorizedRequest_1_ucjxJ8/credential'
I1208 19:29:21.820041 27601 slave.cpp:346] Agent using credential for: test-principal
I1208 19:29:21.820058 27601 credentials.hpp:37] Loading credentials for authentication from
'/tmp/Endpoint_SlaveEndpointTest_UnauthorizedRequest_1_ucjxJ8/http_credentials'
I1208 19:29:21.820168 27601 http.cpp:922] Using default 'basic' HTTP authenticator for realm
'mesos-agent-readonly'
I1208 19:29:21.820220 27601 http.cpp:922] Using default 'basic' HTTP authenticator for realm
'mesos-agent-readwrite'
I1208 19:29:21.820583 27601 slave.cpp:533] Agent resources: cpus(*):2; mem(*):1024; disk(*):1024;
ports(*):[31000-32000]
I1208 19:29:21.820622 27601 slave.cpp:541] Agent attributes: [  ]
I1208 19:29:21.820629 27601 slave.cpp:546] Agent hostname: 780193c2f403
I1208 19:29:21.820942 27594 state.cpp:57] Recovering state from '/tmp/Endpoint_SlaveEndpointTest_UnauthorizedRequest_1_UKk1p8/meta'
I1208 19:29:21.821108 27603 status_update_manager.cpp:203] Recovering status update manager
I1208 19:29:21.821287 27598 containerizer.cpp:591] Recovering containerizer
I1208 19:29:21.821842 27604 provisioner.cpp:253] Provisioner recovery complete
I1208 19:29:21.822070 27592 slave.cpp:5414] Finished recovery
I1208 19:29:21.822464 27592 slave.cpp:5588] Querying resource estimator for oversubscribable
resources
I1208 19:29:21.822621 27599 slave.cpp:5602] Received oversubscribable resources {} from the
resource estimator
I1208 19:29:21.823277 27592 process.cpp:3679] Handling HTTP event for process 'slave(662)'
with path: '/slave(662)/monitor/statistics.json'
I1208 19:29:21.823745 27597 http.cpp:874] Authorizing principal 'test-principal' to GET the
'/monitor/statistics.json' endpoint
I1208 19:29:21.824822 27601 slave.cpp:790] Agent terminating
[       OK ] Endpoint/SlaveEndpointTest.UnauthorizedRequest/1 (12 ms)
[ RUN      ] Endpoint/SlaveEndpointTest.UnauthorizedRequest/2
I1208 19:29:21.830201 27588 containerizer.cpp:217] Using isolation: posix/cpu,posix/mem,filesystem/posix,network/cni
W1208 19:29:21.830574 27588 backend.cpp:76] Failed to create 'aufs' backend: AufsBackend requires
root privileges, but is running as user mesos
W1208 19:29:21.830662 27588 backend.cpp:76] Failed to create 'bind' backend: BindBackend requires
root privileges
I1208 19:29:21.831986 27600 slave.cpp:208] Mesos agent started on (663)@172.17.0.3:56320
I1208 19:29:21.832015 27600 slave.cpp:209] Flags at startup: --acls="" --appc_simple_discovery_uri_prefix="http://"
--appc_store_dir="/tmp/mesos/store/appc" --authenticate_http_readonly="true" --authenticate_http_readwrite="true"
--authenticatee="crammd5" --authentication_backoff_factor="1secs" --authorizer="local" --cgroups_cpu_enable_pids_and_tids_count="false"
--cgroups_enable_cfs="false" --cgroups_hierarchy="/sys/fs/cgroup" --cgroups_limit_swap="false"
--cgroups_root="mesos" --container_disk_watch_interval="15secs" --containerizers="mesos" --credential="/tmp/Endpoint_SlaveEndpointTest_UnauthorizedRequest_2_XGWe69/credential"
--default_role="*" --disk_watch_interval="1mins" --docker="docker" --docker_kill_orphans="true"
--docker_registry="https://registry-1.docker.io" --docker_remove_delay="6hrs" --docker_socket="/var/run/docker.sock"
--docker_stop_timeout="0ns" --docker_store_dir="/tmp/mesos/store/docker" --docker_volume_checkpoint_dir="/var/run/mesos/isolators/docker/volume"
--enforce_container_disk_quota="false" --executor_registration_timeout="1mins" --executor_shutdown_grace_period="5secs"
--fetcher_cache_dir="/tmp/Endpoint_SlaveEndpointTest_UnauthorizedRequest_2_XGWe69/fetch" --fetcher_cache_size="2GB"
--frameworks_home="" --gc_delay="1weeks" --gc_disk_headroom="0.1" --hadoop_home="" --help="false"
--hostname_lookup="true" --http_authenticators="basic" --http_command_executor="false" --http_credentials="/tmp/Endpoint_SlaveEndpointTest_UnauthorizedRequest_2_XGWe69/http_credentials"
--image_provisioner_backend="copy" --initialize_driver_logging="true" --io_switchboard_enable_server="true"
--isolation="posix/cpu,posix/mem" --launcher="posix" --launcher_dir="/mesos/build/src" --logbufsecs="0"
--logging_level="INFO" --max_completed_executors_per_framework="150" --oversubscribed_resources_interval="15secs"
--perf_duration="10secs" --perf_interval="1mins" --qos_correction_interval_min="0ns" --quiet="false"
--recover="reconnect" --recovery_timeout="15mins" --registration_backoff_factor="10ms" --resources="cpus:2;gpus:0;mem:1024;disk:1024;ports:[31000-32000]"
--revocable_cpu_low_priority="true" --runtime_dir="/tmp/Endpoint_SlaveEndpointTest_UnauthorizedRequest_2_XGWe69"
--sandbox_directory="/mnt/mesos/sandbox" --strict="true" --switch_user="true" --systemd_enable_support="true"
--systemd_runtime_directory="/run/systemd/system" --version="false" --work_dir="/tmp/Endpoint_SlaveEndpointTest_UnauthorizedRequest_2_7UHKK9"
I1208 19:29:21.832386 27600 credentials.hpp:86] Loading credential for authentication from
'/tmp/Endpoint_SlaveEndpointTest_UnauthorizedRequest_2_XGWe69/credential'
I1208 19:29:21.832478 27600 slave.cpp:346] Agent using credential for: test-principal
I1208 19:29:21.832494 27600 credentials.hpp:37] Loading credentials for authentication from
'/tmp/Endpoint_SlaveEndpointTest_UnauthorizedRequest_2_XGWe69/http_credentials'
I1208 19:29:21.832602 27600 http.cpp:922] Using default 'basic' HTTP authenticator for realm
'mesos-agent-readonly'
I1208 19:29:21.832650 27600 http.cpp:922] Using default 'basic' HTTP authenticator for realm
'mesos-agent-readwrite'
I1208 19:29:21.833019 27600 slave.cpp:533] Agent resources: cpus(*):2; mem(*):1024; disk(*):1024;
ports(*):[31000-32000]
I1208 19:29:21.833061 27600 slave.cpp:541] Agent attributes: [  ]
I1208 19:29:21.833072 27600 slave.cpp:546] Agent hostname: 780193c2f403
I1208 19:29:21.833470 27603 state.cpp:57] Recovering state from '/tmp/Endpoint_SlaveEndpointTest_UnauthorizedRequest_2_7UHKK9/meta'
I1208 19:29:21.833703 27591 status_update_manager.cpp:203] Recovering status update manager
I1208 19:29:21.833851 27602 containerizer.cpp:591] Recovering containerizer
I1208 19:29:21.834507 27591 provisioner.cpp:253] Provisioner recovery complete
I1208 19:29:21.834751 27604 slave.cpp:5414] Finished recovery
I1208 19:29:21.835191 27604 slave.cpp:5588] Querying resource estimator for oversubscribable
resources
I1208 19:29:21.835333 27594 slave.cpp:5602] Received oversubscribable resources {} from the
resource estimator
I1208 19:29:21.836001 27598 process.cpp:3679] Handling HTTP event for process 'slave(663)'
with path: '/slave(663)/containers'
I1208 19:29:21.836634 27590 http.cpp:874] Authorizing principal 'test-principal' to GET the
'/containers' endpoint
I1208 19:29:21.837765 27588 slave.cpp:790] Agent terminating
[       OK ] Endpoint/SlaveEndpointTest.UnauthorizedRequest/2 (13 ms)
[ RUN      ] Endpoint/SlaveEndpointTest.NoAuthorizer/0
I1208 19:29:21.843519 27588 containerizer.cpp:217] Using isolation: posix/cpu,posix/mem,filesystem/posix,network/cni
W1208 19:29:21.843890 27588 backend.cpp:76] Failed to create 'aufs' backend: AufsBackend requires
root privileges, but is running as user mesos
W1208 19:29:21.843987 27588 backend.cpp:76] Failed to create 'bind' backend: BindBackend requires
root privileges
I1208 19:29:21.844589 27588 cluster.cpp:446] Creating default 'local' authorizer
I1208 19:29:21.845115 27591 slave.cpp:208] Mesos agent started on (664)@172.17.0.3:56320
I1208 19:29:21.845136 27591 slave.cpp:209] Flags at startup: --acls="" --appc_simple_discovery_uri_prefix="http://"
--appc_store_dir="/tmp/mesos/store/appc" --authenticate_http_readonly="true" --authenticate_http_readwrite="true"
--authenticatee="crammd5" --authentication_backoff_factor="1secs" --authorizer="local" --cgroups_cpu_enable_pids_and_tids_count="false"
--cgroups_enable_cfs="false" --cgroups_hierarchy="/sys/fs/cgroup" --cgroups_limit_swap="false"
--cgroups_root="mesos" --container_disk_watch_interval="15secs" --containerizers="mesos" --credential="/tmp/Endpoint_SlaveEndpointTest_NoAuthorizer_0_7YBsBb/credential"
--default_role="*" --disk_watch_interval="1mins" --docker="docker" --docker_kill_orphans="true"
--docker_registry="https://registry-1.docker.io" --docker_remove_delay="6hrs" --docker_socket="/var/run/docker.sock"
--docker_stop_timeout="0ns" --docker_store_dir="/tmp/mesos/store/docker" --docker_volume_checkpoint_dir="/var/run/mesos/isolators/docker/volume"
--enforce_container_disk_quota="false" --executor_registration_timeout="1mins" --executor_shutdown_grace_period="5secs"
--fetcher_cache_dir="/tmp/Endpoint_SlaveEndpointTest_NoAuthorizer_0_7YBsBb/fetch" --fetcher_cache_size="2GB"
--frameworks_home="" --gc_delay="1weeks" --gc_disk_headroom="0.1" --hadoop_home="" --help="false"
--hostname_lookup="true" --http_authenticators="basic" --http_command_executor="false" --http_credentials="/tmp/Endpoint_SlaveEndpointTest_NoAuthorizer_0_7YBsBb/http_credentials"
--image_provisioner_backend="copy" --initialize_driver_logging="true" --io_switchboard_enable_server="true"
--isolation="posix/cpu,posix/mem" --launcher="posix" --launcher_dir="/mesos/build/src" --logbufsecs="0"
--logging_level="INFO" --max_completed_executors_per_framework="150" --oversubscribed_resources_interval="15secs"
--perf_duration="10secs" --perf_interval="1mins" --qos_correction_interval_min="0ns" --quiet="false"
--recover="reconnect" --recovery_timeout="15mins" --registration_backoff_factor="10ms" --resources="cpus:2;gpus:0;mem:1024;disk:1024;ports:[31000-32000]"
--revocable_cpu_low_priority="true" --runtime_dir="/tmp/Endpoint_SlaveEndpointTest_NoAuthorizer_0_7YBsBb"
--sandbox_directory="/mnt/mesos/sandbox" --strict="true" --switch_user="true" --systemd_enable_support="true"
--systemd_runtime_directory="/run/systemd/system" --version="false" --work_dir="/tmp/Endpoint_SlaveEndpointTest_NoAuthorizer_0_9PbPdb"
I1208 19:29:21.845621 27591 credentials.hpp:86] Loading credential for authentication from
'/tmp/Endpoint_SlaveEndpointTest_NoAuthorizer_0_7YBsBb/credential'
I1208 19:29:21.845742 27591 slave.cpp:346] Agent using credential for: test-principal
I1208 19:29:21.845765 27591 credentials.hpp:37] Loading credentials for authentication from
'/tmp/Endpoint_SlaveEndpointTest_NoAuthorizer_0_7YBsBb/http_credentials'
I1208 19:29:21.845886 27591 http.cpp:922] Using default 'basic' HTTP authenticator for realm
'mesos-agent-readonly'
I1208 19:29:21.845985 27591 http.cpp:922] Using default 'basic' HTTP authenticator for realm
'mesos-agent-readwrite'
I1208 19:29:21.846421 27591 slave.cpp:533] Agent resources: cpus(*):2; mem(*):1024; disk(*):1024;
ports(*):[31000-32000]
I1208 19:29:21.846462 27591 slave.cpp:541] Agent attributes: [  ]
I1208 19:29:21.846472 27591 slave.cpp:546] Agent hostname: 780193c2f403
I1208 19:29:21.846774 27591 state.cpp:57] Recovering state from '/tmp/Endpoint_SlaveEndpointTest_NoAuthorizer_0_9PbPdb/meta'
I1208 19:29:21.846947 27590 status_update_manager.cpp:203] Recovering status update manager
I1208 19:29:21.847059 27600 containerizer.cpp:591] Recovering containerizer
I1208 19:29:21.847719 27602 provisioner.cpp:253] Provisioner recovery complete
I1208 19:29:21.847888 27602 slave.cpp:5414] Finished recovery
I1208 19:29:21.848256 27602 slave.cpp:5588] Querying resource estimator for oversubscribable
resources
I1208 19:29:21.848408 27596 slave.cpp:5602] Received oversubscribable resources {} from the
resource estimator
I1208 19:29:21.849040 27597 process.cpp:3679] Handling HTTP event for process 'slave(664)'
with path: '/slave(664)/monitor/statistics'
I1208 19:29:21.849444 27604 http.cpp:874] Authorizing principal 'test-principal' to GET the
'/monitor/statistics' endpoint
I1208 19:29:21.850778 27591 slave.cpp:790] Agent terminating
[       OK ] Endpoint/SlaveEndpointTest.NoAuthorizer/0 (12 ms)
[ RUN      ] Endpoint/SlaveEndpointTest.NoAuthorizer/1
I1208 19:29:21.856328 27588 containerizer.cpp:217] Using isolation: posix/cpu,posix/mem,filesystem/posix,network/cni
W1208 19:29:21.856691 27588 backend.cpp:76] Failed to create 'aufs' backend: AufsBackend requires
root privileges, but is running as user mesos
W1208 19:29:21.856775 27588 backend.cpp:76] Failed to create 'bind' backend: BindBackend requires
root privileges
I1208 19:29:21.857424 27588 cluster.cpp:446] Creating default 'local' authorizer
I1208 19:29:21.858031 27592 slave.cpp:208] Mesos agent started on (665)@172.17.0.3:56320
I1208 19:29:21.858048 27592 slave.cpp:209] Flags at startup: --acls="" --appc_simple_discovery_uri_prefix="http://"
--appc_store_dir="/tmp/mesos/store/appc" --authenticate_http_readonly="true" --authenticate_http_readwrite="true"
--authenticatee="crammd5" --authentication_backoff_factor="1secs" --authorizer="local" --cgroups_cpu_enable_pids_and_tids_count="false"
--cgroups_enable_cfs="false" --cgroups_hierarchy="/sys/fs/cgroup" --cgroups_limit_swap="false"
--cgroups_root="mesos" --container_disk_watch_interval="15secs" --containerizers="mesos" --credential="/tmp/Endpoint_SlaveEndpointTest_NoAuthorizer_1_Zyv0ed/credential"
--default_role="*" --disk_watch_interval="1mins" --docker="docker" --docker_kill_orphans="true"
--docker_registry="https://registry-1.docker.io" --docker_remove_delay="6hrs" --docker_socket="/var/run/docker.sock"
--docker_stop_timeout="0ns" --docker_store_dir="/tmp/mesos/store/docker" --docker_volume_checkpoint_dir="/var/run/mesos/isolators/docker/volume"
--enforce_container_disk_quota="false" --executor_registration_timeout="1mins" --executor_shutdown_grace_period="5secs"
--fetcher_cache_dir="/tmp/Endpoint_SlaveEndpointTest_NoAuthorizer_1_Zyv0ed/fetch" --fetcher_cache_size="2GB"
--frameworks_home="" --gc_delay="1weeks" --gc_disk_headroom="0.1" --hadoop_home="" --help="false"
--hostname_lookup="true" --http_authenticators="basic" --http_command_executor="false" --http_credentials="/tmp/Endpoint_SlaveEndpointTest_NoAuthorizer_1_Zyv0ed/http_credentials"
--image_provisioner_backend="copy" --initialize_driver_logging="true" --io_switchboard_enable_server="true"
--isolation="posix/cpu,posix/mem" --launcher="posix" --launcher_dir="/mesos/build/src" --logbufsecs="0"
--logging_level="INFO" --max_completed_executors_per_framework="150" --oversubscribed_resources_interval="15secs"
--perf_duration="10secs" --perf_interval="1mins" --qos_correction_interval_min="0ns" --quiet="false"
--recover="reconnect" --recovery_timeout="15mins" --registration_backoff_factor="10ms" --resources="cpus:2;gpus:0;mem:1024;disk:1024;ports:[31000-32000]"
--revocable_cpu_low_priority="true" --runtime_dir="/tmp/Endpoint_SlaveEndpointTest_NoAuthorizer_1_Zyv0ed"
--sandbox_directory="/mnt/mesos/sandbox" --strict="true" --switch_user="true" --systemd_enable_support="true"
--systemd_runtime_directory="/run/systemd/system" --version="false" --work_dir="/tmp/Endpoint_SlaveEndpointTest_NoAuthorizer_1_ty4iPc"
I1208 19:29:21.858433 27592 credentials.hpp:86] Loading credential for authentication from
'/tmp/Endpoint_SlaveEndpointTest_NoAuthorizer_1_Zyv0ed/credential'
I1208 19:29:21.858525 27592 slave.cpp:346] Agent using credential for: test-principal
I1208 19:29:21.858541 27592 credentials.hpp:37] Loading credentials for authentication from
'/tmp/Endpoint_SlaveEndpointTest_NoAuthorizer_1_Zyv0ed/http_credentials'
I1208 19:29:21.858652 27592 http.cpp:922] Using default 'basic' HTTP authenticator for realm
'mesos-agent-readonly'
I1208 19:29:21.858701 27592 http.cpp:922] Using default 'basic' HTTP authenticator for realm
'mesos-agent-readwrite'
I1208 19:29:21.859159 27592 slave.cpp:533] Agent resources: cpus(*):2; mem(*):1024; disk(*):1024;
ports(*):[31000-32000]
I1208 19:29:21.859203 27592 slave.cpp:541] Agent attributes: [  ]
I1208 19:29:21.859216 27592 slave.cpp:546] Agent hostname: 780193c2f403
I1208 19:29:21.859603 27594 state.cpp:57] Recovering state from '/tmp/Endpoint_SlaveEndpointTest_NoAuthorizer_1_ty4iPc/meta'
I1208 19:29:21.859794 27593 status_update_manager.cpp:203] Recovering status update manager
I1208 19:29:21.859974 27593 containerizer.cpp:591] Recovering containerizer
I1208 19:29:21.860546 27589 provisioner.cpp:253] Provisioner recovery complete
I1208 19:29:21.860771 27591 slave.cpp:5414] Finished recovery
I1208 19:29:21.861183 27591 slave.cpp:5588] Querying resource estimator for oversubscribable
resources
I1208 19:29:21.861323 27601 slave.cpp:5602] Received oversubscribable resources {} from the
resource estimator
I1208 19:29:21.861941 27594 process.cpp:3679] Handling HTTP event for process 'slave(665)'
with path: '/slave(665)/monitor/statistics.json'
I1208 19:29:21.862437 27592 http.cpp:874] Authorizing principal 'test-principal' to GET the
'/monitor/statistics.json' endpoint
I1208 19:29:21.863600 27603 slave.cpp:790] Agent terminating
[       OK ] Endpoint/SlaveEndpointTest.NoAuthorizer/1 (13 ms)
[ RUN      ] Endpoint/SlaveEndpointTest.NoAuthorizer/2
I1208 19:29:21.869299 27588 containerizer.cpp:217] Using isolation: posix/cpu,posix/mem,filesystem/posix,network/cni
W1208 19:29:21.869662 27588 backend.cpp:76] Failed to create 'aufs' backend: AufsBackend requires
root privileges, but is running as user mesos
W1208 19:29:21.869765 27588 backend.cpp:76] Failed to create 'bind' backend: BindBackend requires
root privileges
I1208 19:29:21.870442 27588 cluster.cpp:446] Creating default 'local' authorizer
I1208 19:29:21.870973 27596 slave.cpp:208] Mesos agent started on (666)@172.17.0.3:56320
I1208 19:29:21.870995 27596 slave.cpp:209] Flags at startup: --acls="" --appc_simple_discovery_uri_prefix="http://"
--appc_store_dir="/tmp/mesos/store/appc" --authenticate_http_readonly="true" --authenticate_http_readwrite="true"
--authenticatee="crammd5" --authentication_backoff_factor="1secs" --authorizer="local" --cgroups_cpu_enable_pids_and_tids_count="false"
--cgroups_enable_cfs="false" --cgroups_hierarchy="/sys/fs/cgroup" --cgroups_limit_swap="false"
--cgroups_root="mesos" --container_disk_watch_interval="15secs" --containerizers="mesos" --credential="/tmp/Endpoint_SlaveEndpointTest_NoAuthorizer_2_bhu00e/credential"
--default_role="*" --disk_watch_interval="1mins" --docker="docker" --docker_kill_orphans="true"
--docker_registry="https://registry-1.docker.io" --docker_remove_delay="6hrs" --docker_socket="/var/run/docker.sock"
--docker_stop_timeout="0ns" --docker_store_dir="/tmp/mesos/store/docker" --docker_volume_checkpoint_dir="/var/run/mesos/isolators/docker/volume"
--enforce_container_disk_quota="false" --executor_registration_timeout="1mins" --executor_shutdown_grace_period="5secs"
--fetcher_cache_dir="/tmp/Endpoint_SlaveEndpointTest_NoAuthorizer_2_bhu00e/fetch" --fetcher_cache_size="2GB"
--frameworks_home="" --gc_delay="1weeks" --gc_disk_headroom="0.1" --hadoop_home="" --help="false"
--hostname_lookup="true" --http_authenticators="basic" --http_command_executor="false" --http_credentials="/tmp/Endpoint_SlaveEndpointTest_NoAuthorizer_2_bhu00e/http_credentials"
--image_provisioner_backend="copy" --initialize_driver_logging="true" --io_switchboard_enable_server="true"
--isolation="posix/cpu,posix/mem" --launcher="posix" --launcher_dir="/mesos/build/src" --logbufsecs="0"
--logging_level="INFO" --max_completed_executors_per_framework="150" --oversubscribed_resources_interval="15secs"
--perf_duration="10secs" --perf_interval="1mins" --qos_correction_interval_min="0ns" --quiet="false"
--recover="reconnect" --recovery_timeout="15mins" --registration_backoff_factor="10ms" --resources="cpus:2;gpus:0;mem:1024;disk:1024;ports:[31000-32000]"
--revocable_cpu_low_priority="true" --runtime_dir="/tmp/Endpoint_SlaveEndpointTest_NoAuthorizer_2_bhu00e"
--sandbox_directory="/mnt/mesos/sandbox" --strict="true" --switch_user="true" --systemd_enable_support="true"
--systemd_runtime_directory="/run/systemd/system" --version="false" --work_dir="/tmp/Endpoint_SlaveEndpointTest_NoAuthorizer_2_jZybze"
I1208 19:29:21.871592 27596 credentials.hpp:86] Loading credential for authentication from
'/tmp/Endpoint_SlaveEndpointTest_NoAuthorizer_2_bhu00e/credential'
I1208 19:29:21.871702 27596 slave.cpp:346] Agent using credential for: test-principal
I1208 19:29:21.871719 27596 credentials.hpp:37] Loading credentials for authentication from
'/tmp/Endpoint_SlaveEndpointTest_NoAuthorizer_2_bhu00e/http_credentials'
I1208 19:29:21.871834 27596 http.cpp:922] Using default 'basic' HTTP authenticator for realm
'mesos-agent-readonly'
I1208 19:29:21.871881 27596 http.cpp:922] Using default 'basic' HTTP authenticator for realm
'mesos-agent-readwrite'
I1208 19:29:21.872275 27596 slave.cpp:533] Agent resources: cpus(*):2; mem(*):1024; disk(*):1024;
ports(*):[31000-32000]
I1208 19:29:21.872316 27596 slave.cpp:541] Agent attributes: [  ]
I1208 19:29:21.872323 27596 slave.cpp:546] Agent hostname: 780193c2f403
I1208 19:29:21.872757 27597 state.cpp:57] Recovering state from '/tmp/Endpoint_SlaveEndpointTest_NoAuthorizer_2_jZybze/meta'
I1208 19:29:21.872915 27593 status_update_manager.cpp:203] Recovering status update manager
I1208 19:29:21.873030 27601 containerizer.cpp:591] Recovering containerizer
I1208 19:29:21.873563 27598 provisioner.cpp:253] Provisioner recovery complete
I1208 19:29:21.873747 27593 slave.cpp:5414] Finished recovery
I1208 19:29:21.874157 27593 slave.cpp:5588] Querying resource estimator for oversubscribable
resources
I1208 19:29:21.874308 27602 slave.cpp:5602] Received oversubscribable resources {} from the
resource estimator
I1208 19:29:21.874904 27591 process.cpp:3679] Handling HTTP event for process 'slave(666)'
with path: '/slave(666)/containers'
I1208 19:29:21.875355 27593 http.cpp:874] Authorizing principal 'test-principal' to GET the
'/containers' endpoint
I1208 19:29:21.876605 27592 slave.cpp:790] Agent terminating
[       OK ] Endpoint/SlaveEndpointTest.NoAuthorizer/2 (12 ms)
[----------] 9 tests from Endpoint/SlaveEndpointTest (112 ms total)

[----------] Global test environment tear-down
[==========] 1374 tests from 156 test cases ran. (174492 ms total)
[  PASSED  ] 1374 tests.

  YOU HAVE 9 DISABLED TESTS

Inconsistency detected by ld.so: dl-close.c: 762: _dl_close: Assertion `map->l_init_called'
failed!
make[3]: *** [CMakeFiles/check] Error 127
make[3]: Leaving directory `/mesos/build'
make[2]: *** [CMakeFiles/check.dir/all] Error 2
make[2]: Leaving directory `/mesos/build'
make[1]: *** [CMakeFiles/check.dir/rule] Error 2
make[1]: Leaving directory `/mesos/build'
make: *** [check] Error 2
+ docker rmi mesos-1481222593-17347
Untagged: mesos-1481222593-17347:latest
Deleted: sha256:67b5a89180f50f27a652cc4c827e23933f34a6c5aaf5d92dc692a08ac01c62b9
Deleted: sha256:42024ebdc69ace316c1a6fbe67505649be1213b75798ba67af2bad85e0b15d6b
Deleted: sha256:21ddf758dc090b02e708432207568879ad449893a7c88be23db8bea3667ab965
Deleted: sha256:39cf1e64110d8d5f0e26336b27b09b5e5662c8b27522fe722c37596798be4b1f
Deleted: sha256:afe1d8bd9559cb9384f65adff6453524883a8dce6694b9a06f3e98c2583a5fc5
Deleted: sha256:9d9d46e6d60707c5fd322e1e5936658d3ad9768bbe0ccababb9b3f173fa8e157
Deleted: sha256:19b1f93bc6194fe081aaf59cb19b77a74946696c94038ac8c3aaabec05067862
Deleted: sha256:ad6b1ab8fc04cb0acc8025837d201eb3d97b90d4e5d1dbbb5f2c97f6fd752fc5
Deleted: sha256:71f92f71cd9a1a4d3b0537ebbb1fbbbed037e635d5da972b58f3005f18ad10eb
Deleted: sha256:42930eeda2790e2de969096946abcfb0ae46318e891a7948e518c249934031ab
Deleted: sha256:e64db968ed3bad01333da59a29ad3eebe996c041886776b71cfa7867566b35a8
Deleted: sha256:dc351d2479851a5c66bb2b9f9effaad9b63a0928955f354754e9624db7558d3c
Deleted: sha256:40ec7eb756ae383cbfda8dda20099adbd76a5d638e03b0e2dc37d82ba54212ce
Deleted: sha256:01cc30d437c2c3252b41b7cdfc6290dcddf5a326e45e2ba53a9bfd142368890c
Deleted: sha256:d7fcdce51c587b4bdd46803defefb8269744e3d41720e51b70e60b7fa7e86261
Deleted: sha256:2cc4d4f1a4d3582d7504a50f80ebd8ba2f9f1019a70d14625ca9d46b25fe181f
Deleted: sha256:3c8cc116c3af220a24d15a1ee36d60371ba95c0eabbfc4061a242b1ce0dc70c8
Deleted: sha256:4f504c862f2af868e0d57c5755c0daae5a86e7a65a71fb6a46396bed78d16767
Deleted: sha256:306d197ed524367e696c9493872e84fdea9c5da15a1baa85d2fb4d8787487cf8
Deleted: sha256:0e332e9b0115b28e52b357f852e07754b6f2a42ca82fc6c6e06a09bc75062c43
Deleted: sha256:d0c417abd813c9e562bc0bf997ee0ec82ab64daefa7a7d7a7023dcf0c613f079
Deleted: sha256:7bee0ff0775722c9d2770e724183c98a5b6a91b8743e3865170f1519a3b1c8b5
Deleted: sha256:dfecfb3a88c8041ce3dd67c178bca5b7eb367aff6e3de9b7cd2bc68989515d55
Deleted: sha256:eba6f0ccfa13b06c77ff53760a9e27f9539612c129beba3230e7f1a5f92fc147
Build step 'Execute shell' marked build as failure

Mime
View raw message