mesos-builds mailing list archives

Site index · List index
Message view « Date » · « Thread »
Top « Date » · « Thread »
From Apache Jenkins Server <jenk...@builds.apache.org>
Subject Build failed in Jenkins: mesos-reviewbot #16426
Date Mon, 12 Dec 2016 18:16:06 GMT
See <https://builds.apache.org/job/mesos-reviewbot/16426/>

------------------------------------------
[...truncated 170925 lines...]
W1212 18:14:50.222982 29707 backend.cpp:76] Failed to create 'aufs' backend: AufsBackend requires
root privileges, but is running as user mesos
W1212 18:14:50.223166 29707 backend.cpp:76] Failed to create 'bind' backend: BindBackend requires
root privileges
I1212 18:14:50.227423 29727 slave.cpp:209] Mesos agent started on (670)@172.17.0.2:39624
I1212 18:14:50.227463 29727 slave.cpp:210] Flags at startup: --acls="" --appc_simple_discovery_uri_prefix="http://"
--appc_store_dir="/tmp/mesos/store/appc" --authenticate_http_readonly="true" --authenticate_http_readwrite="true"
--authenticatee="crammd5" --authentication_backoff_factor="1secs" --authorizer="local" --cgroups_cpu_enable_pids_and_tids_count="false"
--cgroups_enable_cfs="false" --cgroups_hierarchy="/sys/fs/cgroup" --cgroups_limit_swap="false"
--cgroups_root="mesos" --container_disk_watch_interval="15secs" --containerizers="mesos" --credential="/tmp/Endpoint_SlaveEndpointTest_AuthorizedRequest_1_I9IgtY/credential"
--default_role="*" --disk_watch_interval="1mins" --docker="docker" --docker_kill_orphans="true"
--docker_registry="https://registry-1.docker.io" --docker_remove_delay="6hrs" --docker_socket="/var/run/docker.sock"
--docker_stop_timeout="0ns" --docker_store_dir="/tmp/mesos/store/docker" --docker_volume_checkpoint_dir="/var/run/mesos/isolators/docker/volume"
--enforce_container_disk_quota="false" --executor_registration_timeout="1mins" --executor_shutdown_grace_period="5secs"
--fetcher_cache_dir="/tmp/Endpoint_SlaveEndpointTest_AuthorizedRequest_1_I9IgtY/fetch" --fetcher_cache_size="2GB"
--frameworks_home="" --gc_delay="1weeks" --gc_disk_headroom="0.1" --hadoop_home="" --help="false"
--hostname_lookup="true" --http_authenticators="basic" --http_command_executor="false" --http_credentials="/tmp/Endpoint_SlaveEndpointTest_AuthorizedRequest_1_I9IgtY/http_credentials"
--image_provisioner_backend="copy" --initialize_driver_logging="true" --isolation="posix/cpu,posix/mem"
--launcher="posix" --launcher_dir="/mesos/mesos-1.2.0/_build/src" --logbufsecs="0" --logging_level="INFO"
--max_completed_executors_per_framework="150" --oversubscribed_resources_interval="15secs"
--perf_duration="10secs" --perf_interval="1mins" --qos_correction_interval_min="0ns" --quiet="false"
--recover="reconnect" --recovery_timeout="15mins" --registration_backoff_factor="10ms" --resources="cpus:2;gpus:0;mem:1024;disk:1024;ports:[31000-32000]"
--revocable_cpu_low_priority="true" --runtime_dir="/tmp/Endpoint_SlaveEndpointTest_AuthorizedRequest_1_I9IgtY"
--sandbox_directory="/mnt/mesos/sandbox" --strict="true" --switch_user="true" --systemd_enable_support="true"
--systemd_runtime_directory="/run/systemd/system" --version="false" --work_dir="/tmp/Endpoint_SlaveEndpointTest_AuthorizedRequest_1_3oiOI4"
I1212 18:14:50.228495 29727 credentials.hpp:86] Loading credential for authentication from
'/tmp/Endpoint_SlaveEndpointTest_AuthorizedRequest_1_I9IgtY/credential'
I1212 18:14:50.228762 29727 slave.cpp:347] Agent using credential for: test-principal
I1212 18:14:50.228798 29727 credentials.hpp:37] Loading credentials for authentication from
'/tmp/Endpoint_SlaveEndpointTest_AuthorizedRequest_1_I9IgtY/http_credentials'
I1212 18:14:50.229213 29727 http.cpp:922] Using default 'basic' HTTP authenticator for realm
'mesos-agent-readonly'
I1212 18:14:50.229437 29727 http.cpp:922] Using default 'basic' HTTP authenticator for realm
'mesos-agent-readwrite'
I1212 18:14:50.231546 29727 slave.cpp:534] Agent resources: cpus(*):2; mem(*):1024; disk(*):1024;
ports(*):[31000-32000]
I1212 18:14:50.231653 29727 slave.cpp:542] Agent attributes: [  ]
I1212 18:14:50.231673 29727 slave.cpp:547] Agent hostname: 1f6637ce0837
I1212 18:14:50.233258 29733 state.cpp:57] Recovering state from '/tmp/Endpoint_SlaveEndpointTest_AuthorizedRequest_1_3oiOI4/meta'
I1212 18:14:50.233618 29739 status_update_manager.cpp:203] Recovering status update manager
I1212 18:14:50.233937 29736 containerizer.cpp:594] Recovering containerizer
I1212 18:14:50.235370 29738 provisioner.cpp:253] Provisioner recovery complete
I1212 18:14:50.235805 29741 slave.cpp:5415] Finished recovery
I1212 18:14:50.236353 29741 slave.cpp:5589] Querying resource estimator for oversubscribable
resources
I1212 18:14:50.236690 29730 slave.cpp:5603] Received oversubscribable resources {} from the
resource estimator
I1212 18:14:50.239403 29735 process.cpp:3679] Handling HTTP event for process 'slave(670)'
with path: '/slave(670)/monitor/statistics.json'
I1212 18:14:50.240823 29740 http.cpp:874] Authorizing principal 'test-principal' to GET the
'/monitor/statistics.json' endpoint
I1212 18:14:50.245570 29731 slave.cpp:791] Agent terminating
[       OK ] Endpoint/SlaveEndpointTest.AuthorizedRequest/1 (35 ms)
[ RUN      ] Endpoint/SlaveEndpointTest.AuthorizedRequest/2
I1212 18:14:50.260079 29707 containerizer.cpp:220] Using isolation: posix/cpu,posix/mem,filesystem/posix,network/cni
W1212 18:14:50.260749 29707 backend.cpp:76] Failed to create 'aufs' backend: AufsBackend requires
root privileges, but is running as user mesos
W1212 18:14:50.260907 29707 backend.cpp:76] Failed to create 'bind' backend: BindBackend requires
root privileges
I1212 18:14:50.264185 29727 slave.cpp:209] Mesos agent started on (671)@172.17.0.2:39624
I1212 18:14:50.264256 29727 slave.cpp:210] Flags at startup: --acls="" --appc_simple_discovery_uri_prefix="http://"
--appc_store_dir="/tmp/mesos/store/appc" --authenticate_http_readonly="true" --authenticate_http_readwrite="true"
--authenticatee="crammd5" --authentication_backoff_factor="1secs" --authorizer="local" --cgroups_cpu_enable_pids_and_tids_count="false"
--cgroups_enable_cfs="false" --cgroups_hierarchy="/sys/fs/cgroup" --cgroups_limit_swap="false"
--cgroups_root="mesos" --container_disk_watch_interval="15secs" --containerizers="mesos" --credential="/tmp/Endpoint_SlaveEndpointTest_AuthorizedRequest_2_yGUENz/credential"
--default_role="*" --disk_watch_interval="1mins" --docker="docker" --docker_kill_orphans="true"
--docker_registry="https://registry-1.docker.io" --docker_remove_delay="6hrs" --docker_socket="/var/run/docker.sock"
--docker_stop_timeout="0ns" --docker_store_dir="/tmp/mesos/store/docker" --docker_volume_checkpoint_dir="/var/run/mesos/isolators/docker/volume"
--enforce_container_disk_quota="false" --executor_registration_timeout="1mins" --executor_shutdown_grace_period="5secs"
--fetcher_cache_dir="/tmp/Endpoint_SlaveEndpointTest_AuthorizedRequest_2_yGUENz/fetch" --fetcher_cache_size="2GB"
--frameworks_home="" --gc_delay="1weeks" --gc_disk_headroom="0.1" --hadoop_home="" --help="false"
--hostname_lookup="true" --http_authenticators="basic" --http_command_executor="false" --http_credentials="/tmp/Endpoint_SlaveEndpointTest_AuthorizedRequest_2_yGUENz/http_credentials"
--image_provisioner_backend="copy" --initialize_driver_logging="true" --isolation="posix/cpu,posix/mem"
--launcher="posix" --launcher_dir="/mesos/mesos-1.2.0/_build/src" --logbufsecs="0" --logging_level="INFO"
--max_completed_executors_per_framework="150" --oversubscribed_resources_interval="15secs"
--perf_duration="10secs" --perf_interval="1mins" --qos_correction_interval_min="0ns" --quiet="false"
--recover="reconnect" --recovery_timeout="15mins" --registration_backoff_factor="10ms" --resources="cpus:2;gpus:0;mem:1024;disk:1024;ports:[31000-32000]"
--revocable_cpu_low_priority="true" --runtime_dir="/tmp/Endpoint_SlaveEndpointTest_AuthorizedRequest_2_yGUENz"
--sandbox_directory="/mnt/mesos/sandbox" --strict="true" --switch_user="true" --systemd_enable_support="true"
--systemd_runtime_directory="/run/systemd/system" --version="false" --work_dir="/tmp/Endpoint_SlaveEndpointTest_AuthorizedRequest_2_1CM5WF"
I1212 18:14:50.264827 29727 credentials.hpp:86] Loading credential for authentication from
'/tmp/Endpoint_SlaveEndpointTest_AuthorizedRequest_2_yGUENz/credential'
I1212 18:14:50.265064 29727 slave.cpp:347] Agent using credential for: test-principal
I1212 18:14:50.265095 29727 credentials.hpp:37] Loading credentials for authentication from
'/tmp/Endpoint_SlaveEndpointTest_AuthorizedRequest_2_yGUENz/http_credentials'
I1212 18:14:50.265374 29727 http.cpp:922] Using default 'basic' HTTP authenticator for realm
'mesos-agent-readonly'
I1212 18:14:50.265552 29727 http.cpp:922] Using default 'basic' HTTP authenticator for realm
'mesos-agent-readwrite'
I1212 18:14:50.266732 29727 slave.cpp:534] Agent resources: cpus(*):2; mem(*):1024; disk(*):1024;
ports(*):[31000-32000]
I1212 18:14:50.266819 29727 slave.cpp:542] Agent attributes: [  ]
I1212 18:14:50.266839 29727 slave.cpp:547] Agent hostname: 1f6637ce0837
I1212 18:14:50.268451 29734 state.cpp:57] Recovering state from '/tmp/Endpoint_SlaveEndpointTest_AuthorizedRequest_2_1CM5WF/meta'
I1212 18:14:50.268832 29732 status_update_manager.cpp:203] Recovering status update manager
I1212 18:14:50.269047 29734 containerizer.cpp:594] Recovering containerizer
I1212 18:14:50.270887 29727 provisioner.cpp:253] Provisioner recovery complete
I1212 18:14:50.271358 29737 slave.cpp:5415] Finished recovery
I1212 18:14:50.272068 29737 slave.cpp:5589] Querying resource estimator for oversubscribable
resources
I1212 18:14:50.272368 29737 slave.cpp:5603] Received oversubscribable resources {} from the
resource estimator
I1212 18:14:50.275429 29741 process.cpp:3679] Handling HTTP event for process 'slave(671)'
with path: '/slave(671)/containers'
I1212 18:14:50.277245 29732 http.cpp:874] Authorizing principal 'test-principal' to GET the
'/containers' endpoint
I1212 18:14:50.280993 29738 slave.cpp:791] Agent terminating
[       OK ] Endpoint/SlaveEndpointTest.AuthorizedRequest/2 (33 ms)
[ RUN      ] Endpoint/SlaveEndpointTest.UnauthorizedRequest/0
I1212 18:14:50.292999 29707 containerizer.cpp:220] Using isolation: posix/cpu,posix/mem,filesystem/posix,network/cni
W1212 18:14:50.293665 29707 backend.cpp:76] Failed to create 'aufs' backend: AufsBackend requires
root privileges, but is running as user mesos
W1212 18:14:50.293850 29707 backend.cpp:76] Failed to create 'bind' backend: BindBackend requires
root privileges
I1212 18:14:50.297333 29728 slave.cpp:209] Mesos agent started on (672)@172.17.0.2:39624
I1212 18:14:50.297364 29728 slave.cpp:210] Flags at startup: --acls="" --appc_simple_discovery_uri_prefix="http://"
--appc_store_dir="/tmp/mesos/store/appc" --authenticate_http_readonly="true" --authenticate_http_readwrite="true"
--authenticatee="crammd5" --authentication_backoff_factor="1secs" --authorizer="local" --cgroups_cpu_enable_pids_and_tids_count="false"
--cgroups_enable_cfs="false" --cgroups_hierarchy="/sys/fs/cgroup" --cgroups_limit_swap="false"
--cgroups_root="mesos" --container_disk_watch_interval="15secs" --containerizers="mesos" --credential="/tmp/Endpoint_SlaveEndpointTest_UnauthorizedRequest_0_s9qaub/credential"
--default_role="*" --disk_watch_interval="1mins" --docker="docker" --docker_kill_orphans="true"
--docker_registry="https://registry-1.docker.io" --docker_remove_delay="6hrs" --docker_socket="/var/run/docker.sock"
--docker_stop_timeout="0ns" --docker_store_dir="/tmp/mesos/store/docker" --docker_volume_checkpoint_dir="/var/run/mesos/isolators/docker/volume"
--enforce_container_disk_quota="false" --executor_registration_timeout="1mins" --executor_shutdown_grace_period="5secs"
--fetcher_cache_dir="/tmp/Endpoint_SlaveEndpointTest_UnauthorizedRequest_0_s9qaub/fetch" --fetcher_cache_size="2GB"
--frameworks_home="" --gc_delay="1weeks" --gc_disk_headroom="0.1" --hadoop_home="" --help="false"
--hostname_lookup="true" --http_authenticators="basic" --http_command_executor="false" --http_credentials="/tmp/Endpoint_SlaveEndpointTest_UnauthorizedRequest_0_s9qaub/http_credentials"
--image_provisioner_backend="copy" --initialize_driver_logging="true" --isolation="posix/cpu,posix/mem"
--launcher="posix" --launcher_dir="/mesos/mesos-1.2.0/_build/src" --logbufsecs="0" --logging_level="INFO"
--max_completed_executors_per_framework="150" --oversubscribed_resources_interval="15secs"
--perf_duration="10secs" --perf_interval="1mins" --qos_correction_interval_min="0ns" --quiet="false"
--recover="reconnect" --recovery_timeout="15mins" --registration_backoff_factor="10ms" --resources="cpus:2;gpus:0;mem:1024;disk:1024;ports:[31000-32000]"
--revocable_cpu_low_priority="true" --runtime_dir="/tmp/Endpoint_SlaveEndpointTest_UnauthorizedRequest_0_s9qaub"
--sandbox_directory="/mnt/mesos/sandbox" --strict="true" --switch_user="true" --systemd_enable_support="true"
--systemd_runtime_directory="/run/systemd/system" --version="false" --work_dir="/tmp/Endpoint_SlaveEndpointTest_UnauthorizedRequest_0_B10ayh"
I1212 18:14:50.297998 29728 credentials.hpp:86] Loading credential for authentication from
'/tmp/Endpoint_SlaveEndpointTest_UnauthorizedRequest_0_s9qaub/credential'
I1212 18:14:50.298185 29728 slave.cpp:347] Agent using credential for: test-principal
I1212 18:14:50.298213 29728 credentials.hpp:37] Loading credentials for authentication from
'/tmp/Endpoint_SlaveEndpointTest_UnauthorizedRequest_0_s9qaub/http_credentials'
I1212 18:14:50.298509 29728 http.cpp:922] Using default 'basic' HTTP authenticator for realm
'mesos-agent-readonly'
I1212 18:14:50.298729 29728 http.cpp:922] Using default 'basic' HTTP authenticator for realm
'mesos-agent-readwrite'
I1212 18:14:50.300040 29728 slave.cpp:534] Agent resources: cpus(*):2; mem(*):1024; disk(*):1024;
ports(*):[31000-32000]
I1212 18:14:50.300128 29728 slave.cpp:542] Agent attributes: [  ]
I1212 18:14:50.300143 29728 slave.cpp:547] Agent hostname: 1f6637ce0837
I1212 18:14:50.302034 29727 state.cpp:57] Recovering state from '/tmp/Endpoint_SlaveEndpointTest_UnauthorizedRequest_0_B10ayh/meta'
I1212 18:14:50.302413 29733 status_update_manager.cpp:203] Recovering status update manager
I1212 18:14:50.302621 29727 containerizer.cpp:594] Recovering containerizer
I1212 18:14:50.304232 29731 provisioner.cpp:253] Provisioner recovery complete
I1212 18:14:50.304592 29728 slave.cpp:5415] Finished recovery
I1212 18:14:50.305074 29728 slave.cpp:5589] Querying resource estimator for oversubscribable
resources
I1212 18:14:50.305335 29726 slave.cpp:5603] Received oversubscribable resources {} from the
resource estimator
I1212 18:14:50.308809 29732 process.cpp:3679] Handling HTTP event for process 'slave(672)'
with path: '/slave(672)/monitor/statistics'
I1212 18:14:50.310206 29726 http.cpp:874] Authorizing principal 'test-principal' to GET the
'/monitor/statistics' endpoint
I1212 18:14:50.312738 29732 slave.cpp:791] Agent terminating
[       OK ] Endpoint/SlaveEndpointTest.UnauthorizedRequest/0 (30 ms)
[ RUN      ] Endpoint/SlaveEndpointTest.UnauthorizedRequest/1
I1212 18:14:50.324513 29707 containerizer.cpp:220] Using isolation: posix/cpu,posix/mem,filesystem/posix,network/cni
W1212 18:14:50.325371 29707 backend.cpp:76] Failed to create 'aufs' backend: AufsBackend requires
root privileges, but is running as user mesos
W1212 18:14:50.325610 29707 backend.cpp:76] Failed to create 'bind' backend: BindBackend requires
root privileges
I1212 18:14:50.331017 29740 slave.cpp:209] Mesos agent started on (673)@172.17.0.2:39624
I1212 18:14:50.331507 29740 slave.cpp:210] Flags at startup: --acls="" --appc_simple_discovery_uri_prefix="http://"
--appc_store_dir="/tmp/mesos/store/appc" --authenticate_http_readonly="true" --authenticate_http_readwrite="true"
--authenticatee="crammd5" --authentication_backoff_factor="1secs" --authorizer="local" --cgroups_cpu_enable_pids_and_tids_count="false"
--cgroups_enable_cfs="false" --cgroups_hierarchy="/sys/fs/cgroup" --cgroups_limit_swap="false"
--cgroups_root="mesos" --container_disk_watch_interval="15secs" --containerizers="mesos" --credential="/tmp/Endpoint_SlaveEndpointTest_UnauthorizedRequest_1_mI2TuN/credential"
--default_role="*" --disk_watch_interval="1mins" --docker="docker" --docker_kill_orphans="true"
--docker_registry="https://registry-1.docker.io" --docker_remove_delay="6hrs" --docker_socket="/var/run/docker.sock"
--docker_stop_timeout="0ns" --docker_store_dir="/tmp/mesos/store/docker" --docker_volume_checkpoint_dir="/var/run/mesos/isolators/docker/volume"
--enforce_container_disk_quota="false" --executor_registration_timeout="1mins" --executor_shutdown_grace_period="5secs"
--fetcher_cache_dir="/tmp/Endpoint_SlaveEndpointTest_UnauthorizedRequest_1_mI2TuN/fetch" --fetcher_cache_size="2GB"
--frameworks_home="" --gc_delay="1weeks" --gc_disk_headroom="0.1" --hadoop_home="" --help="false"
--hostname_lookup="true" --http_authenticators="basic" --http_command_executor="false" --http_credentials="/tmp/Endpoint_SlaveEndpointTest_UnauthorizedRequest_1_mI2TuN/http_credentials"
--image_provisioner_backend="copy" --initialize_driver_logging="true" --isolation="posix/cpu,posix/mem"
--launcher="posix" --launcher_dir="/mesos/mesos-1.2.0/_build/src" --logbufsecs="0" --logging_level="INFO"
--max_completed_executors_per_framework="150" --oversubscribed_resources_interval="15secs"
--perf_duration="10secs" --perf_interval="1mins" --qos_correction_interval_min="0ns" --quiet="false"
--recover="reconnect" --recovery_timeout="15mins" --registration_backoff_factor="10ms" --resources="cpus:2;gpus:0;mem:1024;disk:1024;ports:[31000-32000]"
--revocable_cpu_low_priority="true" --runtime_dir="/tmp/Endpoint_SlaveEndpointTest_UnauthorizedRequest_1_mI2TuN"
--sandbox_directory="/mnt/mesos/sandbox" --strict="true" --switch_user="true" --systemd_enable_support="true"
--systemd_runtime_directory="/run/systemd/system" --version="false" --work_dir="/tmp/Endpoint_SlaveEndpointTest_UnauthorizedRequest_1_58WWtT"
I1212 18:14:50.332634 29740 credentials.hpp:86] Loading credential for authentication from
'/tmp/Endpoint_SlaveEndpointTest_UnauthorizedRequest_1_mI2TuN/credential'
I1212 18:14:50.333142 29740 slave.cpp:347] Agent using credential for: test-principal
I1212 18:14:50.333169 29740 credentials.hpp:37] Loading credentials for authentication from
'/tmp/Endpoint_SlaveEndpointTest_UnauthorizedRequest_1_mI2TuN/http_credentials'
I1212 18:14:50.333430 29740 http.cpp:922] Using default 'basic' HTTP authenticator for realm
'mesos-agent-readonly'
I1212 18:14:50.333587 29740 http.cpp:922] Using default 'basic' HTTP authenticator for realm
'mesos-agent-readwrite'
I1212 18:14:50.334750 29740 slave.cpp:534] Agent resources: cpus(*):2; mem(*):1024; disk(*):1024;
ports(*):[31000-32000]
I1212 18:14:50.334826 29740 slave.cpp:542] Agent attributes: [  ]
I1212 18:14:50.334841 29740 slave.cpp:547] Agent hostname: 1f6637ce0837
I1212 18:14:50.336472 29739 state.cpp:57] Recovering state from '/tmp/Endpoint_SlaveEndpointTest_UnauthorizedRequest_1_58WWtT/meta'
I1212 18:14:50.336859 29729 status_update_manager.cpp:203] Recovering status update manager
I1212 18:14:50.337162 29739 containerizer.cpp:594] Recovering containerizer
I1212 18:14:50.338681 29738 provisioner.cpp:253] Provisioner recovery complete
I1212 18:14:50.339129 29737 slave.cpp:5415] Finished recovery
I1212 18:14:50.339890 29737 slave.cpp:5589] Querying resource estimator for oversubscribable
resources
I1212 18:14:50.340167 29741 slave.cpp:5603] Received oversubscribable resources {} from the
resource estimator
I1212 18:14:50.342880 29732 process.cpp:3679] Handling HTTP event for process 'slave(673)'
with path: '/slave(673)/monitor/statistics.json'
I1212 18:14:50.344452 29741 http.cpp:874] Authorizing principal 'test-principal' to GET the
'/monitor/statistics.json' endpoint
I1212 18:14:50.346705 29707 slave.cpp:791] Agent terminating
[       OK ] Endpoint/SlaveEndpointTest.UnauthorizedRequest/1 (33 ms)
[ RUN      ] Endpoint/SlaveEndpointTest.UnauthorizedRequest/2
I1212 18:14:50.364979 29707 containerizer.cpp:220] Using isolation: posix/cpu,posix/mem,filesystem/posix,network/cni
W1212 18:14:50.365505 29707 backend.cpp:76] Failed to create 'aufs' backend: AufsBackend requires
root privileges, but is running as user mesos
W1212 18:14:50.365672 29707 backend.cpp:76] Failed to create 'bind' backend: BindBackend requires
root privileges
I1212 18:14:50.368679 29728 slave.cpp:209] Mesos agent started on (674)@172.17.0.2:39624
I1212 18:14:50.368726 29728 slave.cpp:210] Flags at startup: --acls="" --appc_simple_discovery_uri_prefix="http://"
--appc_store_dir="/tmp/mesos/store/appc" --authenticate_http_readonly="true" --authenticate_http_readwrite="true"
--authenticatee="crammd5" --authentication_backoff_factor="1secs" --authorizer="local" --cgroups_cpu_enable_pids_and_tids_count="false"
--cgroups_enable_cfs="false" --cgroups_hierarchy="/sys/fs/cgroup" --cgroups_limit_swap="false"
--cgroups_root="mesos" --container_disk_watch_interval="15secs" --containerizers="mesos" --credential="/tmp/Endpoint_SlaveEndpointTest_UnauthorizedRequest_2_B8uAVp/credential"
--default_role="*" --disk_watch_interval="1mins" --docker="docker" --docker_kill_orphans="true"
--docker_registry="https://registry-1.docker.io" --docker_remove_delay="6hrs" --docker_socket="/var/run/docker.sock"
--docker_stop_timeout="0ns" --docker_store_dir="/tmp/mesos/store/docker" --docker_volume_checkpoint_dir="/var/run/mesos/isolators/docker/volume"
--enforce_container_disk_quota="false" --executor_registration_timeout="1mins" --executor_shutdown_grace_period="5secs"
--fetcher_cache_dir="/tmp/Endpoint_SlaveEndpointTest_UnauthorizedRequest_2_B8uAVp/fetch" --fetcher_cache_size="2GB"
--frameworks_home="" --gc_delay="1weeks" --gc_disk_headroom="0.1" --hadoop_home="" --help="false"
--hostname_lookup="true" --http_authenticators="basic" --http_command_executor="false" --http_credentials="/tmp/Endpoint_SlaveEndpointTest_UnauthorizedRequest_2_B8uAVp/http_credentials"
--image_provisioner_backend="copy" --initialize_driver_logging="true" --isolation="posix/cpu,posix/mem"
--launcher="posix" --launcher_dir="/mesos/mesos-1.2.0/_build/src" --logbufsecs="0" --logging_level="INFO"
--max_completed_executors_per_framework="150" --oversubscribed_resources_interval="15secs"
--perf_duration="10secs" --perf_interval="1mins" --qos_correction_interval_min="0ns" --quiet="false"
--recover="reconnect" --recovery_timeout="15mins" --registration_backoff_factor="10ms" --resources="cpus:2;gpus:0;mem:1024;disk:1024;ports:[31000-32000]"
--revocable_cpu_low_priority="true" --runtime_dir="/tmp/Endpoint_SlaveEndpointTest_UnauthorizedRequest_2_B8uAVp"
--sandbox_directory="/mnt/mesos/sandbox" --strict="true" --switch_user="true" --systemd_enable_support="true"
--systemd_runtime_directory="/run/systemd/system" --version="false" --work_dir="/tmp/Endpoint_SlaveEndpointTest_UnauthorizedRequest_2_zSlSNv"
I1212 18:14:50.369283 29728 credentials.hpp:86] Loading credential for authentication from
'/tmp/Endpoint_SlaveEndpointTest_UnauthorizedRequest_2_B8uAVp/credential'
I1212 18:14:50.369508 29728 slave.cpp:347] Agent using credential for: test-principal
I1212 18:14:50.369633 29728 credentials.hpp:37] Loading credentials for authentication from
'/tmp/Endpoint_SlaveEndpointTest_UnauthorizedRequest_2_B8uAVp/http_credentials'
I1212 18:14:50.370051 29728 http.cpp:922] Using default 'basic' HTTP authenticator for realm
'mesos-agent-readonly'
I1212 18:14:50.370224 29728 http.cpp:922] Using default 'basic' HTTP authenticator for realm
'mesos-agent-readwrite'
I1212 18:14:50.371716 29728 slave.cpp:534] Agent resources: cpus(*):2; mem(*):1024; disk(*):1024;
ports(*):[31000-32000]
I1212 18:14:50.371851 29728 slave.cpp:542] Agent attributes: [  ]
I1212 18:14:50.371871 29728 slave.cpp:547] Agent hostname: 1f6637ce0837
I1212 18:14:50.373289 29733 state.cpp:57] Recovering state from '/tmp/Endpoint_SlaveEndpointTest_UnauthorizedRequest_2_zSlSNv/meta'
I1212 18:14:50.373713 29732 status_update_manager.cpp:203] Recovering status update manager
I1212 18:14:50.373951 29737 containerizer.cpp:594] Recovering containerizer
I1212 18:14:50.375427 29736 provisioner.cpp:253] Provisioner recovery complete
I1212 18:14:50.375823 29731 slave.cpp:5415] Finished recovery
I1212 18:14:50.376291 29731 slave.cpp:5589] Querying resource estimator for oversubscribable
resources
I1212 18:14:50.376560 29729 slave.cpp:5603] Received oversubscribable resources {} from the
resource estimator
I1212 18:14:50.379729 29736 process.cpp:3679] Handling HTTP event for process 'slave(674)'
with path: '/slave(674)/containers'
I1212 18:14:50.381157 29736 http.cpp:874] Authorizing principal 'test-principal' to GET the
'/containers' endpoint
I1212 18:14:50.383615 29740 slave.cpp:791] Agent terminating
[       OK ] Endpoint/SlaveEndpointTest.UnauthorizedRequest/2 (29 ms)
[ RUN      ] Endpoint/SlaveEndpointTest.NoAuthorizer/0
I1212 18:14:50.395201 29707 containerizer.cpp:220] Using isolation: posix/cpu,posix/mem,filesystem/posix,network/cni
W1212 18:14:50.395925 29707 backend.cpp:76] Failed to create 'aufs' backend: AufsBackend requires
root privileges, but is running as user mesos
W1212 18:14:50.396128 29707 backend.cpp:76] Failed to create 'bind' backend: BindBackend requires
root privileges
I1212 18:14:50.398067 29707 cluster.cpp:446] Creating default 'local' authorizer
I1212 18:14:50.400071 29735 slave.cpp:209] Mesos agent started on (675)@172.17.0.2:39624
I1212 18:14:50.400094 29735 slave.cpp:210] Flags at startup: --acls="" --appc_simple_discovery_uri_prefix="http://"
--appc_store_dir="/tmp/mesos/store/appc" --authenticate_http_readonly="true" --authenticate_http_readwrite="true"
--authenticatee="crammd5" --authentication_backoff_factor="1secs" --authorizer="local" --cgroups_cpu_enable_pids_and_tids_count="false"
--cgroups_enable_cfs="false" --cgroups_hierarchy="/sys/fs/cgroup" --cgroups_limit_swap="false"
--cgroups_root="mesos" --container_disk_watch_interval="15secs" --containerizers="mesos" --credential="/tmp/Endpoint_SlaveEndpointTest_NoAuthorizer_0_pHcDG2/credential"
--default_role="*" --disk_watch_interval="1mins" --docker="docker" --docker_kill_orphans="true"
--docker_registry="https://registry-1.docker.io" --docker_remove_delay="6hrs" --docker_socket="/var/run/docker.sock"
--docker_stop_timeout="0ns" --docker_store_dir="/tmp/mesos/store/docker" --docker_volume_checkpoint_dir="/var/run/mesos/isolators/docker/volume"
--enforce_container_disk_quota="false" --executor_registration_timeout="1mins" --executor_shutdown_grace_period="5secs"
--fetcher_cache_dir="/tmp/Endpoint_SlaveEndpointTest_NoAuthorizer_0_pHcDG2/fetch" --fetcher_cache_size="2GB"
--frameworks_home="" --gc_delay="1weeks" --gc_disk_headroom="0.1" --hadoop_home="" --help="false"
--hostname_lookup="true" --http_authenticators="basic" --http_command_executor="false" --http_credentials="/tmp/Endpoint_SlaveEndpointTest_NoAuthorizer_0_pHcDG2/http_credentials"
--image_provisioner_backend="copy" --initialize_driver_logging="true" --isolation="posix/cpu,posix/mem"
--launcher="posix" --launcher_dir="/mesos/mesos-1.2.0/_build/src" --logbufsecs="0" --logging_level="INFO"
--max_completed_executors_per_framework="150" --oversubscribed_resources_interval="15secs"
--perf_duration="10secs" --perf_interval="1mins" --qos_correction_interval_min="0ns" --quiet="false"
--recover="reconnect" --recovery_timeout="15mins" --registration_backoff_factor="10ms" --resources="cpus:2;gpus:0;mem:1024;disk:1024;ports:[31000-32000]"
--revocable_cpu_low_priority="true" --runtime_dir="/tmp/Endpoint_SlaveEndpointTest_NoAuthorizer_0_pHcDG2"
--sandbox_directory="/mnt/mesos/sandbox" --strict="true" --switch_user="true" --systemd_enable_support="true"
--systemd_runtime_directory="/run/systemd/system" --version="false" --work_dir="/tmp/Endpoint_SlaveEndpointTest_NoAuthorizer_0_wtq7t8"
I1212 18:14:50.400738 29735 credentials.hpp:86] Loading credential for authentication from
'/tmp/Endpoint_SlaveEndpointTest_NoAuthorizer_0_pHcDG2/credential'
I1212 18:14:50.400920 29735 slave.cpp:347] Agent using credential for: test-principal
I1212 18:14:50.400952 29735 credentials.hpp:37] Loading credentials for authentication from
'/tmp/Endpoint_SlaveEndpointTest_NoAuthorizer_0_pHcDG2/http_credentials'
I1212 18:14:50.401295 29735 http.cpp:922] Using default 'basic' HTTP authenticator for realm
'mesos-agent-readonly'
I1212 18:14:50.401608 29735 http.cpp:922] Using default 'basic' HTTP authenticator for realm
'mesos-agent-readwrite'
I1212 18:14:50.402722 29735 slave.cpp:534] Agent resources: cpus(*):2; mem(*):1024; disk(*):1024;
ports(*):[31000-32000]
I1212 18:14:50.402812 29735 slave.cpp:542] Agent attributes: [  ]
I1212 18:14:50.402827 29735 slave.cpp:547] Agent hostname: 1f6637ce0837
I1212 18:14:50.404456 29727 state.cpp:57] Recovering state from '/tmp/Endpoint_SlaveEndpointTest_NoAuthorizer_0_wtq7t8/meta'
I1212 18:14:50.404775 29728 status_update_manager.cpp:203] Recovering status update manager
I1212 18:14:50.405069 29726 containerizer.cpp:594] Recovering containerizer
I1212 18:14:50.407418 29726 provisioner.cpp:253] Provisioner recovery complete
I1212 18:14:50.408109 29734 slave.cpp:5415] Finished recovery
I1212 18:14:50.408712 29734 slave.cpp:5589] Querying resource estimator for oversubscribable
resources
I1212 18:14:50.409478 29734 slave.cpp:5603] Received oversubscribable resources {} from the
resource estimator
I1212 18:14:50.412927 29739 process.cpp:3679] Handling HTTP event for process 'slave(675)'
with path: '/slave(675)/monitor/statistics'
I1212 18:14:50.414726 29738 http.cpp:874] Authorizing principal 'test-principal' to GET the
'/monitor/statistics' endpoint
I1212 18:14:50.418789 29738 slave.cpp:791] Agent terminating
[       OK ] Endpoint/SlaveEndpointTest.NoAuthorizer/0 (37 ms)
[ RUN      ] Endpoint/SlaveEndpointTest.NoAuthorizer/1
I1212 18:14:50.431778 29707 containerizer.cpp:220] Using isolation: posix/cpu,posix/mem,filesystem/posix,network/cni
W1212 18:14:50.432374 29707 backend.cpp:76] Failed to create 'aufs' backend: AufsBackend requires
root privileges, but is running as user mesos
W1212 18:14:50.432544 29707 backend.cpp:76] Failed to create 'bind' backend: BindBackend requires
root privileges
I1212 18:14:50.434566 29707 cluster.cpp:446] Creating default 'local' authorizer
I1212 18:14:50.436247 29728 slave.cpp:209] Mesos agent started on (676)@172.17.0.2:39624
I1212 18:14:50.436271 29728 slave.cpp:210] Flags at startup: --acls="" --appc_simple_discovery_uri_prefix="http://"
--appc_store_dir="/tmp/mesos/store/appc" --authenticate_http_readonly="true" --authenticate_http_readwrite="true"
--authenticatee="crammd5" --authentication_backoff_factor="1secs" --authorizer="local" --cgroups_cpu_enable_pids_and_tids_count="false"
--cgroups_enable_cfs="false" --cgroups_hierarchy="/sys/fs/cgroup" --cgroups_limit_swap="false"
--cgroups_root="mesos" --container_disk_watch_interval="15secs" --containerizers="mesos" --credential="/tmp/Endpoint_SlaveEndpointTest_NoAuthorizer_1_JcP7OF/credential"
--default_role="*" --disk_watch_interval="1mins" --docker="docker" --docker_kill_orphans="true"
--docker_registry="https://registry-1.docker.io" --docker_remove_delay="6hrs" --docker_socket="/var/run/docker.sock"
--docker_stop_timeout="0ns" --docker_store_dir="/tmp/mesos/store/docker" --docker_volume_checkpoint_dir="/var/run/mesos/isolators/docker/volume"
--enforce_container_disk_quota="false" --executor_registration_timeout="1mins" --executor_shutdown_grace_period="5secs"
--fetcher_cache_dir="/tmp/Endpoint_SlaveEndpointTest_NoAuthorizer_1_JcP7OF/fetch" --fetcher_cache_size="2GB"
--frameworks_home="" --gc_delay="1weeks" --gc_disk_headroom="0.1" --hadoop_home="" --help="false"
--hostname_lookup="true" --http_authenticators="basic" --http_command_executor="false" --http_credentials="/tmp/Endpoint_SlaveEndpointTest_NoAuthorizer_1_JcP7OF/http_credentials"
--image_provisioner_backend="copy" --initialize_driver_logging="true" --isolation="posix/cpu,posix/mem"
--launcher="posix" --launcher_dir="/mesos/mesos-1.2.0/_build/src" --logbufsecs="0" --logging_level="INFO"
--max_completed_executors_per_framework="150" --oversubscribed_resources_interval="15secs"
--perf_duration="10secs" --perf_interval="1mins" --qos_correction_interval_min="0ns" --quiet="false"
--recover="reconnect" --recovery_timeout="15mins" --registration_backoff_factor="10ms" --resources="cpus:2;gpus:0;mem:1024;disk:1024;ports:[31000-32000]"
--revocable_cpu_low_priority="true" --runtime_dir="/tmp/Endpoint_SlaveEndpointTest_NoAuthorizer_1_JcP7OF"
--sandbox_directory="/mnt/mesos/sandbox" --strict="true" --switch_user="true" --systemd_enable_support="true"
--systemd_runtime_directory="/run/systemd/system" --version="false" --work_dir="/tmp/Endpoint_SlaveEndpointTest_NoAuthorizer_1_K2rzwL"
I1212 18:14:50.436969 29728 credentials.hpp:86] Loading credential for authentication from
'/tmp/Endpoint_SlaveEndpointTest_NoAuthorizer_1_JcP7OF/credential'
I1212 18:14:50.437178 29728 slave.cpp:347] Agent using credential for: test-principal
I1212 18:14:50.437204 29728 credentials.hpp:37] Loading credentials for authentication from
'/tmp/Endpoint_SlaveEndpointTest_NoAuthorizer_1_JcP7OF/http_credentials'
I1212 18:14:50.437454 29728 http.cpp:922] Using default 'basic' HTTP authenticator for realm
'mesos-agent-readonly'
I1212 18:14:50.437602 29728 http.cpp:922] Using default 'basic' HTTP authenticator for realm
'mesos-agent-readwrite'
I1212 18:14:50.438614 29728 slave.cpp:534] Agent resources: cpus(*):2; mem(*):1024; disk(*):1024;
ports(*):[31000-32000]
I1212 18:14:50.438696 29728 slave.cpp:542] Agent attributes: [  ]
I1212 18:14:50.438709 29728 slave.cpp:547] Agent hostname: 1f6637ce0837
I1212 18:14:50.440227 29732 state.cpp:57] Recovering state from '/tmp/Endpoint_SlaveEndpointTest_NoAuthorizer_1_K2rzwL/meta'
I1212 18:14:50.440663 29739 status_update_manager.cpp:203] Recovering status update manager
I1212 18:14:50.440932 29729 containerizer.cpp:594] Recovering containerizer
I1212 18:14:50.442821 29731 provisioner.cpp:253] Provisioner recovery complete
I1212 18:14:50.443253 29732 slave.cpp:5415] Finished recovery
I1212 18:14:50.443955 29732 slave.cpp:5589] Querying resource estimator for oversubscribable
resources
I1212 18:14:50.444283 29732 slave.cpp:5603] Received oversubscribable resources {} from the
resource estimator
I1212 18:14:50.447230 29735 process.cpp:3679] Handling HTTP event for process 'slave(676)'
with path: '/slave(676)/monitor/statistics.json'
I1212 18:14:50.449237 29738 http.cpp:874] Authorizing principal 'test-principal' to GET the
'/monitor/statistics.json' endpoint
I1212 18:14:50.454022 29730 slave.cpp:791] Agent terminating
[       OK ] Endpoint/SlaveEndpointTest.NoAuthorizer/1 (33 ms)
[ RUN      ] Endpoint/SlaveEndpointTest.NoAuthorizer/2
I1212 18:14:50.466539 29707 containerizer.cpp:220] Using isolation: posix/cpu,posix/mem,filesystem/posix,network/cni
W1212 18:14:50.467236 29707 backend.cpp:76] Failed to create 'aufs' backend: AufsBackend requires
root privileges, but is running as user mesos
W1212 18:14:50.467433 29707 backend.cpp:76] Failed to create 'bind' backend: BindBackend requires
root privileges
I1212 18:14:50.469457 29707 cluster.cpp:446] Creating default 'local' authorizer
I1212 18:14:50.471364 29735 slave.cpp:209] Mesos agent started on (677)@172.17.0.2:39624
I1212 18:14:50.471393 29735 slave.cpp:210] Flags at startup: --acls="" --appc_simple_discovery_uri_prefix="http://"
--appc_store_dir="/tmp/mesos/store/appc" --authenticate_http_readonly="true" --authenticate_http_readwrite="true"
--authenticatee="crammd5" --authentication_backoff_factor="1secs" --authorizer="local" --cgroups_cpu_enable_pids_and_tids_count="false"
--cgroups_enable_cfs="false" --cgroups_hierarchy="/sys/fs/cgroup" --cgroups_limit_swap="false"
--cgroups_root="mesos" --container_disk_watch_interval="15secs" --containerizers="mesos" --credential="/tmp/Endpoint_SlaveEndpointTest_NoAuthorizer_2_HYzSjj/credential"
--default_role="*" --disk_watch_interval="1mins" --docker="docker" --docker_kill_orphans="true"
--docker_registry="https://registry-1.docker.io" --docker_remove_delay="6hrs" --docker_socket="/var/run/docker.sock"
--docker_stop_timeout="0ns" --docker_store_dir="/tmp/mesos/store/docker" --docker_volume_checkpoint_dir="/var/run/mesos/isolators/docker/volume"
--enforce_container_disk_quota="false" --executor_registration_timeout="1mins" --executor_shutdown_grace_period="5secs"
--fetcher_cache_dir="/tmp/Endpoint_SlaveEndpointTest_NoAuthorizer_2_HYzSjj/fetch" --fetcher_cache_size="2GB"
--frameworks_home="" --gc_delay="1weeks" --gc_disk_headroom="0.1" --hadoop_home="" --help="false"
--hostname_lookup="true" --http_authenticators="basic" --http_command_executor="false" --http_credentials="/tmp/Endpoint_SlaveEndpointTest_NoAuthorizer_2_HYzSjj/http_credentials"
--image_provisioner_backend="copy" --initialize_driver_logging="true" --isolation="posix/cpu,posix/mem"
--launcher="posix" --launcher_dir="/mesos/mesos-1.2.0/_build/src" --logbufsecs="0" --logging_level="INFO"
--max_completed_executors_per_framework="150" --oversubscribed_resources_interval="15secs"
--perf_duration="10secs" --perf_interval="1mins" --qos_correction_interval_min="0ns" --quiet="false"
--recover="reconnect" --recovery_timeout="15mins" --registration_backoff_factor="10ms" --resources="cpus:2;gpus:0;mem:1024;disk:1024;ports:[31000-32000]"
--revocable_cpu_low_priority="true" --runtime_dir="/tmp/Endpoint_SlaveEndpointTest_NoAuthorizer_2_HYzSjj"
--sandbox_directory="/mnt/mesos/sandbox" --strict="true" --switch_user="true" --systemd_enable_support="true"
--systemd_runtime_directory="/run/systemd/system" --version="false" --work_dir="/tmp/Endpoint_SlaveEndpointTest_NoAuthorizer_2_8ZVMVo"
I1212 18:14:50.472133 29735 credentials.hpp:86] Loading credential for authentication from
'/tmp/Endpoint_SlaveEndpointTest_NoAuthorizer_2_HYzSjj/credential'
I1212 18:14:50.472337 29735 slave.cpp:347] Agent using credential for: test-principal
I1212 18:14:50.472363 29735 credentials.hpp:37] Loading credentials for authentication from
'/tmp/Endpoint_SlaveEndpointTest_NoAuthorizer_2_HYzSjj/http_credentials'
I1212 18:14:50.472658 29735 http.cpp:922] Using default 'basic' HTTP authenticator for realm
'mesos-agent-readonly'
I1212 18:14:50.472823 29735 http.cpp:922] Using default 'basic' HTTP authenticator for realm
'mesos-agent-readwrite'
I1212 18:14:50.474277 29735 slave.cpp:534] Agent resources: cpus(*):2; mem(*):1024; disk(*):1024;
ports(*):[31000-32000]
I1212 18:14:50.474380 29735 slave.cpp:542] Agent attributes: [  ]
I1212 18:14:50.474397 29735 slave.cpp:547] Agent hostname: 1f6637ce0837
I1212 18:14:50.476200 29726 state.cpp:57] Recovering state from '/tmp/Endpoint_SlaveEndpointTest_NoAuthorizer_2_8ZVMVo/meta'
I1212 18:14:50.476693 29739 status_update_manager.cpp:203] Recovering status update manager
I1212 18:14:50.476949 29733 containerizer.cpp:594] Recovering containerizer
I1212 18:14:50.478657 29729 provisioner.cpp:253] Provisioner recovery complete
I1212 18:14:50.479084 29739 slave.cpp:5415] Finished recovery
I1212 18:14:50.479760 29739 slave.cpp:5589] Querying resource estimator for oversubscribable
resources
I1212 18:14:50.480111 29735 slave.cpp:5603] Received oversubscribable resources {} from the
resource estimator
I1212 18:14:50.482826 29737 process.cpp:3679] Handling HTTP event for process 'slave(677)'
with path: '/slave(677)/containers'
I1212 18:14:50.484361 29736 http.cpp:874] Authorizing principal 'test-principal' to GET the
'/containers' endpoint
I1212 18:14:50.487728 29736 slave.cpp:791] Agent terminating
[       OK ] Endpoint/SlaveEndpointTest.NoAuthorizer/2 (34 ms)
[----------] 9 tests from Endpoint/SlaveEndpointTest (310 ms total)

[----------] Global test environment tear-down
[==========] 1431 tests from 165 test cases ran. (683134 ms total)
[  PASSED  ] 1429 tests.
[  FAILED  ] 2 tests, listed below:
[  FAILED  ] IOSwitchboardTest.KillSwitchboardContainerDestroyed
[  FAILED  ] ContentType/AgentAPITest.LaunchNestedContainerSessionDisconnected/1, where GetParam()
= application/json

 2 FAILED TESTS
  YOU HAVE 9 DISABLED TESTS

make[4]: *** [check-local] Error 1
make[4]: Leaving directory `/mesos/mesos-1.2.0/_build/src'
make[3]: *** [check-am] Error 2
make[3]: Leaving directory `/mesos/mesos-1.2.0/_build/src'
make[2]: *** [check] Error 2
make[2]: Leaving directory `/mesos/mesos-1.2.0/_build/src'
make[1]: *** [check-recursive] Error 1
make[1]: Leaving directory `/mesos/mesos-1.2.0/_build'
make: *** [distcheck] Error 1
+ docker rmi mesos-1481562754-11336
Untagged: mesos-1481562754-11336:latest
Deleted: sha256:aa53dbd71522ac946dd2c223a9754dbd2b61ca40426e727bd99012ad88177e3a
Deleted: sha256:fe700dab1af78b60ad986648ac6814b73e2d6c2d161ab1a64b07e77bd58d14d5
Deleted: sha256:a225b9ae69cae76a16637f5953ebda4fd8685983ee6d22ae31e44d2494217598
Deleted: sha256:1e78ef1a8b45b5089bc8e4ce834d9b55e4c3e665b1d1e85f74e33613e4b22600
Deleted: sha256:b4ac0cbe1545573de0f561645cc71a440ea2ca342cea37eb93c056e8b42482a4
Deleted: sha256:ce933986a49ed375d5244f5b97897774dcae1850ed11a475710beef91bc451a2
Deleted: sha256:147c2444c99dc6bb3164ba748ba1252a8f98c0006d2b49b265c627ada382a87a
Deleted: sha256:fcfaf2dfa223ee3b2f93655eb68d083b0955548472ee0d338105910fb505d89b
Deleted: sha256:99148b7aff43603b68a0f75938c21e06c7fdb022270285cac97865f953032b70
Deleted: sha256:29e77efd4cd4bf3c658f387745bdf6a15dd3a8d71e2cd0797b57ec8c8653863a
Deleted: sha256:6c41dfe35b37880714c4e4975f28b97a1ab58f1e494425dc28697de215488b87
Deleted: sha256:6fd5b9c395387a20bf63856b454353f979ec4032b1aa7580fa4aab3e36ce8e8b
Deleted: sha256:4e1f37e35f4dbe52a037f9d3adfddecdf982dc016ab2ca990cca8c08ab5b79a1
Deleted: sha256:4b4f7d55e56c1f40e15fbe23329fa1cd151ee8475e46bfd557ab0b77edb4dcf7
Deleted: sha256:105db5582af387284f09a391042360f2ee2213d7e2286189108ad366d0eeed90
Deleted: sha256:111f83d89c5a563a6243c6b6e109580dd00d934e0e41e45f76532181741e4539
Deleted: sha256:495893f4a3ec20cef1e0acbef8b94a690d3b007b32175f3fc468809e87386de5
Deleted: sha256:b69d65a41cdbf155cbf752e1be74a3eb85ea7d6dd35ef4172245c1367295b04a
Deleted: sha256:5f6c316de3e815e247906b2bfa2301bd86b965748a3318c2371881203c1c4d6c
Deleted: sha256:529eb00be2e95b3e3d62ecc3230a78897b8253a11b0958eebef045e68fcb0e7d
Deleted: sha256:7194f024c2e4f465bdf4d0be3f4de0bff0bb544f70fc8756fdf77970622f6d9e
Deleted: sha256:e6d0ea6dfeee11a524c9e0356525e411e4ad5511059068115f62a389d59d5d42
Deleted: sha256:6ee46909b268cced3ea1044904f0de9f27c08c6b05a847636b6be5832ec82023
Deleted: sha256:89abcc840b265bc8f92e66c3e982e02239abef2988d8f18c8c8c4158fda4a1d3
Build step 'Execute shell' marked build as failure

Mime
View raw message