mesos-builds mailing list archives

Site index · List index
Message view « Date » · « Thread »
Top « Date » · « Thread »
From Apache Jenkins Server <jenk...@builds.apache.org>
Subject Build failed in Jenkins: Mesos-Windows #893
Date Thu, 01 Dec 2016 09:15:30 GMT
See <https://builds.apache.org/job/Mesos-Windows/893/changes>

Changes:

[benjamin.hindman] Added `process::loop` abstraction.

[benjamin.hindman] Added an http::serve abstraction.

------------------------------------------
[...truncated 7370 lines...]
W1201 01:15:33.416628  4032 fcntl.hpp:82] `os::isNonblock` has been called, but is a stub
on Windows
W1201 01:15:33.418625  5640 fcntl.hpp:82] `os::isNonblock` has been called, but is a stub
on Windows
W1201 01:15:33.423622  4440 fcntl.hpp:30] `os::cloexec` has been called, but is a no-op on
Windows
W1201 01:15:33.424626  4032 fcntl.hpp:30] `os::cloexec` has been called, but is a no-op on
Windows
W1201 01:15:33.425627  4032 fcntl.hpp:82] `os::isNonblock` has been called, but is a stub
on Windows
W1201 01:15:33.426616  3660 fcntl.hpp:82] `os::isNonblock` has been called, but is a stub
on Windows
W1201 01:15:33.428633  4440 fcntl.hpp:30] `os::cloexec` has been called, but is a no-op on
Windows
W1201 01:15:33.428633  4032 fcntl.hpp:30] `os::cloexec` has been called, but is a no-op on
Windows
W1201 01:15:33.429630  4032 fcntl.hpp:82] `os::isNonblock` has been called, but is a stub
on Windows
W1201 01:15:33.430619  5524 fcntl.hpp:82] `os::isNonblock` has been called, but is a stub
on Windows
W1201 01:15:33.432628  4440 fcntl.hpp:30] `os::cloexec` has been called, but is a no-op on
Windows
W1201 01:15:33.432628  4032 fcntl.hpp:30] `os::cloexec` has been called, but is a no-op on
Windows
W1201 01:15:33.436167  4032 fcntl.hpp:82] `os::isNonblock` has been called, but is a[    
  OK ] HTTPConnectionTest.RequestStreaming (24 ms)
[----------] 8 tests from HTTPConnectionTest (209 ms total)

[----------] 2 tests from URLTest
[ RUN      ] URLTest.Stringification
[       OK ] URLTest.Stringification (1 ms)
[ RUN      ] URLTest.ParseUrls
[       OK ] URLTest.ParseUrls (1 ms)
[----------] 2 tests from URLTest (2 ms total)

[----------] 6 tests from HttpAuthenticationTest
[ RUN      ] HttpAuthenticationTest.NoAuthenticator
[       OK ] HttpAuthenticationTest.NoAuthenticator (25 ms)
[ RUN      ] HttpAuthenticationTest.Unauthorized
[       OK ] HttpAuthenticationTest.Unauthorized (24 ms)
[ RUN      ] HttpAuthenticationTest.Forbidden
[       OK ] HttpAuthenticationTest.Forbidden (20 ms)
[ RUN      ] HttpAuthenticationTest.Authenticated
[       OK ] HttpAuthenticationTest.Authenticated (21 ms)
[ RUN      ] HttpAuthenticationTest.Pipelining
[       OK ] HttpAuthenticationTest.Pipelining (28 ms)
[ RUN      ] HttpAuthenticationTest.Basic
 stub on Windows
W1201 01:15:33.437625  5372 fcntl.hpp:82] `os::isNonblock` has been called, but is a stub
on Windows
W1201 01:15:33.441619  4032 fcntl.hpp:82] `os::isNonblock` has been called, but is a stub
on Windows
W1201 01:15:33.445626  4032 fcntl.hpp:82] `os::isNonblock` has been called, but is a stub
on Windows
W1201 01:15:33.448635  4032 fcntl.hpp:82] `os::isNonblock` has been called, but is a stub
on Windows
W1201 01:15:33.453618  3916 fcntl.hpp:82] `os::isNonblock` has been called, but is a stub
on Windows
W1201 01:15:33.462627  4440 fcntl.hpp:30] `os::cloexec` has been called, but is a no-op on
Windows
W1201 01:15:33.464627  4032 fcntl.hpp:30] `os::cloexec` has been called, but is a no-op on
Windows
W1201 01:15:33.465632  4032 fcntl.hpp:82] `os::isNonblock` has been called, but is a stub
on Windows
W1201 01:15:33.467628  3660 fcntl.hpp:82] `os::isNonblock` has been called, but is a stub
on Windows
W1201 01:15:33.470708  4032 fcntl.hpp:82] `os::isNonblock` has been called, but is a stub
on Windows
W1201 01:15:33.488631  4440 fcntl.hpp:30] `os::cloexec` has been called, but is a no-op on
Windows
W1201 01:15:33.491631  4032 fcntl.hpp:30] `os::cloexec` has been called, but is a no-op on
Windows
W1201 01:15:33.492635  4032 fcntl.hpp:82] `os::isNonblock` has been called, but is a stub
on Windows
W1201 01:15:33.494622  3916 fcntl.hpp:82] `os::isNonblock` has been called, but is a stub
on Windows
W1201 01:15:33.497628  4032 fcntl.hpp:82] `os::isNonblock` has been called, but is a stub
on Windows
W1201 01:15:33.513628  4440 fcntl.hpp:30] `os::cloexec` has been called, but is a no-op on
Windows
W1201 01:15:33.513628  4032 fcntl.hpp:30] `os::cloexec` has been called, but is a no-op on
Windows
W1201 01:15:33.514629  4032 fcntl.hpp:82] `os::isNonblock` has been called, but is a stub
on Windows
W1201 01:15:33.516628  3916 fcntl.hpp:82] `os::isNonblock` has been called, but is a stub
on Windows
W1201 01:15:33.518617  4032 fcntl.hpp:82] `os::isNonblock` has been called, but is a stub
on Windows
W1201 01:15:33.533619  4440 fcntl.hpp:30] `os::cloexec` has been called, but is a no-op on
Windows
W1201 01:15:33.533619  4032 fcntl.hpp:30] `os::cloexec` has been called, but is a no-op on
Windows
W1201 01:15:33.534617  4032 fcntl.hpp:82] `os::isNonblock` has been called, but is a stub
on Windows
W1201 01:15:33.536625  5908 fcntl.hpp:82] `os::isNonblock` has been called, but is a stub
on Windows
W1201 01:15:33.539628  4032 fcntl.hpp:82] `os::isNonblock` has been called, but is a stub
on Windows
W1201 01:15:33.555624  4440 fcntl.hpp:30] `os::cloexec` has been called, but is a no-op on
Windows
W1201 01:15:33.555624  4032 fcntl.hpp:30] `os::cloexec` has been called, but is a no-op on
Windows
W1201 01:15:33.556613  4032 fcntl.hpp:82] `os::isNonblock` has been called, but is a stub
on Windows
W1201 01:15:33.558612  3916 fcntl.hpp:82] `os::isNonblock` has been called, but is a stub
on Windows
W1201 01:15:33.562611  4032 fcntl.hpp:82] `os::isNonblock` has been called, but is a stub
on Windows
W1201 01:15:33.564617  4032 fcntl.hpp:82] `os::isNonblock` has been called, but is a stub
on Windows
W1201 01:15:33.572618  3916 fcntl.hpp:82] `os::isNonblock` has been called, but is a stub
on Windows
W1201 01:15:33.576616  3916 fcntl.hpp:82] `os::isNonblock` has been called, but is a stub
on Windows
W1201 01:15:33.581619  4440 fcntl.hpp:30] `os::cloexec` has been called, but is a no-op on
Windows
W1201 01:15:33.582620  4032 fcntl.hpp:30] `os::cloexec` has been called, but is a no-op on
Windows
W1201 01:15:33.582620  4032 fcntl.hpp:82] `os::isNonblock` has been called, but is a stub
on Windows
W1201 01:15:33.584616  5640 fcntl.hpp:82] `os::isNonblock` has been called, but is a stub
on Windows
W1201 01:15:33.587625  4032 fcntl.hpp:82] `os::isNonblock` has been called, but is a stub
on Windows
W1201 01:15:33.597618  4440 fcntl.hpp:30] `os::cloexec` has been called, but is a no-op on
Windows
W1201 01:15:33.598615  4032 fcntl.hpp:30] `os::cloexec` has been called, but is a no-op on
Windows
W1201 01:15:33.598615  4032 fcntl.hpp:82] `os::isNonblock` has been[       OK ] HttpAuthenticationTest.Basic
(70 ms)
[----------] 6 tests from HttpAuthenticationTest (189 ms total)

[----------] 2 tests from HttpServeTest
[ RUN      ] HttpServeTest.Pipelining
F:\jenkins\jenkins-slave\workspace\Mesos-Windows\3rdparty\libprocess\src\tests\http_tests.cpp(1788):
error: (connect).failure(): Failed to connect to 0.0.0.0:64767: The requested address is not
valid in its context.


[  FAILED  ] HttpServeTest.Pipelining (5 ms)
[ RUN      ] HttpServeTest.Discard
F:\jenkins\jenkins-slave\workspace\Mesos-Windows\3rdparty\libprocess\src\tests\http_tests.cpp(1883):
error: (connect).failure(): Failed to connect to 0.0.0.0:64769: The requested address is not
valid in its context.


[  FAILED  ] HttpServeTest.Discard (3 ms)
[----------] 2 tests from HttpServeTest (8 ms total)

[----------] 5 tests from MetricsTest
[ RUN      ] MetricsTest.Counter
[       OK ] MetricsTest.Counter (5 ms)
[ RUN      ] MetricsTest.Statistics
[       OK ] MetricsTest.Statistics (15 ms)
[ RUN      ] MetricsTest.SnapshotStatistics
[       OK ] MetricsTest.SnapshotStatistics (39 ms)
[ RUN      ] MetricsTest.Timer
[       OK ] MetricsTest.Timer (2 ms)
[ RUN      ] MetricsTest.AsyncTimer
[       OK ] MetricsTest.AsyncTimer (2 ms)
[----------] 5 tests from MetricsTest (64 ms total)

[----------] 3 tests from MutexTest
[ RUN      ] MutexTest.Lock
[       OK ] MutexTest.Lock (1 ms)
[ RUN      ] MutexTest.Block
[       OK ] MutexTest.Block (0 ms)
[ RUN      ] MutexTest.Queue
[       OK ] MutexTest.Queue (0 ms)
[----------] 3 tests from MutexTest (1 ms total)

[----------] 4 tests from OwnedTest
[ RUN      ] OwnedTest.Access
[       OK ] OwnedTest.Access (0 ms)
[ RUN      ] OwnedTest.Null
[       OK ] OwnedTest.Null (0 ms)
[ RUN      ] OwnedTest.Share
[       OK ] OwnedTest.Share (0 ms)
[ RUN      ] OwnedTest.Release
[       OK ] OwnedTest.Release (0 ms)
[----------] 4 tests from OwnedTest (1 ms total)

[----------] 4 tests from ProcessTest
[ RUN      ] ProcessTest.Event
[       OK ] ProcessTest.Event (0 ms)
[ RUN      ] ProcessTest.Exited
[       OK ] ProcessTest.Exited (3 ms)
[ RUN      ] ProcessTest.InjectExited
[       OK ] ProcessTest.InjectExited (2 ms)
[ RUN      ] ProcessTest.PercentEncodedURLs
[       OK ] ProcessTest.PercentEncodedURLs (29 ms)
[----------] 4 tests from ProcessTest (35 ms total)

[----------] 3 tests from QueueTest
[ RUN      ] QueueTest.Block
[       OK ] QueueTest.Block (0 ms)
[ RUN      ] QueueTest.Noblock
[       OK ] QueueTest.Noblock (0 ms)
[ RUN      ] QueueTest.Queue
[       OK ] QueueTest.Queue (1 ms)
[----------] 3 tests from QueueTest (1 ms total)

[----------] 4 tests from SequenceTest
[ RUN      ] SequenceTest.Serialize
[       OK ] SequenceTest.Serialize (5 ms)
[ RUN      ] SequenceTest.DiscardOne
[       OK ] SequenceTest.DiscardOne (3 ms)
[ RUN      ] SequenceTest.DiscardAll
[       OK ] SequenceTest.DiscardAll (5 ms)
[ RUN      ] SequenceTest.Random
[       OK ] SequenceTest.Random (34 ms)
[----------] 4 tests from SequenceTest (48 ms total)

[----------] 4 tests from SharedTest
[ RUN      ] SharedTest.ConstAccess
[       OK ] SharedTest.ConstAccess (0 ms)
[ RUN      ] SharedTest.Null
[       OK ] SharedTest.Null (0 ms)
[ RUN      ] SharedTest.Reset
[       OK ] SharedTest.Reset (0 ms)
[ RUN      ] SharedTest.Own
[       OK ] SharedTest.Own (2 ms)
[----------] 4 tests from SharedTest (3 ms total)

[----------] 3 tests from StatisticsTest
[ RUN      ] StatisticsTest.Empty
[       OK ] StatisticsTest.Empty (0 ms)
[ RUN      ] StatisticsTest.Single
[       OK ] StatisticsTest.Single (0 ms)
[ RUN      ] StatisticsTest.Statistics
[       OK ] StatisticsTest.Statistics (1 ms)
[----------] 3 tests from StatisticsTest (1 ms total)

[----------] 3 tests from SubprocessTest
[ RUN      ] SubprocessTest.PipeOutputToFileDescriptor
[       OK ] SubprocessTest.PipeOutputToFileDescriptor (19 ms)
[ RUN      ] SubprocessTest.PipeOutputToPath
[       OK ] SubprocessTest.PipeOutputToPath (16 ms)
[ RUN      ] SubprocessTest.EnvironmentEcho
[       OK ] SubprocessTest.EnvironmentEcho (12 ms)
[----------] 3 tests from SubprocessTest (47 ms total)

[----------] 4 tests from TimeTest
[ RUN      ] TimeTest.Arithmetic
[       OK ] TimeTest.Arithmetic (0 ms)
[ RUN      ] TimeTest.RFC1123Output
[       OK ] TimeTest.RFC1123Output (0 ms)
[ RUN      ] TimeTest.RFC3339Output
[       OK ] TimeTest.RFC3339Output (0 ms)
[ RUN      ] TimeTest.Output
[       OK ] TimeTest.Output (0 ms)
[----------] 4 tests from TimeTest (1 ms total)

[----------] 3 tests from TimeSeriesTest
[ RUN      ] TimeSeriesTest.Set
[       OK ] TimeSeriesTest.Set (1 ms)
[ RUN      ] TimeSeriesTest.Sparsify
[       OK ] TimeSeriesTest.Sparsify (1 ms)
[ RUN      ] TimeSeriesTest.Truncate
[       OK ] TimeSeriesTest.Truncate (3 ms)
[----------] 3 tests from TimeSeriesTest (5 ms total)

[----------] Global test environment tear-down
[==========] 105 tests from 23 test cases ran. (909 ms total)
[  PASSED  ] 103 tests.
[  FAILED  ] 2 tests, listed below:
[  FAILED  ] HttpServeTest.Pipelining
[  FAILED  ] HttpServeTest.Discard

 2 FAILED TESTS
  YOU HAVE 44 DISABLED TESTS

 called, but is a stub on Windows
W1201 01:15:33.600623  3480 fcntl.hpp:82] `os::isNonblock` has been called, but is a stub
on Windows
W1201 01:15:33.602627  4032 fcntl.hpp:82] `os::isNonblock` has been called, but is a stub
on Windows
W1201 01:15:33.614626  4440 fcntl.hpp:30] `os::cloexec` has been called, but is a no-op on
Windows
W1201 01:15:33.614626  4032 fcntl.hpp:30] `os::cloexec` has been called, but is a no-op on
Windows
W1201 01:15:33.615633  4032 fcntl.hpp:82] `os::isNonblock` has been called, but is a stub
on Windows
W1201 01:15:33.616644  5640 fcntl.hpp:82] `os::isNonblock` has been called, but is a stub
on Windows
W1201 01:15:33.619631  4032 fcntl.hpp:82] `os::isNonblock` has been called, but is a stub
on Windows
W1201 01:15:33.631623  4440 fcntl.hpp:30] `os::cloexec` has been called, but is a no-op on
Windows
W1201 01:15:33.632632  4032 fcntl.hpp:30] `os::cloexec` has been called, but is a no-op on
Windows
W1201 01:15:33.632632  4032 fcntl.hpp:82] `os::isNonblock` has been called, but is a stub
on Windows
W1201 01:15:33.634613  4320 fcntl.hpp:82] `os::isNonblock` has been called, but is a stub
on Windows
W1201 01:15:33.636620  4032 fcntl.hpp:82] `os::isNonblock` has been called, but is a stub
on Windows
W1201 01:15:33.652623  4440 fcntl.hpp:30] `os::cloexec` has been called, but is a no-op on
Windows
W1201 01:15:33.653630  4440 fcntl.hpp:30] `os::cloexec` has been called, but is a no-op on
Windows
W1201 01:15:33.656621  4440 fcntl.hpp:30] `os::cloexec` has been called, but is a no-op on
Windows
W1201 01:15:33.656621  4440 fcntl.hpp:30] `os::cloexec` has been called, but is a no-op on
Windows
W1201 01:15:33.681628  4440 fcntl.hpp:30] `os::cloexec` has been called, but is a no-op on
Windows
W1201 01:15:33.683629  4032 fcntl.hpp:30] `os::cloexec` has been called, but is a no-op on
Windows
W1201 01:15:33.684628  4032 fcntl.hpp:82] `os::isNonblock` has been called, but is a stub
on Windows
W1201 01:15:33.685631  5524 fcntl.hpp:82] `os::isNonblock` has been called, but is a stub
on Windows
W1201 01:15:33.689630  4032 fcntl.hpp:82] `os::isNonblock` has been called, but is a stub
on Windows
W1201 01:15:33.732620  4440 fcntl.hpp:30] `os::cloexec` has been called, but is a no-op on
Windows
W1201 01:15:33.733619  4032 fcntl.hpp:30] `os::cloexec` has been called, but is a no-op on
Windows
W1201 01:15:33.733619  4032 fcntl.hpp:82] `os::isNonblock` has been called, but is a stub
on Windows
W1201 01:15:33.735623  3916 fcntl.hpp:82] `os::isNonblock` has been called, but is a stub
on Windows
W1201 01:15:33.739627  4032 fcntl.hpp:82] `os::isNonblock` has been called, but is a stub
on Windows
W1201 01:15:33.744623  4440 fcntl.hpp:30] `os::cloexec` has been called, but is a no-op on
Windows
W1201 01:15:33.744623  4032 fcntl.hpp:30] `os::cloexec` has been called, but is a no-op on
Windows
W1201 01:15:33.745620  4032 fcntl.hpp:82] `os::isNonblock` has been called, but is a stub
on Windows
W1201 01:15:33.746621  4320 fcntl.hpp:82] `os::isNonblock` has been called, but is a stub
on Windows
W1201 01:15:33.750625  4032 fcntl.hpp:82] `os::isNonblock` has been called, but is a stub
on Windows

<https://builds.apache.org/job/Mesos-Windows/ws/build>if> 1 NEQ 0 exit /b 1 
Build step 'Execute Windows batch command' marked build as failure

Mime
View raw message