mesos-builds mailing list archives

Site index · List index
Message view « Date » · « Thread »
Top « Date » · « Thread »
From Apache Jenkins Server <jenk...@builds.apache.org>
Subject Build failed in Jenkins: Mesos » cmake,gcc,--verbose,GLOG_v=1 MESOS_VERBOSE=1,centos:7,(docker||Hadoop)&&(!ubuntu-us1)&&(!ubuntu-6)&&(!ubuntu-eu2) #3040
Date Fri, 16 Dec 2016 01:45:14 GMT
See <https://builds.apache.org/job/Mesos/BUILDTOOL=cmake,COMPILER=gcc,CONFIGURATION=--verbose,ENVIRONMENT=GLOG_v=1%20MESOS_VERBOSE=1,OS=centos%3A7,label_exp=(docker%7C%7CHadoop)&&(!ubuntu-us1)&&(!ubuntu-6)&&(!ubuntu-eu2)/3040/changes>

Changes:

[mpark] Specified that we search for the query parameter in the request body.

[josephwu] Fixed builds with HAS_AUTHENTICATION=false.

[josephwu] Windows: Added `recordio_tests.cpp` to test build.

[josephwu] Windows: Added Mesos tests to the build helper.

[josephwu] Windows: Disambiguated `os::write` by adding another overload.

------------------------------------------
[...truncated 159607 lines...]
[ RUN      ] Endpoint/SlaveEndpointTest.AuthorizedRequest/1
I1216 01:45:12.264117 25333 containerizer.cpp:220] Using isolation: posix/cpu,posix/mem,filesystem/posix,network/cni
W1216 01:45:12.264464 25333 backend.cpp:76] Failed to create 'aufs' backend: AufsBackend requires
root privileges, but is running as user mesos
W1216 01:45:12.264564 25333 backend.cpp:76] Failed to create 'bind' backend: BindBackend requires
root privileges
I1216 01:45:12.265727 25340 slave.cpp:209] Mesos agent started on (664)@172.17.0.3:35329
I1216 01:45:12.265749 25340 slave.cpp:210] Flags at startup: --acls="" --appc_simple_discovery_uri_prefix="http://"
--appc_store_dir="/tmp/mesos/store/appc" --authenticate_http_readonly="true" --authenticate_http_readwrite="true"
--authenticatee="crammd5" --authentication_backoff_factor="1secs" --authorizer="local" --cgroups_cpu_enable_pids_and_tids_count="false"
--cgroups_enable_cfs="false" --cgroups_hierarchy="/sys/fs/cgroup" --cgroups_limit_swap="false"
--cgroups_root="mesos" --container_disk_watch_interval="15secs" --containerizers="mesos" --credential="/tmp/Endpoint_SlaveEndpointTest_AuthorizedRequest_1_HkvoP8/credential"
--default_role="*" --disk_watch_interval="1mins" --docker="docker" --docker_kill_orphans="true"
--docker_registry="https://registry-1.docker.io" --docker_remove_delay="6hrs" --docker_socket="/var/run/docker.sock"
--docker_stop_timeout="0ns" --docker_store_dir="/tmp/mesos/store/docker" --docker_volume_checkpoint_dir="/var/run/mesos/isolators/docker/volume"
--enforce_container_disk_quota="false" --executor_registration_timeout="1mins" --executor_shutdown_grace_period="5secs"
--fetcher_cache_dir="/tmp/Endpoint_SlaveEndpointTest_AuthorizedRequest_1_HkvoP8/fetch" --fetcher_cache_size="2GB"
--frameworks_home="" --gc_delay="1weeks" --gc_disk_headroom="0.1" --hadoop_home="" --help="false"
--hostname_lookup="true" --http_authenticators="basic" --http_command_executor="false" --http_credentials="/tmp/Endpoint_SlaveEndpointTest_AuthorizedRequest_1_HkvoP8/http_credentials"
--http_heartbeat_interval="30secs" --image_provisioner_backend="copy" --initialize_driver_logging="true"
--isolation="posix/cpu,posix/mem" --launcher="posix" --launcher_dir="/mesos/build/src" --logbufsecs="0"
--logging_level="INFO" --max_completed_executors_per_framework="150" --oversubscribed_resources_interval="15secs"
--perf_duration="10secs" --perf_interval="1mins" --qos_correction_interval_min="0ns" --quiet="false"
--recover="reconnect" --recovery_timeout="15mins" --registration_backoff_factor="10ms" --resources="cpus:2;gpus:0;mem:1024;disk:1024;ports:[31000-32000]"
--revocable_cpu_low_priority="true" --runtime_dir="/tmp/Endpoint_SlaveEndpointTest_AuthorizedRequest_1_HkvoP8"
--sandbox_directory="/mnt/mesos/sandbox" --strict="true" --switch_user="true" --systemd_enable_support="true"
--systemd_runtime_directory="/run/systemd/system" --version="false" --work_dir="/tmp/Endpoint_SlaveEndpointTest_AuthorizedRequest_1_zaMWxq"
I1216 01:45:12.266166 25340 credentials.hpp:86] Loading credential for authentication from
'/tmp/Endpoint_SlaveEndpointTest_AuthorizedRequest_1_HkvoP8/credential'
I1216 01:45:12.266285 25340 slave.cpp:352] Agent using credential for: test-principal
I1216 01:45:12.266305 25340 credentials.hpp:37] Loading credentials for authentication from
'/tmp/Endpoint_SlaveEndpointTest_AuthorizedRequest_1_HkvoP8/http_credentials'
I1216 01:45:12.266436 25340 http.cpp:922] Using default 'basic' HTTP authenticator for realm
'mesos-agent-readonly'
I1216 01:45:12.266489 25340 http.cpp:922] Using default 'basic' HTTP authenticator for realm
'mesos-agent-readwrite'
I1216 01:45:12.267004 25340 slave.cpp:539] Agent resources: cpus(*):2; mem(*):1024; disk(*):1024;
ports(*):[31000-32000]
I1216 01:45:12.267047 25340 slave.cpp:547] Agent attributes: [  ]
I1216 01:45:12.267055 25340 slave.cpp:552] Agent hostname: a7db2853d93c
I1216 01:45:12.267457 25343 state.cpp:57] Recovering state from '/tmp/Endpoint_SlaveEndpointTest_AuthorizedRequest_1_zaMWxq/meta'
I1216 01:45:12.267614 25342 status_update_manager.cpp:203] Recovering status update manager
I1216 01:45:12.267844 25347 containerizer.cpp:594] Recovering containerizer
I1216 01:45:12.268532 25349 provisioner.cpp:253] Provisioner recovery complete
I1216 01:45:12.268687 25338 slave.cpp:5408] Finished recovery
I1216 01:45:12.269109 25338 slave.cpp:5582] Querying resource estimator for oversubscribable
resources
I1216 01:45:12.269291 25343 slave.cpp:5596] Received oversubscribable resources {} from the
resource estimator
I1216 01:45:12.269842 25342 process.cpp:3679] Handling HTTP event for process 'slave(664)'
with path: '/slave(664)/monitor/statistics.json'
I1216 01:45:12.270238 25336 http.cpp:874] Authorizing principal 'test-principal' to GET the
'/monitor/statistics.json' endpoint
I1216 01:45:12.271664 25342 slave.cpp:796] Agent terminating
[       OK ] Endpoint/SlaveEndpointTest.AuthorizedRequest/1 (12 ms)
[ RUN      ] Endpoint/SlaveEndpointTest.AuthorizedRequest/2
I1216 01:45:12.276391 25333 containerizer.cpp:220] Using isolation: posix/cpu,posix/mem,filesystem/posix,network/cni
W1216 01:45:12.276748 25333 backend.cpp:76] Failed to create 'aufs' backend: AufsBackend requires
root privileges, but is running as user mesos
W1216 01:45:12.276856 25333 backend.cpp:76] Failed to create 'bind' backend: BindBackend requires
root privileges
I1216 01:45:12.278023 25344 slave.cpp:209] Mesos agent started on (665)@172.17.0.3:35329
I1216 01:45:12.278043 25344 slave.cpp:210] Flags at startup: --acls="" --appc_simple_discovery_uri_prefix="http://"
--appc_store_dir="/tmp/mesos/store/appc" --authenticate_http_readonly="true" --authenticate_http_readwrite="true"
--authenticatee="crammd5" --authentication_backoff_factor="1secs" --authorizer="local" --cgroups_cpu_enable_pids_and_tids_count="false"
--cgroups_enable_cfs="false" --cgroups_hierarchy="/sys/fs/cgroup" --cgroups_limit_swap="false"
--cgroups_root="mesos" --container_disk_watch_interval="15secs" --containerizers="mesos" --credential="/tmp/Endpoint_SlaveEndpointTest_AuthorizedRequest_2_YIwW3Z/credential"
--default_role="*" --disk_watch_interval="1mins" --docker="docker" --docker_kill_orphans="true"
--docker_registry="https://registry-1.docker.io" --docker_remove_delay="6hrs" --docker_socket="/var/run/docker.sock"
--docker_stop_timeout="0ns" --docker_store_dir="/tmp/mesos/store/docker" --docker_volume_checkpoint_dir="/var/run/mesos/isolators/docker/volume"
--enforce_container_disk_quota="false" --executor_registration_timeout="1mins" --executor_shutdown_grace_period="5secs"
--fetcher_cache_dir="/tmp/Endpoint_SlaveEndpointTest_AuthorizedRequest_2_YIwW3Z/fetch" --fetcher_cache_size="2GB"
--frameworks_home="" --gc_delay="1weeks" --gc_disk_headroom="0.1" --hadoop_home="" --help="false"
--hostname_lookup="true" --http_authenticators="basic" --http_command_executor="false" --http_credentials="/tmp/Endpoint_SlaveEndpointTest_AuthorizedRequest_2_YIwW3Z/http_credentials"
--http_heartbeat_interval="30secs" --image_provisioner_backend="copy" --initialize_driver_logging="true"
--isolation="posix/cpu,posix/mem" --launcher="posix" --launcher_dir="/mesos/build/src" --logbufsecs="0"
--logging_level="INFO" --max_completed_executors_per_framework="150" --oversubscribed_resources_interval="15secs"
--perf_duration="10secs" --perf_interval="1mins" --qos_correction_interval_min="0ns" --quiet="false"
--recover="reconnect" --recovery_timeout="15mins" --registration_backoff_factor="10ms" --resources="cpus:2;gpus:0;mem:1024;disk:1024;ports:[31000-32000]"
--revocable_cpu_low_priority="true" --runtime_dir="/tmp/Endpoint_SlaveEndpointTest_AuthorizedRequest_2_YIwW3Z"
--sandbox_directory="/mnt/mesos/sandbox" --strict="true" --switch_user="true" --systemd_enable_support="true"
--systemd_runtime_directory="/run/systemd/system" --version="false" --work_dir="/tmp/Endpoint_SlaveEndpointTest_AuthorizedRequest_2_1uPvKh"
I1216 01:45:12.278384 25344 credentials.hpp:86] Loading credential for authentication from
'/tmp/Endpoint_SlaveEndpointTest_AuthorizedRequest_2_YIwW3Z/credential'
I1216 01:45:12.278479 25344 slave.cpp:352] Agent using credential for: test-principal
I1216 01:45:12.278494 25344 credentials.hpp:37] Loading credentials for authentication from
'/tmp/Endpoint_SlaveEndpointTest_AuthorizedRequest_2_YIwW3Z/http_credentials'
I1216 01:45:12.278617 25344 http.cpp:922] Using default 'basic' HTTP authenticator for realm
'mesos-agent-readonly'
I1216 01:45:12.278666 25344 http.cpp:922] Using default 'basic' HTTP authenticator for realm
'mesos-agent-readwrite'
I1216 01:45:12.279016 25344 slave.cpp:539] Agent resources: cpus(*):2; mem(*):1024; disk(*):1024;
ports(*):[31000-32000]
I1216 01:45:12.279055 25344 slave.cpp:547] Agent attributes: [  ]
I1216 01:45:12.279067 25344 slave.cpp:552] Agent hostname: a7db2853d93c
I1216 01:45:12.279393 25339 state.cpp:57] Recovering state from '/tmp/Endpoint_SlaveEndpointTest_AuthorizedRequest_2_1uPvKh/meta'
I1216 01:45:12.279559 25343 status_update_manager.cpp:203] Recovering status update manager
I1216 01:45:12.279726 25339 containerizer.cpp:594] Recovering containerizer
I1216 01:45:12.280262 25345 provisioner.cpp:253] Provisioner recovery complete
I1216 01:45:12.280457 25345 slave.cpp:5408] Finished recovery
I1216 01:45:12.280786 25345 slave.cpp:5582] Querying resource estimator for oversubscribable
resources
I1216 01:45:12.280905 25346 slave.cpp:5596] Received oversubscribable resources {} from the
resource estimator
I1216 01:45:12.281435 25345 process.cpp:3679] Handling HTTP event for process 'slave(665)'
with path: '/slave(665)/containers'
I1216 01:45:12.281800 25337 http.cpp:874] Authorizing principal 'test-principal' to GET the
'/containers' endpoint
I1216 01:45:12.282886 25349 slave.cpp:796] Agent terminating
[       OK ] Endpoint/SlaveEndpointTest.AuthorizedRequest/2 (10 ms)
[ RUN      ] Endpoint/SlaveEndpointTest.UnauthorizedRequest/0
I1216 01:45:12.287569 25333 containerizer.cpp:220] Using isolation: posix/cpu,posix/mem,filesystem/posix,network/cni
W1216 01:45:12.287935 25333 backend.cpp:76] Failed to create 'aufs' backend: AufsBackend requires
root privileges, but is running as user mesos
W1216 01:45:12.288022 25333 backend.cpp:76] Failed to create 'bind' backend: BindBackend requires
root privileges
I1216 01:45:12.289165 25338 slave.cpp:209] Mesos agent started on (666)@172.17.0.3:35329
I1216 01:45:12.289196 25338 slave.cpp:210] Flags at startup: --acls="" --appc_simple_discovery_uri_prefix="http://"
--appc_store_dir="/tmp/mesos/store/appc" --authenticate_http_readonly="true" --authenticate_http_readwrite="true"
--authenticatee="crammd5" --authentication_backoff_factor="1secs" --authorizer="local" --cgroups_cpu_enable_pids_and_tids_count="false"
--cgroups_enable_cfs="false" --cgroups_hierarchy="/sys/fs/cgroup" --cgroups_limit_swap="false"
--cgroups_root="mesos" --container_disk_watch_interval="15secs" --containerizers="mesos" --credential="/tmp/Endpoint_SlaveEndpointTest_UnauthorizedRequest_0_CuORpR/credential"
--default_role="*" --disk_watch_interval="1mins" --docker="docker" --docker_kill_orphans="true"
--docker_registry="https://registry-1.docker.io" --docker_remove_delay="6hrs" --docker_socket="/var/run/docker.sock"
--docker_stop_timeout="0ns" --docker_store_dir="/tmp/mesos/store/docker" --docker_volume_checkpoint_dir="/var/run/mesos/isolators/docker/volume"
--enforce_container_disk_quota="false" --executor_registration_timeout="1mins" --executor_shutdown_grace_period="5secs"
--fetcher_cache_dir="/tmp/Endpoint_SlaveEndpointTest_UnauthorizedRequest_0_CuORpR/fetch" --fetcher_cache_size="2GB"
--frameworks_home="" --gc_delay="1weeks" --gc_disk_headroom="0.1" --hadoop_home="" --help="false"
--hostname_lookup="true" --http_authenticators="basic" --http_command_executor="false" --http_credentials="/tmp/Endpoint_SlaveEndpointTest_UnauthorizedRequest_0_CuORpR/http_credentials"
--http_heartbeat_interval="30secs" --image_provisioner_backend="copy" --initialize_driver_logging="true"
--isolation="posix/cpu,posix/mem" --launcher="posix" --launcher_dir="/mesos/build/src" --logbufsecs="0"
--logging_level="INFO" --max_completed_executors_per_framework="150" --oversubscribed_resources_interval="15secs"
--perf_duration="10secs" --perf_interval="1mins" --qos_correction_interval_min="0ns" --quiet="false"
--recover="reconnect" --recovery_timeout="15mins" --registration_backoff_factor="10ms" --resources="cpus:2;gpus:0;mem:1024;disk:1024;ports:[31000-32000]"
--revocable_cpu_low_priority="true" --runtime_dir="/tmp/Endpoint_SlaveEndpointTest_UnauthorizedRequest_0_CuORpR"
--sandbox_directory="/mnt/mesos/sandbox" --strict="true" --switch_user="true" --systemd_enable_support="true"
--systemd_runtime_directory="/run/systemd/system" --version="false" --work_dir="/tmp/Endpoint_SlaveEndpointTest_UnauthorizedRequest_0_jXTB48"
I1216 01:45:12.289551 25338 credentials.hpp:86] Loading credential for authentication from
'/tmp/Endpoint_SlaveEndpointTest_UnauthorizedRequest_0_CuORpR/credential'
I1216 01:45:12.289695 25338 slave.cpp:352] Agent using credential for: test-principal
I1216 01:45:12.289710 25338 credentials.hpp:37] Loading credentials for authentication from
'/tmp/Endpoint_SlaveEndpointTest_UnauthorizedRequest_0_CuORpR/http_credentials'
I1216 01:45:12.289804 25338 http.cpp:922] Using default 'basic' HTTP authenticator for realm
'mesos-agent-readonly'
I1216 01:45:12.289991 25338 http.cpp:922] Using default 'basic' HTTP authenticator for realm
'mesos-agent-readwrite'
I1216 01:45:12.290359 25338 slave.cpp:539] Agent resources: cpus(*):2; mem(*):1024; disk(*):1024;
ports(*):[31000-32000]
I1216 01:45:12.290393 25338 slave.cpp:547] Agent attributes: [  ]
I1216 01:45:12.290401 25338 slave.cpp:552] Agent hostname: a7db2853d93c
I1216 01:45:12.290805 25336 state.cpp:57] Recovering state from '/tmp/Endpoint_SlaveEndpointTest_UnauthorizedRequest_0_jXTB48/meta'
I1216 01:45:12.290971 25344 status_update_manager.cpp:203] Recovering status update manager
I1216 01:45:12.291024 25344 containerizer.cpp:594] Recovering containerizer
I1216 01:45:12.291486 25346 provisioner.cpp:253] Provisioner recovery complete
I1216 01:45:12.291610 25347 slave.cpp:5408] Finished recovery
I1216 01:45:12.292039 25347 slave.cpp:5582] Querying resource estimator for oversubscribable
resources
I1216 01:45:12.292191 25342 slave.cpp:5596] Received oversubscribable resources {} from the
resource estimator
I1216 01:45:12.292866 25343 process.cpp:3679] Handling HTTP event for process 'slave(666)'
with path: '/slave(666)/monitor/statistics'
I1216 01:45:12.293264 25347 http.cpp:874] Authorizing principal 'test-principal' to GET the
'/monitor/statistics' endpoint
I1216 01:45:12.294250 25344 slave.cpp:796] Agent terminating
[       OK ] Endpoint/SlaveEndpointTest.UnauthorizedRequest/0 (11 ms)
[ RUN      ] Endpoint/SlaveEndpointTest.UnauthorizedRequest/1
I1216 01:45:12.298995 25333 containerizer.cpp:220] Using isolation: posix/cpu,posix/mem,filesystem/posix,network/cni
W1216 01:45:12.299335 25333 backend.cpp:76] Failed to create 'aufs' backend: AufsBackend requires
root privileges, but is running as user mesos
W1216 01:45:12.299434 25333 backend.cpp:76] Failed to create 'bind' backend: BindBackend requires
root privileges
I1216 01:45:12.300536 25337 slave.cpp:209] Mesos agent started on (667)@172.17.0.3:35329
I1216 01:45:12.300556 25337 slave.cpp:210] Flags at startup: --acls="" --appc_simple_discovery_uri_prefix="http://"
--appc_store_dir="/tmp/mesos/store/appc" --authenticate_http_readonly="true" --authenticate_http_readwrite="true"
--authenticatee="crammd5" --authentication_backoff_factor="1secs" --authorizer="local" --cgroups_cpu_enable_pids_and_tids_count="false"
--cgroups_enable_cfs="false" --cgroups_hierarchy="/sys/fs/cgroup" --cgroups_limit_swap="false"
--cgroups_root="mesos" --container_disk_watch_interval="15secs" --containerizers="mesos" --credential="/tmp/Endpoint_SlaveEndpointTest_UnauthorizedRequest_1_0UBaTI/credential"
--default_role="*" --disk_watch_interval="1mins" --docker="docker" --docker_kill_orphans="true"
--docker_registry="https://registry-1.docker.io" --docker_remove_delay="6hrs" --docker_socket="/var/run/docker.sock"
--docker_stop_timeout="0ns" --docker_store_dir="/tmp/mesos/store/docker" --docker_volume_checkpoint_dir="/var/run/mesos/isolators/docker/volume"
--enforce_container_disk_quota="false" --executor_registration_timeout="1mins" --executor_shutdown_grace_period="5secs"
--fetcher_cache_dir="/tmp/Endpoint_SlaveEndpointTest_UnauthorizedRequest_1_0UBaTI/fetch" --fetcher_cache_size="2GB"
--frameworks_home="" --gc_delay="1weeks" --gc_disk_headroom="0.1" --hadoop_home="" --help="false"
--hostname_lookup="true" --http_authenticators="basic" --http_command_executor="false" --http_credentials="/tmp/Endpoint_SlaveEndpointTest_UnauthorizedRequest_1_0UBaTI/http_credentials"
--http_heartbeat_interval="30secs" --image_provisioner_backend="copy" --initialize_driver_logging="true"
--isolation="posix/cpu,posix/mem" --launcher="posix" --launcher_dir="/mesos/build/src" --logbufsecs="0"
--logging_level="INFO" --max_completed_executors_per_framework="150" --oversubscribed_resources_interval="15secs"
--perf_duration="10secs" --perf_interval="1mins" --qos_correction_interval_min="0ns" --quiet="false"
--recover="reconnect" --recovery_timeout="15mins" --registration_backoff_factor="10ms" --resources="cpus:2;gpus:0;mem:1024;disk:1024;ports:[31000-32000]"
--revocable_cpu_low_priority="true" --runtime_dir="/tmp/Endpoint_SlaveEndpointTest_UnauthorizedRequest_1_0UBaTI"
--sandbox_directory="/mnt/mesos/sandbox" --strict="true" --switch_user="true" --systemd_enable_support="true"
--systemd_runtime_directory="/run/systemd/system" --version="false" --work_dir="/tmp/Endpoint_SlaveEndpointTest_UnauthorizedRequest_1_TAX3v0"
I1216 01:45:12.300906 25337 credentials.hpp:86] Loading credential for authentication from
'/tmp/Endpoint_SlaveEndpointTest_UnauthorizedRequest_1_0UBaTI/credential'
I1216 01:45:12.301019 25337 slave.cpp:352] Agent using credential for: test-principal
I1216 01:45:12.301034 25337 credentials.hpp:37] Loading credentials for authentication from
'/tmp/Endpoint_SlaveEndpointTest_UnauthorizedRequest_1_0UBaTI/http_credentials'
I1216 01:45:12.301127 25337 http.cpp:922] Using default 'basic' HTTP authenticator for realm
'mesos-agent-readonly'
I1216 01:45:12.301174 25337 http.cpp:922] Using default 'basic' HTTP authenticator for realm
'mesos-agent-readwrite'
I1216 01:45:12.301542 25337 slave.cpp:539] Agent resources: cpus(*):2; mem(*):1024; disk(*):1024;
ports(*):[31000-32000]
I1216 01:45:12.301574 25337 slave.cpp:547] Agent attributes: [  ]
I1216 01:45:12.301586 25337 slave.cpp:552] Agent hostname: a7db2853d93c
I1216 01:45:12.302011 25341 state.cpp:57] Recovering state from '/tmp/Endpoint_SlaveEndpointTest_UnauthorizedRequest_1_TAX3v0/meta'
I1216 01:45:12.302274 25338 status_update_manager.cpp:203] Recovering status update manager
I1216 01:45:12.302350 25336 containerizer.cpp:594] Recovering containerizer
I1216 01:45:12.302901 25341 provisioner.cpp:253] Provisioner recovery complete
I1216 01:45:12.303092 25345 slave.cpp:5408] Finished recovery
I1216 01:45:12.303468 25345 slave.cpp:5582] Querying resource estimator for oversubscribable
resources
I1216 01:45:12.303589 25334 slave.cpp:5596] Received oversubscribable resources {} from the
resource estimator
I1216 01:45:12.304327 25347 process.cpp:3679] Handling HTTP event for process 'slave(667)'
with path: '/slave(667)/monitor/statistics.json'
I1216 01:45:12.305073 25346 http.cpp:874] Authorizing principal 'test-principal' to GET the
'/monitor/statistics.json' endpoint
I1216 01:45:12.306486 25343 slave.cpp:796] Agent terminating
[       OK ] Endpoint/SlaveEndpointTest.UnauthorizedRequest/1 (13 ms)
[ RUN      ] Endpoint/SlaveEndpointTest.UnauthorizedRequest/2
I1216 01:45:12.311417 25333 containerizer.cpp:220] Using isolation: posix/cpu,posix/mem,filesystem/posix,network/cni
W1216 01:45:12.311704 25333 backend.cpp:76] Failed to create 'aufs' backend: AufsBackend requires
root privileges, but is running as user mesos
W1216 01:45:12.311792 25333 backend.cpp:76] Failed to create 'bind' backend: BindBackend requires
root privileges
I1216 01:45:12.312958 25334 slave.cpp:209] Mesos agent started on (668)@172.17.0.3:35329
I1216 01:45:12.312979 25334 slave.cpp:210] Flags at startup: --acls="" --appc_simple_discovery_uri_prefix="http://"
--appc_store_dir="/tmp/mesos/store/appc" --authenticate_http_readonly="true" --authenticate_http_readwrite="true"
--authenticatee="crammd5" --authentication_backoff_factor="1secs" --authorizer="local" --cgroups_cpu_enable_pids_and_tids_count="false"
--cgroups_enable_cfs="false" --cgroups_hierarchy="/sys/fs/cgroup" --cgroups_limit_swap="false"
--cgroups_root="mesos" --container_disk_watch_interval="15secs" --containerizers="mesos" --credential="/tmp/Endpoint_SlaveEndpointTest_UnauthorizedRequest_2_WCozuA/credential"
--default_role="*" --disk_watch_interval="1mins" --docker="docker" --docker_kill_orphans="true"
--docker_registry="https://registry-1.docker.io" --docker_remove_delay="6hrs" --docker_socket="/var/run/docker.sock"
--docker_stop_timeout="0ns" --docker_store_dir="/tmp/mesos/store/docker" --docker_volume_checkpoint_dir="/var/run/mesos/isolators/docker/volume"
--enforce_container_disk_quota="false" --executor_registration_timeout="1mins" --executor_shutdown_grace_period="5secs"
--fetcher_cache_dir="/tmp/Endpoint_SlaveEndpointTest_UnauthorizedRequest_2_WCozuA/fetch" --fetcher_cache_size="2GB"
--frameworks_home="" --gc_delay="1weeks" --gc_disk_headroom="0.1" --hadoop_home="" --help="false"
--hostname_lookup="true" --http_authenticators="basic" --http_command_executor="false" --http_credentials="/tmp/Endpoint_SlaveEndpointTest_UnauthorizedRequest_2_WCozuA/http_credentials"
--http_heartbeat_interval="30secs" --image_provisioner_backend="copy" --initialize_driver_logging="true"
--isolation="posix/cpu,posix/mem" --launcher="posix" --launcher_dir="/mesos/build/src" --logbufsecs="0"
--logging_level="INFO" --max_completed_executors_per_framework="150" --oversubscribed_resources_interval="15secs"
--perf_duration="10secs" --perf_interval="1mins" --qos_correction_interval_min="0ns" --quiet="false"
--recover="reconnect" --recovery_timeout="15mins" --registration_backoff_factor="10ms" --resources="cpus:2;gpus:0;mem:1024;disk:1024;ports:[31000-32000]"
--revocable_cpu_low_priority="true" --runtime_dir="/tmp/Endpoint_SlaveEndpointTest_UnauthorizedRequest_2_WCozuA"
--sandbox_directory="/mnt/mesos/sandbox" --strict="true" --switch_user="true" --systemd_enable_support="true"
--systemd_runtime_directory="/run/systemd/system" --version="false" --work_dir="/tmp/Endpoint_SlaveEndpointTest_UnauthorizedRequest_2_VQvo5R"
I1216 01:45:12.313419 25334 credentials.hpp:86] Loading credential for authentication from
'/tmp/Endpoint_SlaveEndpointTest_UnauthorizedRequest_2_WCozuA/credential'
I1216 01:45:12.313541 25334 slave.cpp:352] Agent using credential for: test-principal
I1216 01:45:12.313557 25334 credentials.hpp:37] Loading credentials for authentication from
'/tmp/Endpoint_SlaveEndpointTest_UnauthorizedRequest_2_WCozuA/http_credentials'
I1216 01:45:12.313678 25334 http.cpp:922] Using default 'basic' HTTP authenticator for realm
'mesos-agent-readonly'
I1216 01:45:12.313730 25334 http.cpp:922] Using default 'basic' HTTP authenticator for realm
'mesos-agent-readwrite'
I1216 01:45:12.314201 25334 slave.cpp:539] Agent resources: cpus(*):2; mem(*):1024; disk(*):1024;
ports(*):[31000-32000]
I1216 01:45:12.314245 25334 slave.cpp:547] Agent attributes: [  ]
I1216 01:45:12.314252 25334 slave.cpp:552] Agent hostname: a7db2853d93c
I1216 01:45:12.314714 25342 state.cpp:57] Recovering state from '/tmp/Endpoint_SlaveEndpointTest_UnauthorizedRequest_2_VQvo5R/meta'
I1216 01:45:12.314852 25343 status_update_manager.cpp:203] Recovering status update manager
I1216 01:45:12.314959 25338 containerizer.cpp:594] Recovering containerizer
I1216 01:45:12.315690 25343 provisioner.cpp:253] Provisioner recovery complete
I1216 01:45:12.315946 25340 slave.cpp:5408] Finished recovery
I1216 01:45:12.316368 25340 slave.cpp:5582] Querying resource estimator for oversubscribable
resources
I1216 01:45:12.316483 25335 slave.cpp:5596] Received oversubscribable resources {} from the
resource estimator
I1216 01:45:12.317209 25346 process.cpp:3679] Handling HTTP event for process 'slave(668)'
with path: '/slave(668)/containers'
I1216 01:45:12.317729 25347 http.cpp:874] Authorizing principal 'test-principal' to GET the
'/containers' endpoint
I1216 01:45:12.318735 25334 slave.cpp:796] Agent terminating
[       OK ] Endpoint/SlaveEndpointTest.UnauthorizedRequest/2 (12 ms)
[ RUN      ] Endpoint/SlaveEndpointTest.NoAuthorizer/0
I1216 01:45:12.323712 25333 containerizer.cpp:220] Using isolation: posix/cpu,posix/mem,filesystem/posix,network/cni
W1216 01:45:12.323983 25333 backend.cpp:76] Failed to create 'aufs' backend: AufsBackend requires
root privileges, but is running as user mesos
W1216 01:45:12.324087 25333 backend.cpp:76] Failed to create 'bind' backend: BindBackend requires
root privileges
I1216 01:45:12.324832 25333 cluster.cpp:446] Creating default 'local' authorizer
I1216 01:45:12.325438 25345 slave.cpp:209] Mesos agent started on (669)@172.17.0.3:35329
I1216 01:45:12.325461 25345 slave.cpp:210] Flags at startup: --acls="" --appc_simple_discovery_uri_prefix="http://"
--appc_store_dir="/tmp/mesos/store/appc" --authenticate_http_readonly="true" --authenticate_http_readwrite="true"
--authenticatee="crammd5" --authentication_backoff_factor="1secs" --authorizer="local" --cgroups_cpu_enable_pids_and_tids_count="false"
--cgroups_enable_cfs="false" --cgroups_hierarchy="/sys/fs/cgroup" --cgroups_limit_swap="false"
--cgroups_root="mesos" --container_disk_watch_interval="15secs" --containerizers="mesos" --credential="/tmp/Endpoint_SlaveEndpointTest_NoAuthorizer_0_u3mYds/credential"
--default_role="*" --disk_watch_interval="1mins" --docker="docker" --docker_kill_orphans="true"
--docker_registry="https://registry-1.docker.io" --docker_remove_delay="6hrs" --docker_socket="/var/run/docker.sock"
--docker_stop_timeout="0ns" --docker_store_dir="/tmp/mesos/store/docker" --docker_volume_checkpoint_dir="/var/run/mesos/isolators/docker/volume"
--enforce_container_disk_quota="false" --executor_registration_timeout="1mins" --executor_shutdown_grace_period="5secs"
--fetcher_cache_dir="/tmp/Endpoint_SlaveEndpointTest_NoAuthorizer_0_u3mYds/fetch" --fetcher_cache_size="2GB"
--frameworks_home="" --gc_delay="1weeks" --gc_disk_headroom="0.1" --hadoop_home="" --help="false"
--hostname_lookup="true" --http_authenticators="basic" --http_command_executor="false" --http_credentials="/tmp/Endpoint_SlaveEndpointTest_NoAuthorizer_0_u3mYds/http_credentials"
--http_heartbeat_interval="30secs" --image_provisioner_backend="copy" --initialize_driver_logging="true"
--isolation="posix/cpu,posix/mem" --launcher="posix" --launcher_dir="/mesos/build/src" --logbufsecs="0"
--logging_level="INFO" --max_completed_executors_per_framework="150" --oversubscribed_resources_interval="15secs"
--perf_duration="10secs" --perf_interval="1mins" --qos_correction_interval_min="0ns" --quiet="false"
--recover="reconnect" --recovery_timeout="15mins" --registration_backoff_factor="10ms" --resources="cpus:2;gpus:0;mem:1024;disk:1024;ports:[31000-32000]"
--revocable_cpu_low_priority="true" --runtime_dir="/tmp/Endpoint_SlaveEndpointTest_NoAuthorizer_0_u3mYds"
--sandbox_directory="/mnt/mesos/sandbox" --strict="true" --switch_user="true" --systemd_enable_support="true"
--systemd_runtime_directory="/run/systemd/system" --version="false" --work_dir="/tmp/Endpoint_SlaveEndpointTest_NoAuthorizer_0_BXiPMJ"
I1216 01:45:12.325872 25345 credentials.hpp:86] Loading credential for authentication from
'/tmp/Endpoint_SlaveEndpointTest_NoAuthorizer_0_u3mYds/credential'
I1216 01:45:12.325965 25345 slave.cpp:352] Agent using credential for: test-principal
I1216 01:45:12.325981 25345 credentials.hpp:37] Loading credentials for authentication from
'/tmp/Endpoint_SlaveEndpointTest_NoAuthorizer_0_u3mYds/http_credentials'
I1216 01:45:12.326092 25345 http.cpp:922] Using default 'basic' HTTP authenticator for realm
'mesos-agent-readonly'
I1216 01:45:12.326139 25345 http.cpp:922] Using default 'basic' HTTP authenticator for realm
'mesos-agent-readwrite'
I1216 01:45:12.326645 25345 slave.cpp:539] Agent resources: cpus(*):2; mem(*):1024; disk(*):1024;
ports(*):[31000-32000]
I1216 01:45:12.326689 25345 slave.cpp:547] Agent attributes: [  ]
I1216 01:45:12.326699 25345 slave.cpp:552] Agent hostname: a7db2853d93c
I1216 01:45:12.327100 25343 state.cpp:57] Recovering state from '/tmp/Endpoint_SlaveEndpointTest_NoAuthorizer_0_BXiPMJ/meta'
I1216 01:45:12.327311 25338 status_update_manager.cpp:203] Recovering status update manager
I1216 01:45:12.327502 25341 containerizer.cpp:594] Recovering containerizer
I1216 01:45:12.328037 25349 provisioner.cpp:253] Provisioner recovery complete
I1216 01:45:12.328263 25349 slave.cpp:5408] Finished recovery
I1216 01:45:12.328671 25349 slave.cpp:5582] Querying resource estimator for oversubscribable
resources
I1216 01:45:12.328793 25339 slave.cpp:5596] Received oversubscribable resources {} from the
resource estimator
I1216 01:45:12.329427 25339 process.cpp:3679] Handling HTTP event for process 'slave(669)'
with path: '/slave(669)/monitor/statistics'
I1216 01:45:12.329900 25334 http.cpp:874] Authorizing principal 'test-principal' to GET the
'/monitor/statistics' endpoint
I1216 01:45:12.331478 25343 slave.cpp:796] Agent terminating
[       OK ] Endpoint/SlaveEndpointTest.NoAuthorizer/0 (12 ms)
[ RUN      ] Endpoint/SlaveEndpointTest.NoAuthorizer/1
I1216 01:45:12.336088 25333 containerizer.cpp:220] Using isolation: posix/cpu,posix/mem,filesystem/posix,network/cni
W1216 01:45:12.336334 25333 backend.cpp:76] Failed to create 'aufs' backend: AufsBackend requires
root privileges, but is running as user mesos
W1216 01:45:12.336405 25333 backend.cpp:76] Failed to create 'bind' backend: BindBackend requires
root privileges
I1216 01:45:12.337177 25333 cluster.cpp:446] Creating default 'local' authorizer
I1216 01:45:12.337844 25345 slave.cpp:209] Mesos agent started on (670)@172.17.0.3:35329
I1216 01:45:12.337864 25345 slave.cpp:210] Flags at startup: --acls="" --appc_simple_discovery_uri_prefix="http://"
--appc_store_dir="/tmp/mesos/store/appc" --authenticate_http_readonly="true" --authenticate_http_readwrite="true"
--authenticatee="crammd5" --authentication_backoff_factor="1secs" --authorizer="local" --cgroups_cpu_enable_pids_and_tids_count="false"
--cgroups_enable_cfs="false" --cgroups_hierarchy="/sys/fs/cgroup" --cgroups_limit_swap="false"
--cgroups_root="mesos" --container_disk_watch_interval="15secs" --containerizers="mesos" --credential="/tmp/Endpoint_SlaveEndpointTest_NoAuthorizer_1_V2ns5j/credential"
--default_role="*" --disk_watch_interval="1mins" --docker="docker" --docker_kill_orphans="true"
--docker_registry="https://registry-1.docker.io" --docker_remove_delay="6hrs" --docker_socket="/var/run/docker.sock"
--docker_stop_timeout="0ns" --docker_store_dir="/tmp/mesos/store/docker" --docker_volume_checkpoint_dir="/var/run/mesos/isolators/docker/volume"
--enforce_container_disk_quota="false" --executor_registration_timeout="1mins" --executor_shutdown_grace_period="5secs"
--fetcher_cache_dir="/tmp/Endpoint_SlaveEndpointTest_NoAuthorizer_1_V2ns5j/fetch" --fetcher_cache_size="2GB"
--frameworks_home="" --gc_delay="1weeks" --gc_disk_headroom="0.1" --hadoop_home="" --help="false"
--hostname_lookup="true" --http_authenticators="basic" --http_command_executor="false" --http_credentials="/tmp/Endpoint_SlaveEndpointTest_NoAuthorizer_1_V2ns5j/http_credentials"
--http_heartbeat_interval="30secs" --image_provisioner_backend="copy" --initialize_driver_logging="true"
--isolation="posix/cpu,posix/mem" --launcher="posix" --launcher_dir="/mesos/build/src" --logbufsecs="0"
--logging_level="INFO" --max_completed_executors_per_framework="150" --oversubscribed_resources_interval="15secs"
--perf_duration="10secs" --perf_interval="1mins" --qos_correction_interval_min="0ns" --quiet="false"
--recover="reconnect" --recovery_timeout="15mins" --registration_backoff_factor="10ms" --resources="cpus:2;gpus:0;mem:1024;disk:1024;ports:[31000-32000]"
--revocable_cpu_low_priority="true" --runtime_dir="/tmp/Endpoint_SlaveEndpointTest_NoAuthorizer_1_V2ns5j"
--sandbox_directory="/mnt/mesos/sandbox" --strict="true" --switch_user="true" --systemd_enable_support="true"
--systemd_runtime_directory="/run/systemd/system" --version="false" --work_dir="/tmp/Endpoint_SlaveEndpointTest_NoAuthorizer_1_0JRhCB"
I1216 01:45:12.338276 25345 credentials.hpp:86] Loading credential for authentication from
'/tmp/Endpoint_SlaveEndpointTest_NoAuthorizer_1_V2ns5j/credential'
I1216 01:45:12.338372 25345 slave.cpp:352] Agent using credential for: test-principal
I1216 01:45:12.338392 25345 credentials.hpp:37] Loading credentials for authentication from
'/tmp/Endpoint_SlaveEndpointTest_NoAuthorizer_1_V2ns5j/http_credentials'
I1216 01:45:12.338513 25345 http.cpp:922] Using default 'basic' HTTP authenticator for realm
'mesos-agent-readonly'
I1216 01:45:12.338564 25345 http.cpp:922] Using default 'basic' HTTP authenticator for realm
'mesos-agent-readwrite'
I1216 01:45:12.338979 25345 slave.cpp:539] Agent resources: cpus(*):2; mem(*):1024; disk(*):1024;
ports(*):[31000-32000]
I1216 01:45:12.339020 25345 slave.cpp:547] Agent attributes: [  ]
I1216 01:45:12.339030 25345 slave.cpp:552] Agent hostname: a7db2853d93c
I1216 01:45:12.339437 25343 state.cpp:57] Recovering state from '/tmp/Endpoint_SlaveEndpointTest_NoAuthorizer_1_0JRhCB/meta'
I1216 01:45:12.339587 25349 status_update_manager.cpp:203] Recovering status update manager
I1216 01:45:12.339723 25340 containerizer.cpp:594] Recovering containerizer
I1216 01:45:12.340320 25340 provisioner.cpp:253] Provisioner recovery complete
I1216 01:45:12.340559 25337 slave.cpp:5408] Finished recovery
I1216 01:45:12.340960 25337 slave.cpp:5582] Querying resource estimator for oversubscribable
resources
I1216 01:45:12.341104 25342 slave.cpp:5596] Received oversubscribable resources {} from the
resource estimator
I1216 01:45:12.341822 25344 process.cpp:3679] Handling HTTP event for process 'slave(670)'
with path: '/slave(670)/monitor/statistics.json'
I1216 01:45:12.342286 25348 http.cpp:874] Authorizing principal 'test-principal' to GET the
'/monitor/statistics.json' endpoint
I1216 01:45:12.343698 25348 slave.cpp:796] Agent terminating
[       OK ] Endpoint/SlaveEndpointTest.NoAuthorizer/1 (11 ms)
[ RUN      ] Endpoint/SlaveEndpointTest.NoAuthorizer/2
I1216 01:45:12.348251 25333 containerizer.cpp:220] Using isolation: posix/cpu,posix/mem,filesystem/posix,network/cni
W1216 01:45:12.348506 25333 backend.cpp:76] Failed to create 'aufs' backend: AufsBackend requires
root privileges, but is running as user mesos
W1216 01:45:12.348640 25333 backend.cpp:76] Failed to create 'bind' backend: BindBackend requires
root privileges
I1216 01:45:12.349195 25333 cluster.cpp:446] Creating default 'local' authorizer
I1216 01:45:12.349789 25342 slave.cpp:209] Mesos agent started on (671)@172.17.0.3:35329
I1216 01:45:12.349810 25342 slave.cpp:210] Flags at startup: --acls="" --appc_simple_discovery_uri_prefix="http://"
--appc_store_dir="/tmp/mesos/store/appc" --authenticate_http_readonly="true" --authenticate_http_readwrite="true"
--authenticatee="crammd5" --authentication_backoff_factor="1secs" --authorizer="local" --cgroups_cpu_enable_pids_and_tids_count="false"
--cgroups_enable_cfs="false" --cgroups_hierarchy="/sys/fs/cgroup" --cgroups_limit_swap="false"
--cgroups_root="mesos" --container_disk_watch_interval="15secs" --containerizers="mesos" --credential="/tmp/Endpoint_SlaveEndpointTest_NoAuthorizer_2_eIeQ4b/credential"
--default_role="*" --disk_watch_interval="1mins" --docker="docker" --docker_kill_orphans="true"
--docker_registry="https://registry-1.docker.io" --docker_remove_delay="6hrs" --docker_socket="/var/run/docker.sock"
--docker_stop_timeout="0ns" --docker_store_dir="/tmp/mesos/store/docker" --docker_volume_checkpoint_dir="/var/run/mesos/isolators/docker/volume"
--enforce_container_disk_quota="false" --executor_registration_timeout="1mins" --executor_shutdown_grace_period="5secs"
--fetcher_cache_dir="/tmp/Endpoint_SlaveEndpointTest_NoAuthorizer_2_eIeQ4b/fetch" --fetcher_cache_size="2GB"
--frameworks_home="" --gc_delay="1weeks" --gc_disk_headroom="0.1" --hadoop_home="" --help="false"
--hostname_lookup="true" --http_authenticators="basic" --http_command_executor="false" --http_credentials="/tmp/Endpoint_SlaveEndpointTest_NoAuthorizer_2_eIeQ4b/http_credentials"
--http_heartbeat_interval="30secs" --image_provisioner_backend="copy" --initialize_driver_logging="true"
--isolation="posix/cpu,posix/mem" --launcher="posix" --launcher_dir="/mesos/build/src" --logbufsecs="0"
--logging_level="INFO" --max_completed_executors_per_framework="150" --oversubscribed_resources_interval="15secs"
--perf_duration="10secs" --perf_interval="1mins" --qos_correction_interval_min="0ns" --quiet="false"
--recover="reconnect" --recovery_timeout="15mins" --registration_backoff_factor="10ms" --resources="cpus:2;gpus:0;mem:1024;disk:1024;ports:[31000-32000]"
--revocable_cpu_low_priority="true" --runtime_dir="/tmp/Endpoint_SlaveEndpointTest_NoAuthorizer_2_eIeQ4b"
--sandbox_directory="/mnt/mesos/sandbox" --strict="true" --switch_user="true" --systemd_enable_support="true"
--systemd_runtime_directory="/run/systemd/system" --version="false" --work_dir="/tmp/Endpoint_SlaveEndpointTest_NoAuthorizer_2_GSwHzt"
I1216 01:45:12.350249 25342 credentials.hpp:86] Loading credential for authentication from
'/tmp/Endpoint_SlaveEndpointTest_NoAuthorizer_2_eIeQ4b/credential'
I1216 01:45:12.350343 25342 slave.cpp:352] Agent using credential for: test-principal
I1216 01:45:12.350364 25342 credentials.hpp:37] Loading credentials for authentication from
'/tmp/Endpoint_SlaveEndpointTest_NoAuthorizer_2_eIeQ4b/http_credentials'
I1216 01:45:12.350486 25342 http.cpp:922] Using default 'basic' HTTP authenticator for realm
'mesos-agent-readonly'
I1216 01:45:12.350541 25342 http.cpp:922] Using default 'basic' HTTP authenticator for realm
'mesos-agent-readwrite'
I1216 01:45:12.351014 25342 slave.cpp:539] Agent resources: cpus(*):2; mem(*):1024; disk(*):1024;
ports(*):[31000-32000]
I1216 01:45:12.351056 25342 slave.cpp:547] Agent attributes: [  ]
I1216 01:45:12.351063 25342 slave.cpp:552] Agent hostname: a7db2853d93c
I1216 01:45:12.351461 25341 state.cpp:57] Recovering state from '/tmp/Endpoint_SlaveEndpointTest_NoAuthorizer_2_GSwHzt/meta'
I1216 01:45:12.351704 25342 status_update_manager.cpp:203] Recovering status update manager
I1216 01:45:12.351814 25341 containerizer.cpp:594] Recovering containerizer
I1216 01:45:12.352440 25341 provisioner.cpp:253] Provisioner recovery complete
I1216 01:45:12.352679 25335 slave.cpp:5408] Finished recovery
I1216 01:45:12.353117 25335 slave.cpp:5582] Querying resource estimator for oversubscribable
resources
I1216 01:45:12.353250 25336 slave.cpp:5596] Received oversubscribable resources {} from the
resource estimator
I1216 01:45:12.353924 25349 process.cpp:3679] Handling HTTP event for process 'slave(671)'
with path: '/slave(671)/containers'
I1216 01:45:12.354431 25344 http.cpp:874] Authorizing principal 'test-principal' to GET the
'/containers' endpoint
I1216 01:45:12.355995 25337 slave.cpp:796] Agent terminating
[       OK ] Endpoint/SlaveEndpointTest.NoAuthorizer/2 (12 ms)
[----------] 9 tests from Endpoint/SlaveEndpointTest (111 ms total)

[----------] Global test environment tear-down
[==========] 1383 tests from 157 test cases ran. (171376 ms total)
[  PASSED  ] 1382 tests.
[  FAILED  ] 1 test, listed below:
[  FAILED  ] IOSwitchboardTest.KillSwitchboardContainerDestroyed

 1 FAILED TEST
  YOU HAVE 9 DISABLED TESTS

make[3]: *** [CMakeFiles/check] Error 1
make[3]: Leaving directory `/mesos/build'
make[2]: *** [CMakeFiles/check.dir/all] Error 2
make[2]: Leaving directory `/mesos/build'
make[1]: *** [CMakeFiles/check.dir/rule] Error 2
make[1]: Leaving directory `/mesos/build'
make: *** [check] Error 2
+ docker rmi mesos-1481847814-7462
Untagged: mesos-1481847814-7462:latest
Deleted: sha256:4425e7b654691bc82976d970894d3b59382fd7c502ee55d10256a257dd81137e
Deleted: sha256:c7fe2b7d22a564410d7e5e5ff358799dc67accfebf12ff149a6c676daffdde3a
Deleted: sha256:57af41044c5166e1abc2e73a68bcf6ca1f6b615002a6da098d4a5bd9989b8112
Deleted: sha256:939838feab8a699b483eb08aa63e446998b2e62efb1e42345cc7571d98dcf30e
Deleted: sha256:14ce6890e5fa9ab606dc72ac936b912bdd20026fa32d459c955c804b879d8981
Deleted: sha256:58963f4e33768d321d1b93b7a9bea638fea2e9a7b9bfc55505ae88f91c18166c
Deleted: sha256:48a9950caaec5d4be4aa1789e36d612310efb7521a163bc4252099134832757c
Deleted: sha256:1d434fff7240c04efb50a83174d45491ec8aca49f9c685358222e8da79a131b4
Deleted: sha256:2eda24530dbaba90c9ae323c55acfe98531159ba672272807309ece3926bc120
Deleted: sha256:696363966f3ba399cded4873ddde114100b2b08f0adb213747e3bbb3ba0dbe9e
Deleted: sha256:aab81c0b136d1934c8bc0f8b2894c2b7234bc32a8e6cc10b303ded76904c0a59
Deleted: sha256:585d51eba798fdf7e29a9d8f26533ec706e0661979232bc69d10714bbb19edd8
Deleted: sha256:04987faff7f5e2422f1e68998ce5492ec47d93e2198e39570bc5b9b2d8604f6e
Deleted: sha256:5da02e759082335462c3bf2d4788817835fefa3cb3a9711b1e6e616fc5a700ef
Deleted: sha256:773e734b12b4d176b1d0868b76c23edacc868fd73b3c42ae4385bfd568bde920
Deleted: sha256:a052d855ee0daf0af2b18149cc453cf458e5f95288cc92b252ee66952d5d3332
Deleted: sha256:8635346b83df756ba2d0406cd28b53007c9c649fad18760a4eeb2ab25278126b
Deleted: sha256:75ec3fbd4b250fd09934b1590474597b835e4167413c74b9036552e4197fea66
Deleted: sha256:96839d1ef01fa56f9761929b9875558cb4826065dc56b3d8512b1843368519f2
Deleted: sha256:4d4f3bd46249dec3d56459c468829ab65c950f5e7b9cab67bfdcfd47b97bb682
Deleted: sha256:3f64f19219cdd1a06b1fee42df252884acce89dd78392255a132b507c92150f6
Deleted: sha256:56084cacab31cee1dc8554a75ea81d53b83be8f5f276c96a7fd2d5be0d6061e9
Deleted: sha256:8bc3aac8f3e59f1faf8fbfa4c43e7aec9edd4a3e48702928783fecf4dc804f86
Deleted: sha256:2eeb3fc20bf8273bef458afbaadb2c32782c6851e1a245851c3f1c66697c0c4d
Deleted: sha256:3fd52909bf1bd7fc45f1b1c1cee9995298293cd40dfa51eb917eb0242c7f62ab
Build step 'Execute shell' marked build as failure

Mime
View raw message