mesos-builds mailing list archives

Site index · List index
Message view « Date » · « Thread »
Top « Date » · « Thread »
From Apache Jenkins Server <jenk...@builds.apache.org>
Subject Build failed in Jenkins: Mesos » cmake,gcc,--verbose --enable-libevent --enable-ssl,GLOG_v=1 MESOS_VERBOSE=1,ubuntu:14.04,(docker||Hadoop)&&(!ubuntu-us1)&&(!ubuntu-6)&&(!ubuntu-eu2) #3032
Date Mon, 12 Dec 2016 02:37:57 GMT
See <https://builds.apache.org/job/Mesos/BUILDTOOL=cmake,COMPILER=gcc,CONFIGURATION=--verbose%20--enable-libevent%20--enable-ssl,ENVIRONMENT=GLOG_v=1%20MESOS_VERBOSE=1,OS=ubuntu%3A14.04,label_exp=(docker%7C%7CHadoop)&&(!ubuntu-us1)&&(!ubuntu-6)&&(!ubuntu-eu2)/3032/changes>

Changes:

[vinodkone] Change `Accept-Type` to `Accept` in operator api docs.

------------------------------------------
[...truncated 165436 lines...]
[ RUN      ] Endpoint/SlaveEndpointTest.AuthorizedRequest/1
I1212 02:37:11.473757 27005 containerizer.cpp:220] Using isolation: posix/cpu,posix/mem,filesystem/posix,network/cni
W1212 02:37:11.474046 27005 backend.cpp:76] Failed to create 'aufs' backend: AufsBackend requires
root privileges, but is running as user mesos
W1212 02:37:11.474120 27005 backend.cpp:76] Failed to create 'bind' backend: BindBackend requires
root privileges
I1212 02:37:11.475121 27007 slave.cpp:209] Mesos agent started on (667)@172.17.0.2:41675
I1212 02:37:11.475136 27007 slave.cpp:210] Flags at startup: --acls="" --appc_simple_discovery_uri_prefix="http://"
--appc_store_dir="/tmp/mesos/store/appc" --authenticate_http_readonly="true" --authenticate_http_readwrite="true"
--authenticatee="crammd5" --authentication_backoff_factor="1secs" --authorizer="local" --cgroups_cpu_enable_pids_and_tids_count="false"
--cgroups_enable_cfs="false" --cgroups_hierarchy="/sys/fs/cgroup" --cgroups_limit_swap="false"
--cgroups_root="mesos" --container_disk_watch_interval="15secs" --containerizers="mesos" --credential="/tmp/Endpoint_SlaveEndpointTest_AuthorizedRequest_1_eWW82C/credential"
--default_role="*" --disk_watch_interval="1mins" --docker="docker" --docker_kill_orphans="true"
--docker_registry="https://registry-1.docker.io" --docker_remove_delay="6hrs" --docker_socket="/var/run/docker.sock"
--docker_stop_timeout="0ns" --docker_store_dir="/tmp/mesos/store/docker" --docker_volume_checkpoint_dir="/var/run/mesos/isolators/docker/volume"
--enforce_container_disk_quota="false" --executor_registration_timeout="1mins" --executor_shutdown_grace_period="5secs"
--fetcher_cache_dir="/tmp/Endpoint_SlaveEndpointTest_AuthorizedRequest_1_eWW82C/fetch" --fetcher_cache_size="2GB"
--frameworks_home="" --gc_delay="1weeks" --gc_disk_headroom="0.1" --hadoop_home="" --help="false"
--hostname_lookup="true" --http_authenticators="basic" --http_command_executor="false" --http_credentials="/tmp/Endpoint_SlaveEndpointTest_AuthorizedRequest_1_eWW82C/http_credentials"
--image_provisioner_backend="copy" --initialize_driver_logging="true" --io_switchboard_enable_server="true"
--isolation="posix/cpu,posix/mem" --launcher="posix" --launcher_dir="/mesos/build/src" --logbufsecs="0"
--logging_level="INFO" --max_completed_executors_per_framework="150" --oversubscribed_resources_interval="15secs"
--perf_duration="10secs" --perf_interval="1mins" --qos_correction_interval_min="0ns" --quiet="false"
--recover="reconnect" --recovery_timeout="15mins" --registration_backoff_factor="10ms" --resources="cpus:2;gpus:0;mem:1024;disk:1024;ports:[31000-32000]"
--revocable_cpu_low_priority="true" --runtime_dir="/tmp/Endpoint_SlaveEndpointTest_AuthorizedRequest_1_eWW82C"
--sandbox_directory="/mnt/mesos/sandbox" --strict="true" --switch_user="true" --systemd_enable_support="true"
--systemd_runtime_directory="/run/systemd/system" --version="false" --work_dir="/tmp/Endpoint_SlaveEndpointTest_AuthorizedRequest_1_vV9Auc"
I1212 02:37:11.475419 27007 credentials.hpp:86] Loading credential for authentication from
'/tmp/Endpoint_SlaveEndpointTest_AuthorizedRequest_1_eWW82C/credential'
I1212 02:37:11.475502 27007 slave.cpp:347] Agent using credential for: test-principal
I1212 02:37:11.475517 27007 credentials.hpp:37] Loading credentials for authentication from
'/tmp/Endpoint_SlaveEndpointTest_AuthorizedRequest_1_eWW82C/http_credentials'
I1212 02:37:11.475630 27007 http.cpp:922] Using default 'basic' HTTP authenticator for realm
'mesos-agent-readonly'
I1212 02:37:11.475694 27007 http.cpp:922] Using default 'basic' HTTP authenticator for realm
'mesos-agent-readwrite'
I1212 02:37:11.476007 27007 slave.cpp:534] Agent resources: cpus(*):2; mem(*):1024; disk(*):1024;
ports(*):[31000-32000]
I1212 02:37:11.476042 27007 slave.cpp:542] Agent attributes: [  ]
I1212 02:37:11.476052 27007 slave.cpp:547] Agent hostname: dcd0d9e9de89
I1212 02:37:11.476390 27012 state.cpp:57] Recovering state from '/tmp/Endpoint_SlaveEndpointTest_AuthorizedRequest_1_vV9Auc/meta'
I1212 02:37:11.476492 27012 status_update_manager.cpp:203] Recovering status update manager
I1212 02:37:11.476593 27014 containerizer.cpp:594] Recovering containerizer
I1212 02:37:11.477067 27008 provisioner.cpp:253] Provisioner recovery complete
I1212 02:37:11.477227 27014 slave.cpp:5415] Finished recovery
I1212 02:37:11.477653 27014 slave.cpp:5589] Querying resource estimator for oversubscribable
resources
I1212 02:37:11.477787 27018 slave.cpp:5603] Received oversubscribable resources {} from the
resource estimator
I1212 02:37:11.478384 27007 process.cpp:3679] Handling HTTP event for process 'slave(667)'
with path: '/slave(667)/monitor/statistics.json'
I1212 02:37:11.478852 27018 http.cpp:874] Authorizing principal 'test-principal' to GET the
'/monitor/statistics.json' endpoint
I1212 02:37:11.480168 27010 slave.cpp:791] Agent terminating
[       OK ] Endpoint/SlaveEndpointTest.AuthorizedRequest/1 (10 ms)
[ RUN      ] Endpoint/SlaveEndpointTest.AuthorizedRequest/2
I1212 02:37:11.484161 27005 containerizer.cpp:220] Using isolation: posix/cpu,posix/mem,filesystem/posix,network/cni
W1212 02:37:11.484421 27005 backend.cpp:76] Failed to create 'aufs' backend: AufsBackend requires
root privileges, but is running as user mesos
W1212 02:37:11.484488 27005 backend.cpp:76] Failed to create 'bind' backend: BindBackend requires
root privileges
I1212 02:37:11.485401 27015 slave.cpp:209] Mesos agent started on (668)@172.17.0.2:41675
I1212 02:37:11.485415 27015 slave.cpp:210] Flags at startup: --acls="" --appc_simple_discovery_uri_prefix="http://"
--appc_store_dir="/tmp/mesos/store/appc" --authenticate_http_readonly="true" --authenticate_http_readwrite="true"
--authenticatee="crammd5" --authentication_backoff_factor="1secs" --authorizer="local" --cgroups_cpu_enable_pids_and_tids_count="false"
--cgroups_enable_cfs="false" --cgroups_hierarchy="/sys/fs/cgroup" --cgroups_limit_swap="false"
--cgroups_root="mesos" --container_disk_watch_interval="15secs" --containerizers="mesos" --credential="/tmp/Endpoint_SlaveEndpointTest_AuthorizedRequest_2_muy3ml/credential"
--default_role="*" --disk_watch_interval="1mins" --docker="docker" --docker_kill_orphans="true"
--docker_registry="https://registry-1.docker.io" --docker_remove_delay="6hrs" --docker_socket="/var/run/docker.sock"
--docker_stop_timeout="0ns" --docker_store_dir="/tmp/mesos/store/docker" --docker_volume_checkpoint_dir="/var/run/mesos/isolators/docker/volume"
--enforce_container_disk_quota="false" --executor_registration_timeout="1mins" --executor_shutdown_grace_period="5secs"
--fetcher_cache_dir="/tmp/Endpoint_SlaveEndpointTest_AuthorizedRequest_2_muy3ml/fetch" --fetcher_cache_size="2GB"
--frameworks_home="" --gc_delay="1weeks" --gc_disk_headroom="0.1" --hadoop_home="" --help="false"
--hostname_lookup="true" --http_authenticators="basic" --http_command_executor="false" --http_credentials="/tmp/Endpoint_SlaveEndpointTest_AuthorizedRequest_2_muy3ml/http_credentials"
--image_provisioner_backend="copy" --initialize_driver_logging="true" --io_switchboard_enable_server="true"
--isolation="posix/cpu,posix/mem" --launcher="posix" --launcher_dir="/mesos/build/src" --logbufsecs="0"
--logging_level="INFO" --max_completed_executors_per_framework="150" --oversubscribed_resources_interval="15secs"
--perf_duration="10secs" --perf_interval="1mins" --qos_correction_interval_min="0ns" --quiet="false"
--recover="reconnect" --recovery_timeout="15mins" --registration_backoff_factor="10ms" --resources="cpus:2;gpus:0;mem:1024;disk:1024;ports:[31000-32000]"
--revocable_cpu_low_priority="true" --runtime_dir="/tmp/Endpoint_SlaveEndpointTest_AuthorizedRequest_2_muy3ml"
--sandbox_directory="/mnt/mesos/sandbox" --strict="true" --switch_user="true" --systemd_enable_support="true"
--systemd_runtime_directory="/run/systemd/system" --version="false" --work_dir="/tmp/Endpoint_SlaveEndpointTest_AuthorizedRequest_2_fJDOMU"
I1212 02:37:11.485740 27015 credentials.hpp:86] Loading credential for authentication from
'/tmp/Endpoint_SlaveEndpointTest_AuthorizedRequest_2_muy3ml/credential'
I1212 02:37:11.485811 27015 slave.cpp:347] Agent using credential for: test-principal
I1212 02:37:11.485826 27015 credentials.hpp:37] Loading credentials for authentication from
'/tmp/Endpoint_SlaveEndpointTest_AuthorizedRequest_2_muy3ml/http_credentials'
I1212 02:37:11.485940 27015 http.cpp:922] Using default 'basic' HTTP authenticator for realm
'mesos-agent-readonly'
I1212 02:37:11.485980 27015 http.cpp:922] Using default 'basic' HTTP authenticator for realm
'mesos-agent-readwrite'
I1212 02:37:11.486256 27015 slave.cpp:534] Agent resources: cpus(*):2; mem(*):1024; disk(*):1024;
ports(*):[31000-32000]
I1212 02:37:11.486287 27015 slave.cpp:542] Agent attributes: [  ]
I1212 02:37:11.486292 27015 slave.cpp:547] Agent hostname: dcd0d9e9de89
I1212 02:37:11.486714 27006 state.cpp:57] Recovering state from '/tmp/Endpoint_SlaveEndpointTest_AuthorizedRequest_2_fJDOMU/meta'
I1212 02:37:11.486842 27013 status_update_manager.cpp:203] Recovering status update manager
I1212 02:37:11.487027 27010 containerizer.cpp:594] Recovering containerizer
I1212 02:37:11.487608 27016 provisioner.cpp:253] Provisioner recovery complete
I1212 02:37:11.487797 27020 slave.cpp:5415] Finished recovery
I1212 02:37:11.488417 27020 slave.cpp:5589] Querying resource estimator for oversubscribable
resources
I1212 02:37:11.488695 27007 slave.cpp:5603] Received oversubscribable resources {} from the
resource estimator
I1212 02:37:11.489336 27008 process.cpp:3679] Handling HTTP event for process 'slave(668)'
with path: '/slave(668)/containers'
I1212 02:37:11.489728 27020 http.cpp:874] Authorizing principal 'test-principal' to GET the
'/containers' endpoint
I1212 02:37:11.491034 27005 slave.cpp:791] Agent terminating
[       OK ] Endpoint/SlaveEndpointTest.AuthorizedRequest/2 (11 ms)
[ RUN      ] Endpoint/SlaveEndpointTest.UnauthorizedRequest/0
I1212 02:37:11.495553 27005 containerizer.cpp:220] Using isolation: posix/cpu,posix/mem,filesystem/posix,network/cni
W1212 02:37:11.495827 27005 backend.cpp:76] Failed to create 'aufs' backend: AufsBackend requires
root privileges, but is running as user mesos
W1212 02:37:11.495900 27005 backend.cpp:76] Failed to create 'bind' backend: BindBackend requires
root privileges
I1212 02:37:11.496929 27011 slave.cpp:209] Mesos agent started on (669)@172.17.0.2:41675
I1212 02:37:11.496948 27011 slave.cpp:210] Flags at startup: --acls="" --appc_simple_discovery_uri_prefix="http://"
--appc_store_dir="/tmp/mesos/store/appc" --authenticate_http_readonly="true" --authenticate_http_readwrite="true"
--authenticatee="crammd5" --authentication_backoff_factor="1secs" --authorizer="local" --cgroups_cpu_enable_pids_and_tids_count="false"
--cgroups_enable_cfs="false" --cgroups_hierarchy="/sys/fs/cgroup" --cgroups_limit_swap="false"
--cgroups_root="mesos" --container_disk_watch_interval="15secs" --containerizers="mesos" --credential="/tmp/Endpoint_SlaveEndpointTest_UnauthorizedRequest_0_MF5eO3/credential"
--default_role="*" --disk_watch_interval="1mins" --docker="docker" --docker_kill_orphans="true"
--docker_registry="https://registry-1.docker.io" --docker_remove_delay="6hrs" --docker_socket="/var/run/docker.sock"
--docker_stop_timeout="0ns" --docker_store_dir="/tmp/mesos/store/docker" --docker_volume_checkpoint_dir="/var/run/mesos/isolators/docker/volume"
--enforce_container_disk_quota="false" --executor_registration_timeout="1mins" --executor_shutdown_grace_period="5secs"
--fetcher_cache_dir="/tmp/Endpoint_SlaveEndpointTest_UnauthorizedRequest_0_MF5eO3/fetch" --fetcher_cache_size="2GB"
--frameworks_home="" --gc_delay="1weeks" --gc_disk_headroom="0.1" --hadoop_home="" --help="false"
--hostname_lookup="true" --http_authenticators="basic" --http_command_executor="false" --http_credentials="/tmp/Endpoint_SlaveEndpointTest_UnauthorizedRequest_0_MF5eO3/http_credentials"
--image_provisioner_backend="copy" --initialize_driver_logging="true" --io_switchboard_enable_server="true"
--isolation="posix/cpu,posix/mem" --launcher="posix" --launcher_dir="/mesos/build/src" --logbufsecs="0"
--logging_level="INFO" --max_completed_executors_per_framework="150" --oversubscribed_resources_interval="15secs"
--perf_duration="10secs" --perf_interval="1mins" --qos_correction_interval_min="0ns" --quiet="false"
--recover="reconnect" --recovery_timeout="15mins" --registration_backoff_factor="10ms" --resources="cpus:2;gpus:0;mem:1024;disk:1024;ports:[31000-32000]"
--revocable_cpu_low_priority="true" --runtime_dir="/tmp/Endpoint_SlaveEndpointTest_UnauthorizedRequest_0_MF5eO3"
--sandbox_directory="/mnt/mesos/sandbox" --strict="true" --switch_user="true" --systemd_enable_support="true"
--systemd_runtime_directory="/run/systemd/system" --version="false" --work_dir="/tmp/Endpoint_SlaveEndpointTest_UnauthorizedRequest_0_5Gz9bD"
I1212 02:37:11.497459 27011 credentials.hpp:86] Loading credential for authentication from
'/tmp/Endpoint_SlaveEndpointTest_UnauthorizedRequest_0_MF5eO3/credential'
I1212 02:37:11.497562 27011 slave.cpp:347] Agent using credential for: test-principal
I1212 02:37:11.497608 27011 credentials.hpp:37] Loading credentials for authentication from
'/tmp/Endpoint_SlaveEndpointTest_UnauthorizedRequest_0_MF5eO3/http_credentials'
I1212 02:37:11.497757 27011 http.cpp:922] Using default 'basic' HTTP authenticator for realm
'mesos-agent-readonly'
I1212 02:37:11.497810 27011 http.cpp:922] Using default 'basic' HTTP authenticator for realm
'mesos-agent-readwrite'
I1212 02:37:11.498210 27011 slave.cpp:534] Agent resources: cpus(*):2; mem(*):1024; disk(*):1024;
ports(*):[31000-32000]
I1212 02:37:11.498258 27011 slave.cpp:542] Agent attributes: [  ]
I1212 02:37:11.498270 27011 slave.cpp:547] Agent hostname: dcd0d9e9de89
I1212 02:37:11.498735 27021 state.cpp:57] Recovering state from '/tmp/Endpoint_SlaveEndpointTest_UnauthorizedRequest_0_5Gz9bD/meta'
I1212 02:37:11.498973 27020 status_update_manager.cpp:203] Recovering status update manager
I1212 02:37:11.499068 27017 containerizer.cpp:594] Recovering containerizer
I1212 02:37:11.499608 27013 provisioner.cpp:253] Provisioner recovery complete
I1212 02:37:11.499820 27013 slave.cpp:5415] Finished recovery
I1212 02:37:11.500236 27013 slave.cpp:5589] Querying resource estimator for oversubscribable
resources
I1212 02:37:11.500334 27019 slave.cpp:5603] Received oversubscribable resources {} from the
resource estimator
I1212 02:37:11.501015 27013 process.cpp:3679] Handling HTTP event for process 'slave(669)'
with path: '/slave(669)/monitor/statistics'
I1212 02:37:11.501404 27008 http.cpp:874] Authorizing principal 'test-principal' to GET the
'/monitor/statistics' endpoint
I1212 02:37:11.502202 27013 slave.cpp:791] Agent terminating
[       OK ] Endpoint/SlaveEndpointTest.UnauthorizedRequest/0 (11 ms)
[ RUN      ] Endpoint/SlaveEndpointTest.UnauthorizedRequest/1
I1212 02:37:11.506758 27005 containerizer.cpp:220] Using isolation: posix/cpu,posix/mem,filesystem/posix,network/cni
W1212 02:37:11.507099 27005 backend.cpp:76] Failed to create 'aufs' backend: AufsBackend requires
root privileges, but is running as user mesos
W1212 02:37:11.507185 27005 backend.cpp:76] Failed to create 'bind' backend: BindBackend requires
root privileges
I1212 02:37:11.508191 27015 slave.cpp:209] Mesos agent started on (670)@172.17.0.2:41675
I1212 02:37:11.508208 27015 slave.cpp:210] Flags at startup: --acls="" --appc_simple_discovery_uri_prefix="http://"
--appc_store_dir="/tmp/mesos/store/appc" --authenticate_http_readonly="true" --authenticate_http_readwrite="true"
--authenticatee="crammd5" --authentication_backoff_factor="1secs" --authorizer="local" --cgroups_cpu_enable_pids_and_tids_count="false"
--cgroups_enable_cfs="false" --cgroups_hierarchy="/sys/fs/cgroup" --cgroups_limit_swap="false"
--cgroups_root="mesos" --container_disk_watch_interval="15secs" --containerizers="mesos" --credential="/tmp/Endpoint_SlaveEndpointTest_UnauthorizedRequest_1_mNGNmM/credential"
--default_role="*" --disk_watch_interval="1mins" --docker="docker" --docker_kill_orphans="true"
--docker_registry="https://registry-1.docker.io" --docker_remove_delay="6hrs" --docker_socket="/var/run/docker.sock"
--docker_stop_timeout="0ns" --docker_store_dir="/tmp/mesos/store/docker" --docker_volume_checkpoint_dir="/var/run/mesos/isolators/docker/volume"
--enforce_container_disk_quota="false" --executor_registration_timeout="1mins" --executor_shutdown_grace_period="5secs"
--fetcher_cache_dir="/tmp/Endpoint_SlaveEndpointTest_UnauthorizedRequest_1_mNGNmM/fetch" --fetcher_cache_size="2GB"
--frameworks_home="" --gc_delay="1weeks" --gc_disk_headroom="0.1" --hadoop_home="" --help="false"
--hostname_lookup="true" --http_authenticators="basic" --http_command_executor="false" --http_credentials="/tmp/Endpoint_SlaveEndpointTest_UnauthorizedRequest_1_mNGNmM/http_credentials"
--image_provisioner_backend="copy" --initialize_driver_logging="true" --io_switchboard_enable_server="true"
--isolation="posix/cpu,posix/mem" --launcher="posix" --launcher_dir="/mesos/build/src" --logbufsecs="0"
--logging_level="INFO" --max_completed_executors_per_framework="150" --oversubscribed_resources_interval="15secs"
--perf_duration="10secs" --perf_interval="1mins" --qos_correction_interval_min="0ns" --quiet="false"
--recover="reconnect" --recovery_timeout="15mins" --registration_backoff_factor="10ms" --resources="cpus:2;gpus:0;mem:1024;disk:1024;ports:[31000-32000]"
--revocable_cpu_low_priority="true" --runtime_dir="/tmp/Endpoint_SlaveEndpointTest_UnauthorizedRequest_1_mNGNmM"
--sandbox_directory="/mnt/mesos/sandbox" --strict="true" --switch_user="true" --systemd_enable_support="true"
--systemd_runtime_directory="/run/systemd/system" --version="false" --work_dir="/tmp/Endpoint_SlaveEndpointTest_UnauthorizedRequest_1_xfqTIl"
I1212 02:37:11.508554 27015 credentials.hpp:86] Loading credential for authentication from
'/tmp/Endpoint_SlaveEndpointTest_UnauthorizedRequest_1_mNGNmM/credential'
I1212 02:37:11.508695 27015 slave.cpp:347] Agent using credential for: test-principal
I1212 02:37:11.508709 27015 credentials.hpp:37] Loading credentials for authentication from
'/tmp/Endpoint_SlaveEndpointTest_UnauthorizedRequest_1_mNGNmM/http_credentials'
I1212 02:37:11.508819 27015 http.cpp:922] Using default 'basic' HTTP authenticator for realm
'mesos-agent-readonly'
I1212 02:37:11.508863 27015 http.cpp:922] Using default 'basic' HTTP authenticator for realm
'mesos-agent-readwrite'
I1212 02:37:11.509225 27015 slave.cpp:534] Agent resources: cpus(*):2; mem(*):1024; disk(*):1024;
ports(*):[31000-32000]
I1212 02:37:11.509258 27015 slave.cpp:542] Agent attributes: [  ]
I1212 02:37:11.509266 27015 slave.cpp:547] Agent hostname: dcd0d9e9de89
I1212 02:37:11.509614 27010 state.cpp:57] Recovering state from '/tmp/Endpoint_SlaveEndpointTest_UnauthorizedRequest_1_xfqTIl/meta'
I1212 02:37:11.509805 27008 status_update_manager.cpp:203] Recovering status update manager
I1212 02:37:11.509922 27016 containerizer.cpp:594] Recovering containerizer
I1212 02:37:11.510404 27014 provisioner.cpp:253] Provisioner recovery complete
I1212 02:37:11.510668 27015 slave.cpp:5415] Finished recovery
I1212 02:37:11.511109 27015 slave.cpp:5589] Querying resource estimator for oversubscribable
resources
I1212 02:37:11.511281 27009 slave.cpp:5603] Received oversubscribable resources {} from the
resource estimator
I1212 02:37:11.511968 27006 process.cpp:3679] Handling HTTP event for process 'slave(670)'
with path: '/slave(670)/monitor/statistics.json'
I1212 02:37:11.512403 27018 http.cpp:874] Authorizing principal 'test-principal' to GET the
'/monitor/statistics.json' endpoint
I1212 02:37:11.513195 27012 slave.cpp:791] Agent terminating
[       OK ] Endpoint/SlaveEndpointTest.UnauthorizedRequest/1 (11 ms)
[ RUN      ] Endpoint/SlaveEndpointTest.UnauthorizedRequest/2
I1212 02:37:11.517951 27005 containerizer.cpp:220] Using isolation: posix/cpu,posix/mem,filesystem/posix,network/cni
W1212 02:37:11.518261 27005 backend.cpp:76] Failed to create 'aufs' backend: AufsBackend requires
root privileges, but is running as user mesos
W1212 02:37:11.518357 27005 backend.cpp:76] Failed to create 'bind' backend: BindBackend requires
root privileges
I1212 02:37:11.519410 27012 slave.cpp:209] Mesos agent started on (671)@172.17.0.2:41675
I1212 02:37:11.519430 27012 slave.cpp:210] Flags at startup: --acls="" --appc_simple_discovery_uri_prefix="http://"
--appc_store_dir="/tmp/mesos/store/appc" --authenticate_http_readonly="true" --authenticate_http_readwrite="true"
--authenticatee="crammd5" --authentication_backoff_factor="1secs" --authorizer="local" --cgroups_cpu_enable_pids_and_tids_count="false"
--cgroups_enable_cfs="false" --cgroups_hierarchy="/sys/fs/cgroup" --cgroups_limit_swap="false"
--cgroups_root="mesos" --container_disk_watch_interval="15secs" --containerizers="mesos" --credential="/tmp/Endpoint_SlaveEndpointTest_UnauthorizedRequest_2_4zjC2u/credential"
--default_role="*" --disk_watch_interval="1mins" --docker="docker" --docker_kill_orphans="true"
--docker_registry="https://registry-1.docker.io" --docker_remove_delay="6hrs" --docker_socket="/var/run/docker.sock"
--docker_stop_timeout="0ns" --docker_store_dir="/tmp/mesos/store/docker" --docker_volume_checkpoint_dir="/var/run/mesos/isolators/docker/volume"
--enforce_container_disk_quota="false" --executor_registration_timeout="1mins" --executor_shutdown_grace_period="5secs"
--fetcher_cache_dir="/tmp/Endpoint_SlaveEndpointTest_UnauthorizedRequest_2_4zjC2u/fetch" --fetcher_cache_size="2GB"
--frameworks_home="" --gc_delay="1weeks" --gc_disk_headroom="0.1" --hadoop_home="" --help="false"
--hostname_lookup="true" --http_authenticators="basic" --http_command_executor="false" --http_credentials="/tmp/Endpoint_SlaveEndpointTest_UnauthorizedRequest_2_4zjC2u/http_credentials"
--image_provisioner_backend="copy" --initialize_driver_logging="true" --io_switchboard_enable_server="true"
--isolation="posix/cpu,posix/mem" --launcher="posix" --launcher_dir="/mesos/build/src" --logbufsecs="0"
--logging_level="INFO" --max_completed_executors_per_framework="150" --oversubscribed_resources_interval="15secs"
--perf_duration="10secs" --perf_interval="1mins" --qos_correction_interval_min="0ns" --quiet="false"
--recover="reconnect" --recovery_timeout="15mins" --registration_backoff_factor="10ms" --resources="cpus:2;gpus:0;mem:1024;disk:1024;ports:[31000-32000]"
--revocable_cpu_low_priority="true" --runtime_dir="/tmp/Endpoint_SlaveEndpointTest_UnauthorizedRequest_2_4zjC2u"
--sandbox_directory="/mnt/mesos/sandbox" --strict="true" --switch_user="true" --systemd_enable_support="true"
--systemd_runtime_directory="/run/systemd/system" --version="false" --work_dir="/tmp/Endpoint_SlaveEndpointTest_UnauthorizedRequest_2_ByKSm4"
I1212 02:37:11.519860 27012 credentials.hpp:86] Loading credential for authentication from
'/tmp/Endpoint_SlaveEndpointTest_UnauthorizedRequest_2_4zjC2u/credential'
I1212 02:37:11.519964 27012 slave.cpp:347] Agent using credential for: test-principal
I1212 02:37:11.519981 27012 credentials.hpp:37] Loading credentials for authentication from
'/tmp/Endpoint_SlaveEndpointTest_UnauthorizedRequest_2_4zjC2u/http_credentials'
I1212 02:37:11.520102 27012 http.cpp:922] Using default 'basic' HTTP authenticator for realm
'mesos-agent-readonly'
I1212 02:37:11.520154 27012 http.cpp:922] Using default 'basic' HTTP authenticator for realm
'mesos-agent-readwrite'
I1212 02:37:11.520671 27012 slave.cpp:534] Agent resources: cpus(*):2; mem(*):1024; disk(*):1024;
ports(*):[31000-32000]
I1212 02:37:11.520716 27012 slave.cpp:542] Agent attributes: [  ]
I1212 02:37:11.520726 27012 slave.cpp:547] Agent hostname: dcd0d9e9de89
I1212 02:37:11.521117 27019 state.cpp:57] Recovering state from '/tmp/Endpoint_SlaveEndpointTest_UnauthorizedRequest_2_ByKSm4/meta'
I1212 02:37:11.521309 27006 status_update_manager.cpp:203] Recovering status update manager
I1212 02:37:11.521420 27013 containerizer.cpp:594] Recovering containerizer
I1212 02:37:11.521955 27019 provisioner.cpp:253] Provisioner recovery complete
I1212 02:37:11.522198 27019 slave.cpp:5415] Finished recovery
I1212 02:37:11.522619 27019 slave.cpp:5589] Querying resource estimator for oversubscribable
resources
I1212 02:37:11.522754 27016 slave.cpp:5603] Received oversubscribable resources {} from the
resource estimator
I1212 02:37:11.523432 27019 process.cpp:3679] Handling HTTP event for process 'slave(671)'
with path: '/slave(671)/containers'
I1212 02:37:11.523900 27008 http.cpp:874] Authorizing principal 'test-principal' to GET the
'/containers' endpoint
I1212 02:37:11.524828 27008 slave.cpp:791] Agent terminating
[       OK ] Endpoint/SlaveEndpointTest.UnauthorizedRequest/2 (11 ms)
[ RUN      ] Endpoint/SlaveEndpointTest.NoAuthorizer/0
I1212 02:37:11.529562 27005 containerizer.cpp:220] Using isolation: posix/cpu,posix/mem,filesystem/posix,network/cni
W1212 02:37:11.529881 27005 backend.cpp:76] Failed to create 'aufs' backend: AufsBackend requires
root privileges, but is running as user mesos
W1212 02:37:11.529958 27005 backend.cpp:76] Failed to create 'bind' backend: BindBackend requires
root privileges
I1212 02:37:11.530663 27005 cluster.cpp:446] Creating default 'local' authorizer
I1212 02:37:11.531183 27021 slave.cpp:209] Mesos agent started on (672)@172.17.0.2:41675
I1212 02:37:11.531203 27021 slave.cpp:210] Flags at startup: --acls="" --appc_simple_discovery_uri_prefix="http://"
--appc_store_dir="/tmp/mesos/store/appc" --authenticate_http_readonly="true" --authenticate_http_readwrite="true"
--authenticatee="crammd5" --authentication_backoff_factor="1secs" --authorizer="local" --cgroups_cpu_enable_pids_and_tids_count="false"
--cgroups_enable_cfs="false" --cgroups_hierarchy="/sys/fs/cgroup" --cgroups_limit_swap="false"
--cgroups_root="mesos" --container_disk_watch_interval="15secs" --containerizers="mesos" --credential="/tmp/Endpoint_SlaveEndpointTest_NoAuthorizer_0_YejVPd/credential"
--default_role="*" --disk_watch_interval="1mins" --docker="docker" --docker_kill_orphans="true"
--docker_registry="https://registry-1.docker.io" --docker_remove_delay="6hrs" --docker_socket="/var/run/docker.sock"
--docker_stop_timeout="0ns" --docker_store_dir="/tmp/mesos/store/docker" --docker_volume_checkpoint_dir="/var/run/mesos/isolators/docker/volume"
--enforce_container_disk_quota="false" --executor_registration_timeout="1mins" --executor_shutdown_grace_period="5secs"
--fetcher_cache_dir="/tmp/Endpoint_SlaveEndpointTest_NoAuthorizer_0_YejVPd/fetch" --fetcher_cache_size="2GB"
--frameworks_home="" --gc_delay="1weeks" --gc_disk_headroom="0.1" --hadoop_home="" --help="false"
--hostname_lookup="true" --http_authenticators="basic" --http_command_executor="false" --http_credentials="/tmp/Endpoint_SlaveEndpointTest_NoAuthorizer_0_YejVPd/http_credentials"
--image_provisioner_backend="copy" --initialize_driver_logging="true" --io_switchboard_enable_server="true"
--isolation="posix/cpu,posix/mem" --launcher="posix" --launcher_dir="/mesos/build/src" --logbufsecs="0"
--logging_level="INFO" --max_completed_executors_per_framework="150" --oversubscribed_resources_interval="15secs"
--perf_duration="10secs" --perf_interval="1mins" --qos_correction_interval_min="0ns" --quiet="false"
--recover="reconnect" --recovery_timeout="15mins" --registration_backoff_factor="10ms" --resources="cpus:2;gpus:0;mem:1024;disk:1024;ports:[31000-32000]"
--revocable_cpu_low_priority="true" --runtime_dir="/tmp/Endpoint_SlaveEndpointTest_NoAuthorizer_0_YejVPd"
--sandbox_directory="/mnt/mesos/sandbox" --strict="true" --switch_user="true" --systemd_enable_support="true"
--systemd_runtime_directory="/run/systemd/system" --version="false" --work_dir="/tmp/Endpoint_SlaveEndpointTest_NoAuthorizer_0_9tIj8M"
I1212 02:37:11.531556 27021 credentials.hpp:86] Loading credential for authentication from
'/tmp/Endpoint_SlaveEndpointTest_NoAuthorizer_0_YejVPd/credential'
I1212 02:37:11.531663 27021 slave.cpp:347] Agent using credential for: test-principal
I1212 02:37:11.531678 27021 credentials.hpp:37] Loading credentials for authentication from
'/tmp/Endpoint_SlaveEndpointTest_NoAuthorizer_0_YejVPd/http_credentials'
I1212 02:37:11.531797 27021 http.cpp:922] Using default 'basic' HTTP authenticator for realm
'mesos-agent-readonly'
I1212 02:37:11.531852 27021 http.cpp:922] Using default 'basic' HTTP authenticator for realm
'mesos-agent-readwrite'
I1212 02:37:11.532222 27021 slave.cpp:534] Agent resources: cpus(*):2; mem(*):1024; disk(*):1024;
ports(*):[31000-32000]
I1212 02:37:11.532258 27021 slave.cpp:542] Agent attributes: [  ]
I1212 02:37:11.532268 27021 slave.cpp:547] Agent hostname: dcd0d9e9de89
I1212 02:37:11.532631 27014 state.cpp:57] Recovering state from '/tmp/Endpoint_SlaveEndpointTest_NoAuthorizer_0_9tIj8M/meta'
I1212 02:37:11.532795 27008 status_update_manager.cpp:203] Recovering status update manager
I1212 02:37:11.532985 27018 containerizer.cpp:594] Recovering containerizer
I1212 02:37:11.533574 27020 provisioner.cpp:253] Provisioner recovery complete
I1212 02:37:11.533807 27012 slave.cpp:5415] Finished recovery
I1212 02:37:11.534147 27012 slave.cpp:5589] Querying resource estimator for oversubscribable
resources
I1212 02:37:11.534263 27010 slave.cpp:5603] Received oversubscribable resources {} from the
resource estimator
I1212 02:37:11.534950 27014 process.cpp:3679] Handling HTTP event for process 'slave(672)'
with path: '/slave(672)/monitor/statistics'
I1212 02:37:11.535429 27021 http.cpp:874] Authorizing principal 'test-principal' to GET the
'/monitor/statistics' endpoint
I1212 02:37:11.536602 27016 slave.cpp:791] Agent terminating
[       OK ] Endpoint/SlaveEndpointTest.NoAuthorizer/0 (12 ms)
[ RUN      ] Endpoint/SlaveEndpointTest.NoAuthorizer/1
I1212 02:37:11.541666 27005 containerizer.cpp:220] Using isolation: posix/cpu,posix/mem,filesystem/posix,network/cni
W1212 02:37:11.541942 27005 backend.cpp:76] Failed to create 'aufs' backend: AufsBackend requires
root privileges, but is running as user mesos
W1212 02:37:11.542024 27005 backend.cpp:76] Failed to create 'bind' backend: BindBackend requires
root privileges
I1212 02:37:11.542675 27005 cluster.cpp:446] Creating default 'local' authorizer
I1212 02:37:11.543115 27010 slave.cpp:209] Mesos agent started on (673)@172.17.0.2:41675
I1212 02:37:11.543130 27010 slave.cpp:210] Flags at startup: --acls="" --appc_simple_discovery_uri_prefix="http://"
--appc_store_dir="/tmp/mesos/store/appc" --authenticate_http_readonly="true" --authenticate_http_readwrite="true"
--authenticatee="crammd5" --authentication_backoff_factor="1secs" --authorizer="local" --cgroups_cpu_enable_pids_and_tids_count="false"
--cgroups_enable_cfs="false" --cgroups_hierarchy="/sys/fs/cgroup" --cgroups_limit_swap="false"
--cgroups_root="mesos" --container_disk_watch_interval="15secs" --containerizers="mesos" --credential="/tmp/Endpoint_SlaveEndpointTest_NoAuthorizer_1_QzFVKW/credential"
--default_role="*" --disk_watch_interval="1mins" --docker="docker" --docker_kill_orphans="true"
--docker_registry="https://registry-1.docker.io" --docker_remove_delay="6hrs" --docker_socket="/var/run/docker.sock"
--docker_stop_timeout="0ns" --docker_store_dir="/tmp/mesos/store/docker" --docker_volume_checkpoint_dir="/var/run/mesos/isolators/docker/volume"
--enforce_container_disk_quota="false" --executor_registration_timeout="1mins" --executor_shutdown_grace_period="5secs"
--fetcher_cache_dir="/tmp/Endpoint_SlaveEndpointTest_NoAuthorizer_1_QzFVKW/fetch" --fetcher_cache_size="2GB"
--frameworks_home="" --gc_delay="1weeks" --gc_disk_headroom="0.1" --hadoop_home="" --help="false"
--hostname_lookup="true" --http_authenticators="basic" --http_command_executor="false" --http_credentials="/tmp/Endpoint_SlaveEndpointTest_NoAuthorizer_1_QzFVKW/http_credentials"
--image_provisioner_backend="copy" --initialize_driver_logging="true" --io_switchboard_enable_server="true"
--isolation="posix/cpu,posix/mem" --launcher="posix" --launcher_dir="/mesos/build/src" --logbufsecs="0"
--logging_level="INFO" --max_completed_executors_per_framework="150" --oversubscribed_resources_interval="15secs"
--perf_duration="10secs" --perf_interval="1mins" --qos_correction_interval_min="0ns" --quiet="false"
--recover="reconnect" --recovery_timeout="15mins" --registration_backoff_factor="10ms" --resources="cpus:2;gpus:0;mem:1024;disk:1024;ports:[31000-32000]"
--revocable_cpu_low_priority="true" --runtime_dir="/tmp/Endpoint_SlaveEndpointTest_NoAuthorizer_1_QzFVKW"
--sandbox_directory="/mnt/mesos/sandbox" --strict="true" --switch_user="true" --systemd_enable_support="true"
--systemd_runtime_directory="/run/systemd/system" --version="false" --work_dir="/tmp/Endpoint_SlaveEndpointTest_NoAuthorizer_1_L2Bn1v"
I1212 02:37:11.543440 27010 credentials.hpp:86] Loading credential for authentication from
'/tmp/Endpoint_SlaveEndpointTest_NoAuthorizer_1_QzFVKW/credential'
I1212 02:37:11.543519 27010 slave.cpp:347] Agent using credential for: test-principal
I1212 02:37:11.543536 27010 credentials.hpp:37] Loading credentials for authentication from
'/tmp/Endpoint_SlaveEndpointTest_NoAuthorizer_1_QzFVKW/http_credentials'
I1212 02:37:11.543673 27010 http.cpp:922] Using default 'basic' HTTP authenticator for realm
'mesos-agent-readonly'
I1212 02:37:11.543720 27010 http.cpp:922] Using default 'basic' HTTP authenticator for realm
'mesos-agent-readwrite'
I1212 02:37:11.544034 27010 slave.cpp:534] Agent resources: cpus(*):2; mem(*):1024; disk(*):1024;
ports(*):[31000-32000]
I1212 02:37:11.544070 27010 slave.cpp:542] Agent attributes: [  ]
I1212 02:37:11.544080 27010 slave.cpp:547] Agent hostname: dcd0d9e9de89
I1212 02:37:11.544530 27008 state.cpp:57] Recovering state from '/tmp/Endpoint_SlaveEndpointTest_NoAuthorizer_1_L2Bn1v/meta'
I1212 02:37:11.544649 27017 status_update_manager.cpp:203] Recovering status update manager
I1212 02:37:11.544775 27015 containerizer.cpp:594] Recovering containerizer
I1212 02:37:11.545284 27007 provisioner.cpp:253] Provisioner recovery complete
I1212 02:37:11.545507 27011 slave.cpp:5415] Finished recovery
I1212 02:37:11.545850 27011 slave.cpp:5589] Querying resource estimator for oversubscribable
resources
I1212 02:37:11.545946 27012 slave.cpp:5603] Received oversubscribable resources {} from the
resource estimator
I1212 02:37:11.546550 27015 process.cpp:3679] Handling HTTP event for process 'slave(673)'
with path: '/slave(673)/monitor/statistics.json'
I1212 02:37:11.546988 27020 http.cpp:874] Authorizing principal 'test-principal' to GET the
'/monitor/statistics.json' endpoint
I1212 02:37:11.548439 27019 slave.cpp:791] Agent terminating
[       OK ] Endpoint/SlaveEndpointTest.NoAuthorizer/1 (11 ms)
[ RUN      ] Endpoint/SlaveEndpointTest.NoAuthorizer/2
I1212 02:37:11.553038 27005 containerizer.cpp:220] Using isolation: posix/cpu,posix/mem,filesystem/posix,network/cni
W1212 02:37:11.553315 27005 backend.cpp:76] Failed to create 'aufs' backend: AufsBackend requires
root privileges, but is running as user mesos
W1212 02:37:11.553388 27005 backend.cpp:76] Failed to create 'bind' backend: BindBackend requires
root privileges
I1212 02:37:11.553973 27005 cluster.cpp:446] Creating default 'local' authorizer
I1212 02:37:11.554455 27017 slave.cpp:209] Mesos agent started on (674)@172.17.0.2:41675
I1212 02:37:11.554471 27017 slave.cpp:210] Flags at startup: --acls="" --appc_simple_discovery_uri_prefix="http://"
--appc_store_dir="/tmp/mesos/store/appc" --authenticate_http_readonly="true" --authenticate_http_readwrite="true"
--authenticatee="crammd5" --authentication_backoff_factor="1secs" --authorizer="local" --cgroups_cpu_enable_pids_and_tids_count="false"
--cgroups_enable_cfs="false" --cgroups_hierarchy="/sys/fs/cgroup" --cgroups_limit_swap="false"
--cgroups_root="mesos" --container_disk_watch_interval="15secs" --containerizers="mesos" --credential="/tmp/Endpoint_SlaveEndpointTest_NoAuthorizer_2_A7urNF/credential"
--default_role="*" --disk_watch_interval="1mins" --docker="docker" --docker_kill_orphans="true"
--docker_registry="https://registry-1.docker.io" --docker_remove_delay="6hrs" --docker_socket="/var/run/docker.sock"
--docker_stop_timeout="0ns" --docker_store_dir="/tmp/mesos/store/docker" --docker_volume_checkpoint_dir="/var/run/mesos/isolators/docker/volume"
--enforce_container_disk_quota="false" --executor_registration_timeout="1mins" --executor_shutdown_grace_period="5secs"
--fetcher_cache_dir="/tmp/Endpoint_SlaveEndpointTest_NoAuthorizer_2_A7urNF/fetch" --fetcher_cache_size="2GB"
--frameworks_home="" --gc_delay="1weeks" --gc_disk_headroom="0.1" --hadoop_home="" --help="false"
--hostname_lookup="true" --http_authenticators="basic" --http_command_executor="false" --http_credentials="/tmp/Endpoint_SlaveEndpointTest_NoAuthorizer_2_A7urNF/http_credentials"
--image_provisioner_backend="copy" --initialize_driver_logging="true" --io_switchboard_enable_server="true"
--isolation="posix/cpu,posix/mem" --launcher="posix" --launcher_dir="/mesos/build/src" --logbufsecs="0"
--logging_level="INFO" --max_completed_executors_per_framework="150" --oversubscribed_resources_interval="15secs"
--perf_duration="10secs" --perf_interval="1mins" --qos_correction_interval_min="0ns" --quiet="false"
--recover="reconnect" --recovery_timeout="15mins" --registration_backoff_factor="10ms" --resources="cpus:2;gpus:0;mem:1024;disk:1024;ports:[31000-32000]"
--revocable_cpu_low_priority="true" --runtime_dir="/tmp/Endpoint_SlaveEndpointTest_NoAuthorizer_2_A7urNF"
--sandbox_directory="/mnt/mesos/sandbox" --strict="true" --switch_user="true" --systemd_enable_support="true"
--systemd_runtime_directory="/run/systemd/system" --version="false" --work_dir="/tmp/Endpoint_SlaveEndpointTest_NoAuthorizer_2_h2x11e"
I1212 02:37:11.554824 27017 credentials.hpp:86] Loading credential for authentication from
'/tmp/Endpoint_SlaveEndpointTest_NoAuthorizer_2_A7urNF/credential'
I1212 02:37:11.554910 27017 slave.cpp:347] Agent using credential for: test-principal
I1212 02:37:11.554924 27017 credentials.hpp:37] Loading credentials for authentication from
'/tmp/Endpoint_SlaveEndpointTest_NoAuthorizer_2_A7urNF/http_credentials'
I1212 02:37:11.555029 27017 http.cpp:922] Using default 'basic' HTTP authenticator for realm
'mesos-agent-readonly'
I1212 02:37:11.555088 27017 http.cpp:922] Using default 'basic' HTTP authenticator for realm
'mesos-agent-readwrite'
I1212 02:37:11.555367 27017 slave.cpp:534] Agent resources: cpus(*):2; mem(*):1024; disk(*):1024;
ports(*):[31000-32000]
I1212 02:37:11.555402 27017 slave.cpp:542] Agent attributes: [  ]
I1212 02:37:11.555408 27017 slave.cpp:547] Agent hostname: dcd0d9e9de89
I1212 02:37:11.555811 27007 state.cpp:57] Recovering state from '/tmp/Endpoint_SlaveEndpointTest_NoAuthorizer_2_h2x11e/meta'
I1212 02:37:11.555935 27007 status_update_manager.cpp:203] Recovering status update manager
I1212 02:37:11.556023 27014 containerizer.cpp:594] Recovering containerizer
I1212 02:37:11.556617 27016 provisioner.cpp:253] Provisioner recovery complete
I1212 02:37:11.556835 27013 slave.cpp:5415] Finished recovery
I1212 02:37:11.557262 27013 slave.cpp:5589] Querying resource estimator for oversubscribable
resources
I1212 02:37:11.557401 27011 slave.cpp:5603] Received oversubscribable resources {} from the
resource estimator
I1212 02:37:11.558053 27014 process.cpp:3679] Handling HTTP event for process 'slave(674)'
with path: '/slave(674)/containers'
I1212 02:37:11.558465 27018 http.cpp:874] Authorizing principal 'test-principal' to GET the
'/containers' endpoint
I1212 02:37:11.559547 27009 slave.cpp:791] Agent terminating
[       OK ] Endpoint/SlaveEndpointTest.NoAuthorizer/2 (10 ms)
[----------] 9 tests from Endpoint/SlaveEndpointTest (102 ms total)

[----------] Global test environment tear-down
[==========] 1384 tests from 158 test cases ran. (247752 ms total)
[  PASSED  ] 1383 tests.
[  FAILED  ] 1 test, listed below:
[  FAILED  ] DiskResource/PersistentVolumeTest.SharedPersistentVolumeMasterFailover/1, where
GetParam() = 1

 1 FAILED TEST
  YOU HAVE 9 DISABLED TESTS

Inconsistency detected by ld.so: dl-close.c: 762: _dl_close: Assertion `map->l_init_called'
failed!
make[3]: *** [CMakeFiles/check] Error 127
make[3]: Leaving directory `/mesos/build'
make[2]: *** [CMakeFiles/check.dir/all] Error 2
make[2]: Leaving directory `/mesos/build'
make[1]: *** [CMakeFiles/check.dir/rule] Error 2
make[1]: Leaving directory `/mesos/build'
make: *** [check] Error 2
+ docker rmi mesos-1481507289-21259
Untagged: mesos-1481507289-21259:latest
Deleted: sha256:9df5908931eef2246693adbb9aaa315b44701e326670d1bfd777da712dacd888
Deleted: sha256:c71003a09ae3887ffc76604e057370f1b9a1d029a807c33dcafa64bbf2c755e1
Deleted: sha256:61d495170af416ef37c3f842366684eef558ad6200abcc7951fa7fdf50036cc0
Deleted: sha256:bb4fdb31beccac26497e26d28753635cbfca63bc46a9ac98983eb171f689ffbe
Deleted: sha256:28b173eacde8dfae94bf3a18464febb47f8632c7cdeb73c15db7fa25186370c6
Deleted: sha256:75e878bac5e0805f060953d62740392fd7e7d26f17b2802442974556d5ba41d0
Deleted: sha256:44a68ea09bdbb983053bc51e69b01165ea6dcfca70e794cc67b96d748a0abf47
Deleted: sha256:f3c86e504c22e379c3e447dfa7b70748efe13cbd4141dd3822389a0d9af329bb
Deleted: sha256:b56ef43c0949ad08512c7ccedf04b84c2ecadb3075e18324f417c2b0e1b446dd
Deleted: sha256:32a5e6b6a64ee618068bfcd6896f510ce70294a42e68bd273968d63fdc93f469
Deleted: sha256:d4987413f63af61e0e0e37db1a68616f115335366c87682f30715bdeedcb5205
Deleted: sha256:afe3ee379df3c6c93fdfdcc42a44baf5222c561cfe93171d5ce98186e0438753
Deleted: sha256:ffd7f873d68fcb79e020f8129e9cadf44cb37b1da0471b111ac5be53de6429aa
Deleted: sha256:72acc2a4068630b523a8a6ac7bebc1c8e2cfeb84402f62895735e6541b5184f7
Deleted: sha256:025598f73730e9c394e89af1131c49b69b8138fb4d979fa031f25f77629a2eae
Deleted: sha256:4d03af6515cfff3a0ae77712699c59875ba6769992f0542b13a1e4d541e00f30
Deleted: sha256:cf72e31f53ccd1d8c1c9eee9564698a7be3bc402a9ce9bb5afadb381ae094f9f
Deleted: sha256:29bc727a112755bd2161f5ac6b18130883e6382d7d85a58f5ac187ac4e1ff885
Deleted: sha256:8927f6b599cfa3830231fb2d0732234078bfd2b0c10a9102d749231de7868c18
Deleted: sha256:abff95e6655a042242811528497259b344067cbaf8ea11630ba7ed6ad00e34c4
Deleted: sha256:42c437443eca691e5d4fd28f6ce38ff6f02c62f4f91a141850228af45d2735f3
Deleted: sha256:b7827a70f1d0dd8780dde08f5d1e44e3f4b3b39a48218c70822f45e2e7879cec
Deleted: sha256:e81842a6a5f631d48dcb6f115ea3a5323edeaa1f96475ee15b5c039ab82a3c46
Deleted: sha256:5bf918833ffaf707606a61a8b595238f9f42894869e09cdce1f606ccf060e629
Build step 'Execute shell' marked build as failure

Mime
View raw message