mesos-builds mailing list archives

Site index · List index
Message view « Date » · « Thread »
Top « Date » · « Thread »
From Apache Jenkins Server <jenk...@builds.apache.org>
Subject Build failed in Jenkins: Mesos » cmake,clang,--verbose,GLOG_v=1 MESOS_VERBOSE=1,ubuntu:14.04,(docker||Hadoop)&&(!ubuntu-us1)&&(!ubuntu-6)&&(!ubuntu-eu2) #3040
Date Fri, 16 Dec 2016 01:04:57 GMT
See <https://builds.apache.org/job/Mesos/BUILDTOOL=cmake,COMPILER=clang,CONFIGURATION=--verbose,ENVIRONMENT=GLOG_v=1%20MESOS_VERBOSE=1,OS=ubuntu%3A14.04,label_exp=(docker%7C%7CHadoop)&&(!ubuntu-us1)&&(!ubuntu-6)&&(!ubuntu-eu2)/3040/changes>

Changes:

[mpark] Specified that we search for the query parameter in the request body.

[josephwu] Fixed builds with HAS_AUTHENTICATION=false.

[josephwu] Windows: Added `recordio_tests.cpp` to test build.

[josephwu] Windows: Added Mesos tests to the build helper.

[josephwu] Windows: Disambiguated `os::write` by adding another overload.

------------------------------------------
[...truncated 161466 lines...]
[       OK ] Endpoint/SlaveEndpointTest.AuthorizedRequest/0 (12 ms)
[ RUN      ] Endpoint/SlaveEndpointTest.AuthorizedRequest/1
I1216 01:04:08.398223 24719 containerizer.cpp:220] Using isolation: posix/cpu,posix/mem,filesystem/posix,network/cni
W1216 01:04:08.398495 24719 backend.cpp:76] Failed to create 'aufs' backend: AufsBackend requires
root privileges, but is running as user mesos
W1216 01:04:08.398591 24719 backend.cpp:76] Failed to create 'bind' backend: BindBackend requires
root privileges
I1216 01:04:08.399605 24722 slave.cpp:209] Mesos agent started on (667)@172.17.0.3:37755
I1216 01:04:08.399631 24722 slave.cpp:210] Flags at startup: --acls="" --appc_simple_discovery_uri_prefix="http://"
--appc_store_dir="/tmp/mesos/store/appc" --authenticate_http_readonly="true" --authenticate_http_readwrite="true"
--authenticatee="crammd5" --authentication_backoff_factor="1secs" --authorizer="local" --cgroups_cpu_enable_pids_and_tids_count="false"
--cgroups_enable_cfs="false" --cgroups_hierarchy="/sys/fs/cgroup" --cgroups_limit_swap="false"
--cgroups_root="mesos" --container_disk_watch_interval="15secs" --containerizers="mesos" --credential="/tmp/Endpoint_SlaveEndpointTest_AuthorizedRequest_1_BWfyin/credential"
--default_role="*" --disk_watch_interval="1mins" --docker="docker" --docker_kill_orphans="true"
--docker_registry="https://registry-1.docker.io" --docker_remove_delay="6hrs" --docker_socket="/var/run/docker.sock"
--docker_stop_timeout="0ns" --docker_store_dir="/tmp/mesos/store/docker" --docker_volume_checkpoint_dir="/var/run/mesos/isolators/docker/volume"
--enforce_container_disk_quota="false" --executor_registration_timeout="1mins" --executor_shutdown_grace_period="5secs"
--fetcher_cache_dir="/tmp/Endpoint_SlaveEndpointTest_AuthorizedRequest_1_BWfyin/fetch" --fetcher_cache_size="2GB"
--frameworks_home="" --gc_delay="1weeks" --gc_disk_headroom="0.1" --hadoop_home="" --help="false"
--hostname_lookup="true" --http_authenticators="basic" --http_command_executor="false" --http_credentials="/tmp/Endpoint_SlaveEndpointTest_AuthorizedRequest_1_BWfyin/http_credentials"
--http_heartbeat_interval="30secs" --image_provisioner_backend="copy" --initialize_driver_logging="true"
--isolation="posix/cpu,posix/mem" --launcher="posix" --launcher_dir="/mesos/build/src" --logbufsecs="0"
--logging_level="INFO" --max_completed_executors_per_framework="150" --oversubscribed_resources_interval="15secs"
--perf_duration="10secs" --perf_interval="1mins" --qos_correction_interval_min="0ns" --quiet="false"
--recover="reconnect" --recovery_timeout="15mins" --registration_backoff_factor="10ms" --resources="cpus:2;gpus:0;mem:1024;disk:1024;ports:[31000-32000]"
--revocable_cpu_low_priority="true" --runtime_dir="/tmp/Endpoint_SlaveEndpointTest_AuthorizedRequest_1_BWfyin"
--sandbox_directory="/mnt/mesos/sandbox" --strict="true" --switch_user="true" --systemd_enable_support="true"
--systemd_runtime_directory="/run/systemd/system" --version="false" --work_dir="/tmp/Endpoint_SlaveEndpointTest_AuthorizedRequest_1_s1HuI2"
I1216 01:04:08.399976 24722 credentials.hpp:86] Loading credential for authentication from
'/tmp/Endpoint_SlaveEndpointTest_AuthorizedRequest_1_BWfyin/credential'
I1216 01:04:08.400058 24722 slave.cpp:352] Agent using credential for: test-principal
I1216 01:04:08.400071 24722 credentials.hpp:37] Loading credentials for authentication from
'/tmp/Endpoint_SlaveEndpointTest_AuthorizedRequest_1_BWfyin/http_credentials'
I1216 01:04:08.400180 24722 http.cpp:922] Using default 'basic' HTTP authenticator for realm
'mesos-agent-readonly'
I1216 01:04:08.400225 24722 http.cpp:922] Using default 'basic' HTTP authenticator for realm
'mesos-agent-readwrite'
I1216 01:04:08.400539 24722 slave.cpp:539] Agent resources: cpus(*):2; mem(*):1024; disk(*):1024;
ports(*):[31000-32000]
I1216 01:04:08.400569 24722 slave.cpp:547] Agent attributes: [  ]
I1216 01:04:08.400578 24722 slave.cpp:552] Agent hostname: 7fad9404d1e8
I1216 01:04:08.400970 24731 state.cpp:57] Recovering state from '/tmp/Endpoint_SlaveEndpointTest_AuthorizedRequest_1_s1HuI2/meta'
I1216 01:04:08.401094 24724 status_update_manager.cpp:203] Recovering status update manager
I1216 01:04:08.401195 24731 containerizer.cpp:594] Recovering containerizer
I1216 01:04:08.401825 24735 provisioner.cpp:253] Provisioner recovery complete
I1216 01:04:08.402017 24725 slave.cpp:5408] Finished recovery
I1216 01:04:08.402362 24725 slave.cpp:5582] Querying resource estimator for oversubscribable
resources
I1216 01:04:08.402560 24726 slave.cpp:5596] Received oversubscribable resources {} from the
resource estimator
I1216 01:04:08.403059 24731 process.cpp:3679] Handling HTTP event for process 'slave(667)'
with path: '/slave(667)/monitor/statistics.json'
I1216 01:04:08.403517 24725 http.cpp:874] Authorizing principal 'test-principal' to GET the
'/monitor/statistics.json' endpoint
I1216 01:04:08.404853 24728 slave.cpp:796] Agent terminating
[       OK ] Endpoint/SlaveEndpointTest.AuthorizedRequest/1 (10 ms)
[ RUN      ] Endpoint/SlaveEndpointTest.AuthorizedRequest/2
I1216 01:04:08.409092 24719 containerizer.cpp:220] Using isolation: posix/cpu,posix/mem,filesystem/posix,network/cni
W1216 01:04:08.409345 24719 backend.cpp:76] Failed to create 'aufs' backend: AufsBackend requires
root privileges, but is running as user mesos
W1216 01:04:08.409430 24719 backend.cpp:76] Failed to create 'bind' backend: BindBackend requires
root privileges
I1216 01:04:08.410632 24724 slave.cpp:209] Mesos agent started on (668)@172.17.0.3:37755
I1216 01:04:08.410696 24724 slave.cpp:210] Flags at startup: --acls="" --appc_simple_discovery_uri_prefix="http://"
--appc_store_dir="/tmp/mesos/store/appc" --authenticate_http_readonly="true" --authenticate_http_readwrite="true"
--authenticatee="crammd5" --authentication_backoff_factor="1secs" --authorizer="local" --cgroups_cpu_enable_pids_and_tids_count="false"
--cgroups_enable_cfs="false" --cgroups_hierarchy="/sys/fs/cgroup" --cgroups_limit_swap="false"
--cgroups_root="mesos" --container_disk_watch_interval="15secs" --containerizers="mesos" --credential="/tmp/Endpoint_SlaveEndpointTest_AuthorizedRequest_2_HKWLIH/credential"
--default_role="*" --disk_watch_interval="1mins" --docker="docker" --docker_kill_orphans="true"
--docker_registry="https://registry-1.docker.io" --docker_remove_delay="6hrs" --docker_socket="/var/run/docker.sock"
--docker_stop_timeout="0ns" --docker_store_dir="/tmp/mesos/store/docker" --docker_volume_checkpoint_dir="/var/run/mesos/isolators/docker/volume"
--enforce_container_disk_quota="false" --executor_registration_timeout="1mins" --executor_shutdown_grace_period="5secs"
--fetcher_cache_dir="/tmp/Endpoint_SlaveEndpointTest_AuthorizedRequest_2_HKWLIH/fetch" --fetcher_cache_size="2GB"
--frameworks_home="" --gc_delay="1weeks" --gc_disk_headroom="0.1" --hadoop_home="" --help="false"
--hostname_lookup="true" --http_authenticators="basic" --http_command_executor="false" --http_credentials="/tmp/Endpoint_SlaveEndpointTest_AuthorizedRequest_2_HKWLIH/http_credentials"
--http_heartbeat_interval="30secs" --image_provisioner_backend="copy" --initialize_driver_logging="true"
--isolation="posix/cpu,posix/mem" --launcher="posix" --launcher_dir="/mesos/build/src" --logbufsecs="0"
--logging_level="INFO" --max_completed_executors_per_framework="150" --oversubscribed_resources_interval="15secs"
--perf_duration="10secs" --perf_interval="1mins" --qos_correction_interval_min="0ns" --quiet="false"
--recover="reconnect" --recovery_timeout="15mins" --registration_backoff_factor="10ms" --resources="cpus:2;gpus:0;mem:1024;disk:1024;ports:[31000-32000]"
--revocable_cpu_low_priority="true" --runtime_dir="/tmp/Endpoint_SlaveEndpointTest_AuthorizedRequest_2_HKWLIH"
--sandbox_directory="/mnt/mesos/sandbox" --strict="true" --switch_user="true" --systemd_enable_support="true"
--systemd_runtime_directory="/run/systemd/system" --version="false" --work_dir="/tmp/Endpoint_SlaveEndpointTest_AuthorizedRequest_2_WgEW6m"
I1216 01:04:08.411016 24724 credentials.hpp:86] Loading credential for authentication from
'/tmp/Endpoint_SlaveEndpointTest_AuthorizedRequest_2_HKWLIH/credential'
I1216 01:04:08.411145 24724 slave.cpp:352] Agent using credential for: test-principal
I1216 01:04:08.411159 24724 credentials.hpp:37] Loading credentials for authentication from
'/tmp/Endpoint_SlaveEndpointTest_AuthorizedRequest_2_HKWLIH/http_credentials'
I1216 01:04:08.411267 24724 http.cpp:922] Using default 'basic' HTTP authenticator for realm
'mesos-agent-readonly'
I1216 01:04:08.411314 24724 http.cpp:922] Using default 'basic' HTTP authenticator for realm
'mesos-agent-readwrite'
I1216 01:04:08.411695 24724 slave.cpp:539] Agent resources: cpus(*):2; mem(*):1024; disk(*):1024;
ports(*):[31000-32000]
I1216 01:04:08.411727 24724 slave.cpp:547] Agent attributes: [  ]
I1216 01:04:08.411736 24724 slave.cpp:552] Agent hostname: 7fad9404d1e8
I1216 01:04:08.412106 24725 state.cpp:57] Recovering state from '/tmp/Endpoint_SlaveEndpointTest_AuthorizedRequest_2_WgEW6m/meta'
I1216 01:04:08.412294 24724 status_update_manager.cpp:203] Recovering status update manager
I1216 01:04:08.412464 24726 containerizer.cpp:594] Recovering containerizer
I1216 01:04:08.413075 24729 provisioner.cpp:253] Provisioner recovery complete
I1216 01:04:08.413324 24733 slave.cpp:5408] Finished recovery
I1216 01:04:08.413697 24733 slave.cpp:5582] Querying resource estimator for oversubscribable
resources
I1216 01:04:08.413815 24729 slave.cpp:5596] Received oversubscribable resources {} from the
resource estimator
I1216 01:04:08.414351 24733 process.cpp:3679] Handling HTTP event for process 'slave(668)'
with path: '/slave(668)/containers'
I1216 01:04:08.414763 24727 http.cpp:874] Authorizing principal 'test-principal' to GET the
'/containers' endpoint
I1216 01:04:08.416291 24719 slave.cpp:796] Agent terminating
[       OK ] Endpoint/SlaveEndpointTest.AuthorizedRequest/2 (11 ms)
[ RUN      ] Endpoint/SlaveEndpointTest.UnauthorizedRequest/0
I1216 01:04:08.420423 24719 containerizer.cpp:220] Using isolation: posix/cpu,posix/mem,filesystem/posix,network/cni
W1216 01:04:08.420704 24719 backend.cpp:76] Failed to create 'aufs' backend: AufsBackend requires
root privileges, but is running as user mesos
W1216 01:04:08.420768 24719 backend.cpp:76] Failed to create 'bind' backend: BindBackend requires
root privileges
I1216 01:04:08.421835 24733 slave.cpp:209] Mesos agent started on (669)@172.17.0.3:37755
I1216 01:04:08.421861 24733 slave.cpp:210] Flags at startup: --acls="" --appc_simple_discovery_uri_prefix="http://"
--appc_store_dir="/tmp/mesos/store/appc" --authenticate_http_readonly="true" --authenticate_http_readwrite="true"
--authenticatee="crammd5" --authentication_backoff_factor="1secs" --authorizer="local" --cgroups_cpu_enable_pids_and_tids_count="false"
--cgroups_enable_cfs="false" --cgroups_hierarchy="/sys/fs/cgroup" --cgroups_limit_swap="false"
--cgroups_root="mesos" --container_disk_watch_interval="15secs" --containerizers="mesos" --credential="/tmp/Endpoint_SlaveEndpointTest_UnauthorizedRequest_0_5ubmg2/credential"
--default_role="*" --disk_watch_interval="1mins" --docker="docker" --docker_kill_orphans="true"
--docker_registry="https://registry-1.docker.io" --docker_remove_delay="6hrs" --docker_socket="/var/run/docker.sock"
--docker_stop_timeout="0ns" --docker_store_dir="/tmp/mesos/store/docker" --docker_volume_checkpoint_dir="/var/run/mesos/isolators/docker/volume"
--enforce_container_disk_quota="false" --executor_registration_timeout="1mins" --executor_shutdown_grace_period="5secs"
--fetcher_cache_dir="/tmp/Endpoint_SlaveEndpointTest_UnauthorizedRequest_0_5ubmg2/fetch" --fetcher_cache_size="2GB"
--frameworks_home="" --gc_delay="1weeks" --gc_disk_headroom="0.1" --hadoop_home="" --help="false"
--hostname_lookup="true" --http_authenticators="basic" --http_command_executor="false" --http_credentials="/tmp/Endpoint_SlaveEndpointTest_UnauthorizedRequest_0_5ubmg2/http_credentials"
--http_heartbeat_interval="30secs" --image_provisioner_backend="copy" --initialize_driver_logging="true"
--isolation="posix/cpu,posix/mem" --launcher="posix" --launcher_dir="/mesos/build/src" --logbufsecs="0"
--logging_level="INFO" --max_completed_executors_per_framework="150" --oversubscribed_resources_interval="15secs"
--perf_duration="10secs" --perf_interval="1mins" --qos_correction_interval_min="0ns" --quiet="false"
--recover="reconnect" --recovery_timeout="15mins" --registration_backoff_factor="10ms" --resources="cpus:2;gpus:0;mem:1024;disk:1024;ports:[31000-32000]"
--revocable_cpu_low_priority="true" --runtime_dir="/tmp/Endpoint_SlaveEndpointTest_UnauthorizedRequest_0_5ubmg2"
--sandbox_directory="/mnt/mesos/sandbox" --strict="true" --switch_user="true" --systemd_enable_support="true"
--systemd_runtime_directory="/run/systemd/system" --version="false" --work_dir="/tmp/Endpoint_SlaveEndpointTest_UnauthorizedRequest_0_sXJGCH"
I1216 01:04:08.422147 24733 credentials.hpp:86] Loading credential for authentication from
'/tmp/Endpoint_SlaveEndpointTest_UnauthorizedRequest_0_5ubmg2/credential'
I1216 01:04:08.422209 24733 slave.cpp:352] Agent using credential for: test-principal
I1216 01:04:08.422224 24733 credentials.hpp:37] Loading credentials for authentication from
'/tmp/Endpoint_SlaveEndpointTest_UnauthorizedRequest_0_5ubmg2/http_credentials'
I1216 01:04:08.422308 24733 http.cpp:922] Using default 'basic' HTTP authenticator for realm
'mesos-agent-readonly'
I1216 01:04:08.422353 24733 http.cpp:922] Using default 'basic' HTTP authenticator for realm
'mesos-agent-readwrite'
I1216 01:04:08.422646 24733 slave.cpp:539] Agent resources: cpus(*):2; mem(*):1024; disk(*):1024;
ports(*):[31000-32000]
I1216 01:04:08.422677 24733 slave.cpp:547] Agent attributes: [  ]
I1216 01:04:08.422685 24733 slave.cpp:552] Agent hostname: 7fad9404d1e8
I1216 01:04:08.423126 24728 state.cpp:57] Recovering state from '/tmp/Endpoint_SlaveEndpointTest_UnauthorizedRequest_0_sXJGCH/meta'
I1216 01:04:08.423326 24731 status_update_manager.cpp:203] Recovering status update manager
I1216 01:04:08.423571 24725 containerizer.cpp:594] Recovering containerizer
I1216 01:04:08.424204 24732 provisioner.cpp:253] Provisioner recovery complete
I1216 01:04:08.424468 24734 slave.cpp:5408] Finished recovery
I1216 01:04:08.424834 24734 slave.cpp:5582] Querying resource estimator for oversubscribable
resources
I1216 01:04:08.424959 24728 slave.cpp:5596] Received oversubscribable resources {} from the
resource estimator
I1216 01:04:08.425542 24729 process.cpp:3679] Handling HTTP event for process 'slave(669)'
with path: '/slave(669)/monitor/statistics'
I1216 01:04:08.426018 24726 http.cpp:874] Authorizing principal 'test-principal' to GET the
'/monitor/statistics' endpoint
I1216 01:04:08.426935 24719 slave.cpp:796] Agent terminating
[       OK ] Endpoint/SlaveEndpointTest.UnauthorizedRequest/0 (11 ms)
[ RUN      ] Endpoint/SlaveEndpointTest.UnauthorizedRequest/1
I1216 01:04:08.431372 24719 containerizer.cpp:220] Using isolation: posix/cpu,posix/mem,filesystem/posix,network/cni
W1216 01:04:08.431655 24719 backend.cpp:76] Failed to create 'aufs' backend: AufsBackend requires
root privileges, but is running as user mesos
W1216 01:04:08.431740 24719 backend.cpp:76] Failed to create 'bind' backend: BindBackend requires
root privileges
I1216 01:04:08.432945 24720 slave.cpp:209] Mesos agent started on (670)@172.17.0.3:37755
I1216 01:04:08.433034 24720 slave.cpp:210] Flags at startup: --acls="" --appc_simple_discovery_uri_prefix="http://"
--appc_store_dir="/tmp/mesos/store/appc" --authenticate_http_readonly="true" --authenticate_http_readwrite="true"
--authenticatee="crammd5" --authentication_backoff_factor="1secs" --authorizer="local" --cgroups_cpu_enable_pids_and_tids_count="false"
--cgroups_enable_cfs="false" --cgroups_hierarchy="/sys/fs/cgroup" --cgroups_limit_swap="false"
--cgroups_root="mesos" --container_disk_watch_interval="15secs" --containerizers="mesos" --credential="/tmp/Endpoint_SlaveEndpointTest_UnauthorizedRequest_1_1cH3Um/credential"
--default_role="*" --disk_watch_interval="1mins" --docker="docker" --docker_kill_orphans="true"
--docker_registry="https://registry-1.docker.io" --docker_remove_delay="6hrs" --docker_socket="/var/run/docker.sock"
--docker_stop_timeout="0ns" --docker_store_dir="/tmp/mesos/store/docker" --docker_volume_checkpoint_dir="/var/run/mesos/isolators/docker/volume"
--enforce_container_disk_quota="false" --executor_registration_timeout="1mins" --executor_shutdown_grace_period="5secs"
--fetcher_cache_dir="/tmp/Endpoint_SlaveEndpointTest_UnauthorizedRequest_1_1cH3Um/fetch" --fetcher_cache_size="2GB"
--frameworks_home="" --gc_delay="1weeks" --gc_disk_headroom="0.1" --hadoop_home="" --help="false"
--hostname_lookup="true" --http_authenticators="basic" --http_command_executor="false" --http_credentials="/tmp/Endpoint_SlaveEndpointTest_UnauthorizedRequest_1_1cH3Um/http_credentials"
--http_heartbeat_interval="30secs" --image_provisioner_backend="copy" --initialize_driver_logging="true"
--isolation="posix/cpu,posix/mem" --launcher="posix" --launcher_dir="/mesos/build/src" --logbufsecs="0"
--logging_level="INFO" --max_completed_executors_per_framework="150" --oversubscribed_resources_interval="15secs"
--perf_duration="10secs" --perf_interval="1mins" --qos_correction_interval_min="0ns" --quiet="false"
--recover="reconnect" --recovery_timeout="15mins" --registration_backoff_factor="10ms" --resources="cpus:2;gpus:0;mem:1024;disk:1024;ports:[31000-32000]"
--revocable_cpu_low_priority="true" --runtime_dir="/tmp/Endpoint_SlaveEndpointTest_UnauthorizedRequest_1_1cH3Um"
--sandbox_directory="/mnt/mesos/sandbox" --strict="true" --switch_user="true" --systemd_enable_support="true"
--systemd_runtime_directory="/run/systemd/system" --version="false" --work_dir="/tmp/Endpoint_SlaveEndpointTest_UnauthorizedRequest_1_SQtCf2"
I1216 01:04:08.433359 24720 credentials.hpp:86] Loading credential for authentication from
'/tmp/Endpoint_SlaveEndpointTest_UnauthorizedRequest_1_1cH3Um/credential'
I1216 01:04:08.433441 24720 slave.cpp:352] Agent using credential for: test-principal
I1216 01:04:08.433452 24720 credentials.hpp:37] Loading credentials for authentication from
'/tmp/Endpoint_SlaveEndpointTest_UnauthorizedRequest_1_1cH3Um/http_credentials'
I1216 01:04:08.433531 24720 http.cpp:922] Using default 'basic' HTTP authenticator for realm
'mesos-agent-readonly'
I1216 01:04:08.433573 24720 http.cpp:922] Using default 'basic' HTTP authenticator for realm
'mesos-agent-readwrite'
I1216 01:04:08.433934 24720 slave.cpp:539] Agent resources: cpus(*):2; mem(*):1024; disk(*):1024;
ports(*):[31000-32000]
I1216 01:04:08.433965 24720 slave.cpp:547] Agent attributes: [  ]
I1216 01:04:08.433974 24720 slave.cpp:552] Agent hostname: 7fad9404d1e8
I1216 01:04:08.434391 24730 state.cpp:57] Recovering state from '/tmp/Endpoint_SlaveEndpointTest_UnauthorizedRequest_1_SQtCf2/meta'
I1216 01:04:08.434725 24724 status_update_manager.cpp:203] Recovering status update manager
I1216 01:04:08.434809 24732 containerizer.cpp:594] Recovering containerizer
I1216 01:04:08.435516 24727 provisioner.cpp:253] Provisioner recovery complete
I1216 01:04:08.435665 24735 slave.cpp:5408] Finished recovery
I1216 01:04:08.436008 24735 slave.cpp:5582] Querying resource estimator for oversubscribable
resources
I1216 01:04:08.436120 24734 slave.cpp:5596] Received oversubscribable resources {} from the
resource estimator
I1216 01:04:08.436728 24735 process.cpp:3679] Handling HTTP event for process 'slave(670)'
with path: '/slave(670)/monitor/statistics.json'
I1216 01:04:08.437198 24726 http.cpp:874] Authorizing principal 'test-principal' to GET the
'/monitor/statistics.json' endpoint
I1216 01:04:08.438347 24723 slave.cpp:796] Agent terminating
[       OK ] Endpoint/SlaveEndpointTest.UnauthorizedRequest/1 (11 ms)
[ RUN      ] Endpoint/SlaveEndpointTest.UnauthorizedRequest/2
I1216 01:04:08.443460 24719 containerizer.cpp:220] Using isolation: posix/cpu,posix/mem,filesystem/posix,network/cni
W1216 01:04:08.443758 24719 backend.cpp:76] Failed to create 'aufs' backend: AufsBackend requires
root privileges, but is running as user mesos
W1216 01:04:08.443856 24719 backend.cpp:76] Failed to create 'bind' backend: BindBackend requires
root privileges
I1216 01:04:08.445034 24727 slave.cpp:209] Mesos agent started on (671)@172.17.0.3:37755
I1216 01:04:08.445057 24727 slave.cpp:210] Flags at startup: --acls="" --appc_simple_discovery_uri_prefix="http://"
--appc_store_dir="/tmp/mesos/store/appc" --authenticate_http_readonly="true" --authenticate_http_readwrite="true"
--authenticatee="crammd5" --authentication_backoff_factor="1secs" --authorizer="local" --cgroups_cpu_enable_pids_and_tids_count="false"
--cgroups_enable_cfs="false" --cgroups_hierarchy="/sys/fs/cgroup" --cgroups_limit_swap="false"
--cgroups_root="mesos" --container_disk_watch_interval="15secs" --containerizers="mesos" --credential="/tmp/Endpoint_SlaveEndpointTest_UnauthorizedRequest_2_XU0nHH/credential"
--default_role="*" --disk_watch_interval="1mins" --docker="docker" --docker_kill_orphans="true"
--docker_registry="https://registry-1.docker.io" --docker_remove_delay="6hrs" --docker_socket="/var/run/docker.sock"
--docker_stop_timeout="0ns" --docker_store_dir="/tmp/mesos/store/docker" --docker_volume_checkpoint_dir="/var/run/mesos/isolators/docker/volume"
--enforce_container_disk_quota="false" --executor_registration_timeout="1mins" --executor_shutdown_grace_period="5secs"
--fetcher_cache_dir="/tmp/Endpoint_SlaveEndpointTest_UnauthorizedRequest_2_XU0nHH/fetch" --fetcher_cache_size="2GB"
--frameworks_home="" --gc_delay="1weeks" --gc_disk_headroom="0.1" --hadoop_home="" --help="false"
--hostname_lookup="true" --http_authenticators="basic" --http_command_executor="false" --http_credentials="/tmp/Endpoint_SlaveEndpointTest_UnauthorizedRequest_2_XU0nHH/http_credentials"
--http_heartbeat_interval="30secs" --image_provisioner_backend="copy" --initialize_driver_logging="true"
--isolation="posix/cpu,posix/mem" --launcher="posix" --launcher_dir="/mesos/build/src" --logbufsecs="0"
--logging_level="INFO" --max_completed_executors_per_framework="150" --oversubscribed_resources_interval="15secs"
--perf_duration="10secs" --perf_interval="1mins" --qos_correction_interval_min="0ns" --quiet="false"
--recover="reconnect" --recovery_timeout="15mins" --registration_backoff_factor="10ms" --resources="cpus:2;gpus:0;mem:1024;disk:1024;ports:[31000-32000]"
--revocable_cpu_low_priority="true" --runtime_dir="/tmp/Endpoint_SlaveEndpointTest_UnauthorizedRequest_2_XU0nHH"
--sandbox_directory="/mnt/mesos/sandbox" --strict="true" --switch_user="true" --systemd_enable_support="true"
--systemd_runtime_directory="/run/systemd/system" --version="false" --work_dir="/tmp/Endpoint_SlaveEndpointTest_UnauthorizedRequest_2_AXg0Zm"
I1216 01:04:08.445385 24727 credentials.hpp:86] Loading credential for authentication from
'/tmp/Endpoint_SlaveEndpointTest_UnauthorizedRequest_2_XU0nHH/credential'
I1216 01:04:08.445463 24727 slave.cpp:352] Agent using credential for: test-principal
I1216 01:04:08.445475 24727 credentials.hpp:37] Loading credentials for authentication from
'/tmp/Endpoint_SlaveEndpointTest_UnauthorizedRequest_2_XU0nHH/http_credentials'
I1216 01:04:08.445564 24727 http.cpp:922] Using default 'basic' HTTP authenticator for realm
'mesos-agent-readonly'
I1216 01:04:08.445626 24727 http.cpp:922] Using default 'basic' HTTP authenticator for realm
'mesos-agent-readwrite'
I1216 01:04:08.445955 24727 slave.cpp:539] Agent resources: cpus(*):2; mem(*):1024; disk(*):1024;
ports(*):[31000-32000]
I1216 01:04:08.445983 24727 slave.cpp:547] Agent attributes: [  ]
I1216 01:04:08.445988 24727 slave.cpp:552] Agent hostname: 7fad9404d1e8
I1216 01:04:08.446357 24735 state.cpp:57] Recovering state from '/tmp/Endpoint_SlaveEndpointTest_UnauthorizedRequest_2_AXg0Zm/meta'
I1216 01:04:08.446537 24727 status_update_manager.cpp:203] Recovering status update manager
I1216 01:04:08.446645 24721 containerizer.cpp:594] Recovering containerizer
I1216 01:04:08.447217 24720 provisioner.cpp:253] Provisioner recovery complete
I1216 01:04:08.447396 24724 slave.cpp:5408] Finished recovery
I1216 01:04:08.447808 24724 slave.cpp:5582] Querying resource estimator for oversubscribable
resources
I1216 01:04:08.447965 24733 slave.cpp:5596] Received oversubscribable resources {} from the
resource estimator
I1216 01:04:08.448626 24724 process.cpp:3679] Handling HTTP event for process 'slave(671)'
with path: '/slave(671)/containers'
I1216 01:04:08.449036 24732 http.cpp:874] Authorizing principal 'test-principal' to GET the
'/containers' endpoint
I1216 01:04:08.449813 24732 slave.cpp:796] Agent terminating
[       OK ] Endpoint/SlaveEndpointTest.UnauthorizedRequest/2 (11 ms)
[ RUN      ] Endpoint/SlaveEndpointTest.NoAuthorizer/0
I1216 01:04:08.455168 24719 containerizer.cpp:220] Using isolation: posix/cpu,posix/mem,filesystem/posix,network/cni
W1216 01:04:08.455461 24719 backend.cpp:76] Failed to create 'aufs' backend: AufsBackend requires
root privileges, but is running as user mesos
W1216 01:04:08.455574 24719 backend.cpp:76] Failed to create 'bind' backend: BindBackend requires
root privileges
I1216 01:04:08.456269 24719 cluster.cpp:446] Creating default 'local' authorizer
I1216 01:04:08.457206 24734 slave.cpp:209] Mesos agent started on (672)@172.17.0.3:37755
I1216 01:04:08.457236 24734 slave.cpp:210] Flags at startup: --acls="" --appc_simple_discovery_uri_prefix="http://"
--appc_store_dir="/tmp/mesos/store/appc" --authenticate_http_readonly="true" --authenticate_http_readwrite="true"
--authenticatee="crammd5" --authentication_backoff_factor="1secs" --authorizer="local" --cgroups_cpu_enable_pids_and_tids_count="false"
--cgroups_enable_cfs="false" --cgroups_hierarchy="/sys/fs/cgroup" --cgroups_limit_swap="false"
--cgroups_root="mesos" --container_disk_watch_interval="15secs" --containerizers="mesos" --credential="/tmp/Endpoint_SlaveEndpointTest_NoAuthorizer_0_9fy8A2/credential"
--default_role="*" --disk_watch_interval="1mins" --docker="docker" --docker_kill_orphans="true"
--docker_registry="https://registry-1.docker.io" --docker_remove_delay="6hrs" --docker_socket="/var/run/docker.sock"
--docker_stop_timeout="0ns" --docker_store_dir="/tmp/mesos/store/docker" --docker_volume_checkpoint_dir="/var/run/mesos/isolators/docker/volume"
--enforce_container_disk_quota="false" --executor_registration_timeout="1mins" --executor_shutdown_grace_period="5secs"
--fetcher_cache_dir="/tmp/Endpoint_SlaveEndpointTest_NoAuthorizer_0_9fy8A2/fetch" --fetcher_cache_size="2GB"
--frameworks_home="" --gc_delay="1weeks" --gc_disk_headroom="0.1" --hadoop_home="" --help="false"
--hostname_lookup="true" --http_authenticators="basic" --http_command_executor="false" --http_credentials="/tmp/Endpoint_SlaveEndpointTest_NoAuthorizer_0_9fy8A2/http_credentials"
--http_heartbeat_interval="30secs" --image_provisioner_backend="copy" --initialize_driver_logging="true"
--isolation="posix/cpu,posix/mem" --launcher="posix" --launcher_dir="/mesos/build/src" --logbufsecs="0"
--logging_level="INFO" --max_completed_executors_per_framework="150" --oversubscribed_resources_interval="15secs"
--perf_duration="10secs" --perf_interval="1mins" --qos_correction_interval_min="0ns" --quiet="false"
--recover="reconnect" --recovery_timeout="15mins" --registration_backoff_factor="10ms" --resources="cpus:2;gpus:0;mem:1024;disk:1024;ports:[31000-32000]"
--revocable_cpu_low_priority="true" --runtime_dir="/tmp/Endpoint_SlaveEndpointTest_NoAuthorizer_0_9fy8A2"
--sandbox_directory="/mnt/mesos/sandbox" --strict="true" --switch_user="true" --systemd_enable_support="true"
--systemd_runtime_directory="/run/systemd/system" --version="false" --work_dir="/tmp/Endpoint_SlaveEndpointTest_NoAuthorizer_0_KF8URH"
I1216 01:04:08.457527 24734 credentials.hpp:86] Loading credential for authentication from
'/tmp/Endpoint_SlaveEndpointTest_NoAuthorizer_0_9fy8A2/credential'
I1216 01:04:08.457597 24734 slave.cpp:352] Agent using credential for: test-principal
I1216 01:04:08.457610 24734 credentials.hpp:37] Loading credentials for authentication from
'/tmp/Endpoint_SlaveEndpointTest_NoAuthorizer_0_9fy8A2/http_credentials'
I1216 01:04:08.457700 24734 http.cpp:922] Using default 'basic' HTTP authenticator for realm
'mesos-agent-readonly'
I1216 01:04:08.457746 24734 http.cpp:922] Using default 'basic' HTTP authenticator for realm
'mesos-agent-readwrite'
I1216 01:04:08.458145 24734 slave.cpp:539] Agent resources: cpus(*):2; mem(*):1024; disk(*):1024;
ports(*):[31000-32000]
I1216 01:04:08.458176 24734 slave.cpp:547] Agent attributes: [  ]
I1216 01:04:08.458184 24734 slave.cpp:552] Agent hostname: 7fad9404d1e8
I1216 01:04:08.458540 24730 state.cpp:57] Recovering state from '/tmp/Endpoint_SlaveEndpointTest_NoAuthorizer_0_KF8URH/meta'
I1216 01:04:08.458691 24729 status_update_manager.cpp:203] Recovering status update manager
I1216 01:04:08.458825 24727 containerizer.cpp:594] Recovering containerizer
I1216 01:04:08.459374 24721 provisioner.cpp:253] Provisioner recovery complete
I1216 01:04:08.459578 24733 slave.cpp:5408] Finished recovery
I1216 01:04:08.460016 24733 slave.cpp:5582] Querying resource estimator for oversubscribable
resources
I1216 01:04:08.460129 24727 slave.cpp:5596] Received oversubscribable resources {} from the
resource estimator
I1216 01:04:08.460762 24725 process.cpp:3679] Handling HTTP event for process 'slave(672)'
with path: '/slave(672)/monitor/statistics'
I1216 01:04:08.461254 24722 http.cpp:874] Authorizing principal 'test-principal' to GET the
'/monitor/statistics' endpoint
I1216 01:04:08.462620 24723 slave.cpp:796] Agent terminating
[       OK ] Endpoint/SlaveEndpointTest.NoAuthorizer/0 (13 ms)
[ RUN      ] Endpoint/SlaveEndpointTest.NoAuthorizer/1
I1216 01:04:08.467648 24719 containerizer.cpp:220] Using isolation: posix/cpu,posix/mem,filesystem/posix,network/cni
W1216 01:04:08.467934 24719 backend.cpp:76] Failed to create 'aufs' backend: AufsBackend requires
root privileges, but is running as user mesos
W1216 01:04:08.468041 24719 backend.cpp:76] Failed to create 'bind' backend: BindBackend requires
root privileges
I1216 01:04:08.468684 24719 cluster.cpp:446] Creating default 'local' authorizer
I1216 01:04:08.469142 24721 slave.cpp:209] Mesos agent started on (673)@172.17.0.3:37755
I1216 01:04:08.469164 24721 slave.cpp:210] Flags at startup: --acls="" --appc_simple_discovery_uri_prefix="http://"
--appc_store_dir="/tmp/mesos/store/appc" --authenticate_http_readonly="true" --authenticate_http_readwrite="true"
--authenticatee="crammd5" --authentication_backoff_factor="1secs" --authorizer="local" --cgroups_cpu_enable_pids_and_tids_count="false"
--cgroups_enable_cfs="false" --cgroups_hierarchy="/sys/fs/cgroup" --cgroups_limit_swap="false"
--cgroups_root="mesos" --container_disk_watch_interval="15secs" --containerizers="mesos" --credential="/tmp/Endpoint_SlaveEndpointTest_NoAuthorizer_1_DEY6Cn/credential"
--default_role="*" --disk_watch_interval="1mins" --docker="docker" --docker_kill_orphans="true"
--docker_registry="https://registry-1.docker.io" --docker_remove_delay="6hrs" --docker_socket="/var/run/docker.sock"
--docker_stop_timeout="0ns" --docker_store_dir="/tmp/mesos/store/docker" --docker_volume_checkpoint_dir="/var/run/mesos/isolators/docker/volume"
--enforce_container_disk_quota="false" --executor_registration_timeout="1mins" --executor_shutdown_grace_period="5secs"
--fetcher_cache_dir="/tmp/Endpoint_SlaveEndpointTest_NoAuthorizer_1_DEY6Cn/fetch" --fetcher_cache_size="2GB"
--frameworks_home="" --gc_delay="1weeks" --gc_disk_headroom="0.1" --hadoop_home="" --help="false"
--hostname_lookup="true" --http_authenticators="basic" --http_command_executor="false" --http_credentials="/tmp/Endpoint_SlaveEndpointTest_NoAuthorizer_1_DEY6Cn/http_credentials"
--http_heartbeat_interval="30secs" --image_provisioner_backend="copy" --initialize_driver_logging="true"
--isolation="posix/cpu,posix/mem" --launcher="posix" --launcher_dir="/mesos/build/src" --logbufsecs="0"
--logging_level="INFO" --max_completed_executors_per_framework="150" --oversubscribed_resources_interval="15secs"
--perf_duration="10secs" --perf_interval="1mins" --qos_correction_interval_min="0ns" --quiet="false"
--recover="reconnect" --recovery_timeout="15mins" --registration_backoff_factor="10ms" --resources="cpus:2;gpus:0;mem:1024;disk:1024;ports:[31000-32000]"
--revocable_cpu_low_priority="true" --runtime_dir="/tmp/Endpoint_SlaveEndpointTest_NoAuthorizer_1_DEY6Cn"
--sandbox_directory="/mnt/mesos/sandbox" --strict="true" --switch_user="true" --systemd_enable_support="true"
--systemd_runtime_directory="/run/systemd/system" --version="false" --work_dir="/tmp/Endpoint_SlaveEndpointTest_NoAuthorizer_1_WUzOR2"
I1216 01:04:08.469434 24721 credentials.hpp:86] Loading credential for authentication from
'/tmp/Endpoint_SlaveEndpointTest_NoAuthorizer_1_DEY6Cn/credential'
I1216 01:04:08.469516 24721 slave.cpp:352] Agent using credential for: test-principal
I1216 01:04:08.469530 24721 credentials.hpp:37] Loading credentials for authentication from
'/tmp/Endpoint_SlaveEndpointTest_NoAuthorizer_1_DEY6Cn/http_credentials'
I1216 01:04:08.469621 24721 http.cpp:922] Using default 'basic' HTTP authenticator for realm
'mesos-agent-readonly'
I1216 01:04:08.469669 24721 http.cpp:922] Using default 'basic' HTTP authenticator for realm
'mesos-agent-readwrite'
I1216 01:04:08.469956 24721 slave.cpp:539] Agent resources: cpus(*):2; mem(*):1024; disk(*):1024;
ports(*):[31000-32000]
I1216 01:04:08.469986 24721 slave.cpp:547] Agent attributes: [  ]
I1216 01:04:08.469995 24721 slave.cpp:552] Agent hostname: 7fad9404d1e8
I1216 01:04:08.470275 24726 state.cpp:57] Recovering state from '/tmp/Endpoint_SlaveEndpointTest_NoAuthorizer_1_WUzOR2/meta'
I1216 01:04:08.470469 24732 status_update_manager.cpp:203] Recovering status update manager
I1216 01:04:08.470688 24724 containerizer.cpp:594] Recovering containerizer
I1216 01:04:08.471287 24722 provisioner.cpp:253] Provisioner recovery complete
I1216 01:04:08.471473 24722 slave.cpp:5408] Finished recovery
I1216 01:04:08.471899 24722 slave.cpp:5582] Querying resource estimator for oversubscribable
resources
I1216 01:04:08.472019 24724 slave.cpp:5596] Received oversubscribable resources {} from the
resource estimator
I1216 01:04:08.472612 24733 process.cpp:3679] Handling HTTP event for process 'slave(673)'
with path: '/slave(673)/monitor/statistics.json'
I1216 01:04:08.472992 24732 http.cpp:874] Authorizing principal 'test-principal' to GET the
'/monitor/statistics.json' endpoint
I1216 01:04:08.474277 24731 slave.cpp:796] Agent terminating
[       OK ] Endpoint/SlaveEndpointTest.NoAuthorizer/1 (11 ms)
[ RUN      ] Endpoint/SlaveEndpointTest.NoAuthorizer/2
I1216 01:04:08.478875 24719 containerizer.cpp:220] Using isolation: posix/cpu,posix/mem,filesystem/posix,network/cni
W1216 01:04:08.479130 24719 backend.cpp:76] Failed to create 'aufs' backend: AufsBackend requires
root privileges, but is running as user mesos
W1216 01:04:08.479200 24719 backend.cpp:76] Failed to create 'bind' backend: BindBackend requires
root privileges
I1216 01:04:08.479750 24719 cluster.cpp:446] Creating default 'local' authorizer
I1216 01:04:08.480360 24726 slave.cpp:209] Mesos agent started on (674)@172.17.0.3:37755
I1216 01:04:08.480401 24726 slave.cpp:210] Flags at startup: --acls="" --appc_simple_discovery_uri_prefix="http://"
--appc_store_dir="/tmp/mesos/store/appc" --authenticate_http_readonly="true" --authenticate_http_readwrite="true"
--authenticatee="crammd5" --authentication_backoff_factor="1secs" --authorizer="local" --cgroups_cpu_enable_pids_and_tids_count="false"
--cgroups_enable_cfs="false" --cgroups_hierarchy="/sys/fs/cgroup" --cgroups_limit_swap="false"
--cgroups_root="mesos" --container_disk_watch_interval="15secs" --containerizers="mesos" --credential="/tmp/Endpoint_SlaveEndpointTest_NoAuthorizer_2_L3ZyMI/credential"
--default_role="*" --disk_watch_interval="1mins" --docker="docker" --docker_kill_orphans="true"
--docker_registry="https://registry-1.docker.io" --docker_remove_delay="6hrs" --docker_socket="/var/run/docker.sock"
--docker_stop_timeout="0ns" --docker_store_dir="/tmp/mesos/store/docker" --docker_volume_checkpoint_dir="/var/run/mesos/isolators/docker/volume"
--enforce_container_disk_quota="false" --executor_registration_timeout="1mins" --executor_shutdown_grace_period="5secs"
--fetcher_cache_dir="/tmp/Endpoint_SlaveEndpointTest_NoAuthorizer_2_L3ZyMI/fetch" --fetcher_cache_size="2GB"
--frameworks_home="" --gc_delay="1weeks" --gc_disk_headroom="0.1" --hadoop_home="" --help="false"
--hostname_lookup="true" --http_authenticators="basic" --http_command_executor="false" --http_credentials="/tmp/Endpoint_SlaveEndpointTest_NoAuthorizer_2_L3ZyMI/http_credentials"
--http_heartbeat_interval="30secs" --image_provisioner_backend="copy" --initialize_driver_logging="true"
--isolation="posix/cpu,posix/mem" --launcher="posix" --launcher_dir="/mesos/build/src" --logbufsecs="0"
--logging_level="INFO" --max_completed_executors_per_framework="150" --oversubscribed_resources_interval="15secs"
--perf_duration="10secs" --perf_interval="1mins" --qos_correction_interval_min="0ns" --quiet="false"
--recover="reconnect" --recovery_timeout="15mins" --registration_backoff_factor="10ms" --resources="cpus:2;gpus:0;mem:1024;disk:1024;ports:[31000-32000]"
--revocable_cpu_low_priority="true" --runtime_dir="/tmp/Endpoint_SlaveEndpointTest_NoAuthorizer_2_L3ZyMI"
--sandbox_directory="/mnt/mesos/sandbox" --strict="true" --switch_user="true" --systemd_enable_support="true"
--systemd_runtime_directory="/run/systemd/system" --version="false" --work_dir="/tmp/Endpoint_SlaveEndpointTest_NoAuthorizer_2_cMbqZn"
I1216 01:04:08.480873 24726 credentials.hpp:86] Loading credential for authentication from
'/tmp/Endpoint_SlaveEndpointTest_NoAuthorizer_2_L3ZyMI/credential'
I1216 01:04:08.481006 24726 slave.cpp:352] Agent using credential for: test-principal
I1216 01:04:08.481024 24726 credentials.hpp:37] Loading credentials for authentication from
'/tmp/Endpoint_SlaveEndpointTest_NoAuthorizer_2_L3ZyMI/http_credentials'
I1216 01:04:08.481124 24726 http.cpp:922] Using default 'basic' HTTP authenticator for realm
'mesos-agent-readonly'
I1216 01:04:08.481196 24726 http.cpp:922] Using default 'basic' HTTP authenticator for realm
'mesos-agent-readwrite'
I1216 01:04:08.481648 24726 slave.cpp:539] Agent resources: cpus(*):2; mem(*):1024; disk(*):1024;
ports(*):[31000-32000]
I1216 01:04:08.481681 24726 slave.cpp:547] Agent attributes: [  ]
I1216 01:04:08.481686 24726 slave.cpp:552] Agent hostname: 7fad9404d1e8
I1216 01:04:08.482230 24728 state.cpp:57] Recovering state from '/tmp/Endpoint_SlaveEndpointTest_NoAuthorizer_2_cMbqZn/meta'
I1216 01:04:08.482409 24727 status_update_manager.cpp:203] Recovering status update manager
I1216 01:04:08.482547 24728 containerizer.cpp:594] Recovering containerizer
I1216 01:04:08.483338 24735 provisioner.cpp:253] Provisioner recovery complete
I1216 01:04:08.483532 24727 slave.cpp:5408] Finished recovery
I1216 01:04:08.483825 24727 slave.cpp:5582] Querying resource estimator for oversubscribable
resources
I1216 01:04:08.483907 24724 slave.cpp:5596] Received oversubscribable resources {} from the
resource estimator
I1216 01:04:08.484443 24732 process.cpp:3679] Handling HTTP event for process 'slave(674)'
with path: '/slave(674)/containers'
I1216 01:04:08.484786 24730 http.cpp:874] Authorizing principal 'test-principal' to GET the
'/containers' endpoint
I1216 01:04:08.486124 24719 slave.cpp:796] Agent terminating
[       OK ] Endpoint/SlaveEndpointTest.NoAuthorizer/2 (11 ms)
[----------] 9 tests from Endpoint/SlaveEndpointTest (104 ms total)

[----------] Global test environment tear-down
[==========] 1390 tests from 158 test cases ran. (179056 ms total)
[  PASSED  ] 1389 tests.
[  FAILED  ] 1 test, listed below:
[  FAILED  ] IOSwitchboardTest.KillSwitchboardContainerDestroyed

 1 FAILED TEST
  YOU HAVE 9 DISABLED TESTS

make[3]: *** [CMakeFiles/check] Error 1
make[3]: Leaving directory `/mesos/build'
make[2]: *** [CMakeFiles/check.dir/all] Error 2
make[2]: Leaving directory `/mesos/build'
make[1]: *** [CMakeFiles/check.dir/rule] Error 2
make[1]: Leaving directory `/mesos/build'
make: *** [check] Error 2
+ docker rmi mesos-1481848367-26667
Untagged: mesos-1481848367-26667:latest
Deleted: sha256:75a3e61d60517d97324d6336a0739cc33dfae029e4847939d3c33c28ed6b2363
Deleted: sha256:d710ce121502efcfb6fb4dcd545538465288413cf843d5e13acd40249a3bd521
Deleted: sha256:64a11bd66f82c74305ed6dc6d9fc0b0d4c1366e74e6a045d8896a2e845802fbb
Deleted: sha256:090317b6b216ea1e9568e028d1e8927858a535f9904b323d19ee8514eef72b68
Deleted: sha256:03e980e65c90403dea0b582e6e2187dff688128a879477c60be2d947f42b63aa
Deleted: sha256:1b557675fb3c8ce41199bab65fa116eb2c25bb241b601d97ea85b22ad624a7b7
Deleted: sha256:99c57ff3765fd95792ddd971a04769bd602ea7669131b1505139085041ce146f
Deleted: sha256:f3a64d851e10c222340242203bd5963b0fc9c16312506a580f75c33629bc9a00
Deleted: sha256:f11a08b5e640162f11b22673f2f0af1dd7f9ee85a5785b75b9b5a85162ab5f42
Deleted: sha256:a55a77d9bce7bc575dd0356c0baaba8c2abc1abbfc1cae3af0296987dbb25ca0
Deleted: sha256:4fff0e2d481836cdf25d5b7a3937beba62945e1aba89777170f8ce6556722969
Deleted: sha256:7a2ab5e00945ca0d4bbf4f00c438f81b00e2b607c6e1df1e7c9c665878c38570
Deleted: sha256:0bd1fcac6787b1271349dc376998dbf6bf7946e52122a1e1bddfd8e6dc8716ac
Deleted: sha256:4367aae588f541474c496f5d8b9cf55418ca03a2700d929e8917bba9c5174719
Deleted: sha256:deeab0ada9e7351f3f3878b250af146dde6b7940df07871e7358ff4cb53a3753
Deleted: sha256:883380f17cdc0cb1cfbe0bd9add2b7f56bde2927b120e9c0174f9a930abb7adb
Deleted: sha256:ed3c425dab145ea017af3c9361899596bfc4ab585d513cbe0138f90ed4a49522
Deleted: sha256:b9f759c45b7726ed0ad167613a2a72b4f3e55352903ad901e0a614953a0ecce4
Deleted: sha256:88eb5e82296df2719cc770092698ef4bf874160c079f8f4be404c5f56b320d87
Deleted: sha256:d482eebf2a8a3d3ce8e4b8f1ce42ddfa79334f5b472f8b26920760f58085ba66
Deleted: sha256:ceed22c7cc90c560c4698399a3fa05557662211488905c83041edb4c2bdb6e69
Deleted: sha256:51f80e538ee525f81c15dc209898b3aeacf162b2d1b31c9b958402e940805d9a
Deleted: sha256:9cb5707fc70f94dc7503cd6aec214a07d3af4a0dca42cceec492bb730b44c449
Deleted: sha256:acdc5a3df9e78f46cb6e738de84e0ea3ccf1d9f65bf965c2e9d63b731c87fed7
Build step 'Execute shell' marked build as failure

Mime
View raw message