mesos-builds mailing list archives

Site index · List index
Message view « Date » · « Thread »
Top « Date » · « Thread »
From Apache Jenkins Server <jenk...@builds.apache.org>
Subject Build failed in Jenkins: Mesos-Windows #928
Date Tue, 06 Dec 2016 01:24:29 GMT
See <https://builds.apache.org/job/Mesos-Windows/928/changes>

Changes:

[bmahler] Fixed typo in 'Getting Started' document.

------------------------------------------
[...truncated 7313 lines...]
W1205 17:24:29.967943   716 fcntl.hpp:30] `os::cloexec` has been called, but is a no-op on
Windows
W1205 17:24:29.967943   716 fcntl.hpp:82] `os::isNonblock` has been called, but is a stub
on Windows
W1205 17:24:29.969934  5708 fcntl.hpp:82] `os::isNonblock` has been called, but is a[    
  OK ] HTTPConnectionTest.RequestStreaming (24 ms)
[----------] 8 tests from HTTPConnectionTest (188 ms total)

[----------] 2 tests from URLTest
[ RUN      ] URLTest.Stringification
[       OK ] URLTest.Stringification (1 ms)
[ RUN      ] URLTest.ParseUrls
[       OK ] URLTest.ParseUrls (1 ms)
[----------] 2 tests from URLTest (2 ms total)

[----------] 6 tests from HttpAuthenticationTest
[ RUN      ] HttpAuthenticationTest.NoAuthenticator
[       OK ] HttpAuthenticationTest.NoAuthenticator (17 ms)
[ RUN      ] HttpAuthenticationTest.Unauthorized
[       OK ] HttpAuthenticationTest.Unauthorized (18 ms)
[ RUN      ] HttpAuthenticationTest.Forbidden
[       OK ] HttpAuthenticationTest.Forbidden (18 ms)
[ RUN      ] HttpAuthenticationTest.Authenticated
[       OK ] HttpAuthenticationTest.Authenticated (17 ms)
[ RUN      ] HttpAuthenticationTest.Pipelining
[       OK ] HttpAuthenticationTest.Pipelining (27 ms)
[ RUN      ] HttpAuthenticationTest.Basic
 stub on Windows
W1205 17:24:29.973970   716 fcntl.hpp:82] `os::isNonblock` has been called, but is a stub
on Windows
W1205 17:24:29.978940   716 fcntl.hpp:82] `os::isNonblock` has been called, but is a stub
on Windows
W1205 17:24:29.980940   716 fcntl.hpp:82] `os::isNonblock` has been called, but is a stub
on Windows
W1205 17:24:29.986937  2796 fcntl.hpp:82] `os::isNonblock` has been called, but is a stub
on Windows
W1205 17:24:29.994946  2972 fcntl.hpp:30] `os::cloexec` has been called, but is a no-op on
Windows
W1205 17:24:29.994946   716 fcntl.hpp:30] `os::cloexec` has been called, but is a no-op on
Windows
W1205 17:24:29.995945   716 fcntl.hpp:82] `os::isNonblock` has been called, but is a stub
on Windows
W1205 17:24:29.998003  2112 fcntl.hpp:82] `os::isNonblock` has been called, but is a stub
on Windows
W1205 17:24:30.000991   716 fcntl.hpp:82] `os::isNonblock` has been called, but is a stub
on Windows
W1205 17:24:30.012961  2972 fcntl.hpp:30] `os::cloexec` has been called, but is a no-op on
Windows
W1205 17:24:30.013964   716 fcntl.hpp:30] `os::cloexec` has been called, but is a no-op on
Windows
W1205 17:24:30.014956   716 fcntl.hpp:82] `os::isNonblock` has been called, but is a stub
on Windows
W1205 17:24:30.015938  4284 fcntl.hpp:82] `os::isNonblock` has been called, but is a stub
on Windows
W1205 17:24:30.018936   716 fcntl.hpp:82] `os::isNonblock` has been called, but is a stub
on Windows
W1205 17:24:30.031965  2972 fcntl.hpp:30] `os::cloexec` has been called, but is a no-op on
Windows
W1205 17:24:30.032948   716 fcntl.hpp:30] `os::cloexec` has been called, but is a no-op on
Windows
W1205 17:24:30.032948   716 fcntl.hpp:82] `os::isNonblock` has been called, but is a stub
on Windows
W1205 17:24:30.033947   628 fcntl.hpp:82] `os::isNonblock` has been called, but is a stub
on Windows
W1205 17:24:30.036944   716 fcntl.hpp:82] `os::isNonblock` has been called, but is a stub
on Windows
W1205 17:24:30.049937  2972 fcntl.hpp:30] `os::cloexec` has been called, but is a no-op on
Windows
W1205 17:24:30.049937   716 fcntl.hpp:30] `os::cloexec` has been called, but is a no-op on
Windows
W1205 17:24:30.050945   716 fcntl.hpp:82] `os::isNonblock` has been called, but is a stub
on Windows
W1205 17:24:30.051940  3576 fcntl.hpp:82] `os::isNonblock` has been called, but is a stub
on Windows
W1205 17:24:30.054939   716 fcntl.hpp:82] `os::isNonblock` has been called, but is a stub
on Windows
W1205 17:24:30.067950  2972 fcntl.hpp:30] `os::cloexec` has been called, but is a no-op on
Windows
W1205 17:24:30.067950   716 fcntl.hpp:30] `os::cloexec` has been called, but is a no-op on
Windows
W1205 17:24:30.068938   716 fcntl.hpp:82] `os::isNonblock` has been called, but is a stub
on Windows
W1205 17:24:30.069950   628 fcntl.hpp:82] `os::isNonblock` has been called, but is a stub
on Windows
W1205 17:24:30.073935   716 fcntl.hpp:82] `os::isNonblock` has been called, but is a stub
on Windows
W1205 17:24:30.075939   716 fcntl.hpp:82] `os::isNonblock` has been called, but is a stub
on Windows
W1205 17:24:30.083935  4284 fcntl.hpp:82] `os::isNonblock` has been called, but is a stub
on Windows
W1205 17:24:30.087936  4284 fcntl.hpp:82] `os::isNonblock` has been called, but is a stub
on Windows
W1205 17:24:30.093940  2972 fcntl.hpp:30] `os::cloexec` has been called, but is a no-op on
Windows
W1205 17:24:30.093940   716 fcntl.hpp:30] `os::cloexec` has been called, but is a no-op on
Windows
W1205 17:24:30.094933   716 fcntl.hpp:82] `os::isNonblock` has been called, but is a stub
on Windows
W1205 17:24:30.095937  5708 fcntl.hpp:82] `os::isNonblock` has been called, but is a stub
on Windows
W1205 17:24:30.097944   716 fcntl.hpp:82] `os::isNonblock` has been called, but is a stub
on Windows
W1205 17:24:30.108944  2972 fcntl.hpp:30] `os::cloexec` has been called, but is a no-op on
Windows
W1205 17:24:30.109940   716 fcntl.hpp:30] `os::cloexec` has been called, but is a no-op on
Windows
W1205 17:24:30.109940   716 fcntl.hpp:82] `os::isNonblock` has been called, but is a stub
on Windows
W1205 17:24:30.111991  2796 fcntl.hpp:82] `os::isNonblock` has been[       OK ] HttpAuthenticationTest.Basic
(70 ms)
[----------] 6 tests from HttpAuthenticationTest (168 ms total)

[----------] 2 tests from HttpServeTest
[ RUN      ] HttpServeTest.Pipelining
F:\jenkins\jenkins-slave\workspace\Mesos-Windows\3rdparty\libprocess\src\tests\http_tests.cpp(1788):
error: (connect).failure(): Failed to connect to 0.0.0.0:55109: The requested address is not
valid in its context.


[  FAILED  ] HttpServeTest.Pipelining (6 ms)
[ RUN      ] HttpServeTest.Discard
F:\jenkins\jenkins-slave\workspace\Mesos-Windows\3rdparty\libprocess\src\tests\http_tests.cpp(1883):
error: (connect).failure(): Failed to connect to 0.0.0.0:55111: The requested address is not
valid in its context.


[  FAILED  ] HttpServeTest.Discard (3 ms)
[----------] 2 tests from HttpServeTest (9 ms total)

[----------] 4 tests from LoopTest
[ RUN      ] LoopTest.Sync
[       OK ] LoopTest.Sync (3 ms)
[ RUN      ] LoopTest.Async
[       OK ] LoopTest.Async (2 ms)
[ RUN      ] LoopTest.DiscardIterate
[       OK ] LoopTest.DiscardIterate (2 ms)
[ RUN      ] LoopTest.DiscardBody
[       OK ] LoopTest.DiscardBody (1 ms)
[----------] 4 tests from LoopTest (9 ms total)

[----------] 5 tests from MetricsTest
[ RUN      ] MetricsTest.Counter
[       OK ] MetricsTest.Counter (5 ms)
[ RUN      ] MetricsTest.Statistics
[       OK ] MetricsTest.Statistics (2 ms)
[ RUN      ] MetricsTest.SnapshotStatistics
[       OK ] MetricsTest.SnapshotStatistics (39 ms)
[ RUN      ] MetricsTest.Timer
[       OK ] MetricsTest.Timer (1 ms)
[ RUN      ] MetricsTest.AsyncTimer
[       OK ] MetricsTest.AsyncTimer (2 ms)
[----------] 5 tests from MetricsTest (52 ms total)

[----------] 3 tests from MutexTest
[ RUN      ] MutexTest.Lock
[       OK ] MutexTest.Lock (0 ms)
[ RUN      ] MutexTest.Block
[       OK ] MutexTest.Block (0 ms)
[ RUN      ] MutexTest.Queue
[       OK ] MutexTest.Queue (1 ms)
[----------] 3 tests from MutexTest (1 ms total)

[----------] 4 tests from OwnedTest
[ RUN      ] OwnedTest.Access
[       OK ] OwnedTest.Access (1 ms)
[ RUN      ] OwnedTest.Null
[       OK ] OwnedTest.Null (0 ms)
[ RUN      ] OwnedTest.Share
[       OK ] OwnedTest.Share (0 ms)
[ RUN      ] OwnedTest.Release
[       OK ] OwnedTest.Release (0 ms)
[----------] 4 tests from OwnedTest (1 ms total)

[----------] 4 tests from ProcessTest
[ RUN      ] ProcessTest.Event
[       OK ] ProcessTest.Event (0 ms)
[ RUN      ] ProcessTest.Exited
[       OK ] ProcessTest.Exited (3 ms)
[ RUN      ] ProcessTest.InjectExited
[       OK ] ProcessTest.InjectExited (2 ms)
[ RUN      ] ProcessTest.PercentEncodedURLs
[       OK ] ProcessTest.PercentEncodedURLs (27 ms)
[----------] 4 tests from ProcessTest (34 ms total)

[----------] 3 tests from QueueTest
[ RUN      ] QueueTest.Block
[       OK ] QueueTest.Block (0 ms)
[ RUN      ] QueueTest.Noblock
[       OK ] QueueTest.Noblock (0 ms)
[ RUN      ] QueueTest.Queue
[       OK ] QueueTest.Queue (1 ms)
[----------] 3 tests from QueueTest (1 ms total)

[----------] 4 tests from SequenceTest
[ RUN      ] SequenceTest.Serialize
[       OK ] SequenceTest.Serialize (6 ms)
[ RUN      ] SequenceTest.DiscardOne
[       OK ] SequenceTest.DiscardOne (4 ms)
[ RUN      ] SequenceTest.DiscardAll
[       OK ] SequenceTest.DiscardAll (8 ms)
[ RUN      ] SequenceTest.Random
[       OK ] SequenceTest.Random (33 ms)
[----------] 4 tests from SequenceTest (51 ms total)

[----------] 4 tests from SharedTest
[ RUN      ] SharedTest.ConstAccess
[       OK ] SharedTest.ConstAccess (0 ms)
[ RUN      ] SharedTest.Null
[       OK ] SharedTest.Null (0 ms)
[ RUN      ] SharedTest.Reset
[       OK ] SharedTest.Reset (0 ms)
[ RUN      ] SharedTest.Own
[       OK ] SharedTest.Own (2 ms)
[----------] 4 tests from SharedTest (2 ms total)

[----------] 3 tests from StatisticsTest
[ RUN      ] StatisticsTest.Empty
[       OK ] StatisticsTest.Empty (0 ms)
[ RUN      ] StatisticsTest.Single
[       OK ] StatisticsTest.Single (0 ms)
[ RUN      ] StatisticsTest.Statistics
[       OK ] StatisticsTest.Statistics (1 ms)
[----------] 3 tests from StatisticsTest (1 ms total)

[----------] 3 tests from SubprocessTest
[ RUN      ] SubprocessTest.PipeOutputToFileDescriptor
[       OK ] SubprocessTest.PipeOutputToFileDescriptor (21 ms)
[ RUN      ] SubprocessTest.PipeOutputToPath
[       OK ] SubprocessTest.PipeOutputToPath (18 ms)
[ RUN      ] SubprocessTest.EnvironmentEcho
[       OK ] SubprocessTest.EnvironmentEcho (14 ms)
[----------] 3 tests from SubprocessTest (53 ms total)

[----------] 4 tests from TimeTest
[ RUN      ] TimeTest.Arithmetic
[       OK ] TimeTest.Arithmetic (1 ms)
[ RUN      ] TimeTest.RFC1123Output
[       OK ] TimeTest.RFC1123Output (0 ms)
[ RUN      ] TimeTest.RFC3339Output
[       OK ] TimeTest.RFC3339Output (1 ms)
[ RUN      ] TimeTest.Output
[       OK ] TimeTest.Output (0 ms)
[----------] 4 tests from TimeTest (2 ms total)

[----------] 3 tests from TimeSeriesTest
[ RUN      ] TimeSeriesTest.Set
[       OK ] TimeSeriesTest.Set (1 ms)
[ RUN      ] TimeSeriesTest.Sparsify
[       OK ] TimeSeriesTest.Sparsify (1 ms)
[ RUN      ] TimeSeriesTest.Truncate
[       OK ] TimeSeriesTest.Truncate (2 ms)
[----------] 3 tests from TimeSeriesTest (5 ms total)

[----------] Global test environment tear-down
[==========] 109 tests from 24 test cases ran. (877 ms total)
[  PASSED  ] 107 tests.
[  FAILED  ] 2 tests, listed below:
[  FAILED  ] HttpServeTest.Pipelining
[  FAILED  ] HttpServeTest.Discard

 2 FAILED TESTS
  YOU HAVE 44 DISABLED TESTS

 called, but is a stub on Windows
W1205 17:24:30.114763   716 fcntl.hpp:82] `os::isNonblock` has been called, but is a stub
on Windows
W1205 17:24:30.124961  2972 fcntl.hpp:30] `os::cloexec` has been called, but is a no-op on
Windows
W1205 17:24:30.126943   716 fcntl.hpp:30] `os::cloexec` has been called, but is a no-op on
Windows
W1205 17:24:30.126943   716 fcntl.hpp:82] `os::isNonblock` has been called, but is a stub
on Windows
W1205 17:24:30.127944  5276 fcntl.hpp:82] `os::isNonblock` has been called, but is a stub
on Windows
W1205 17:24:30.130944   716 fcntl.hpp:82] `os::isNonblock` has been called, but is a stub
on Windows
W1205 17:24:30.143946  2972 fcntl.hpp:30] `os::cloexec` has been called, but is a no-op on
Windows
W1205 17:24:30.144968   716 fcntl.hpp:30] `os::cloexec` has been called, but is a no-op on
Windows
W1205 17:24:30.144968   716 fcntl.hpp:82] `os::isNonblock` has been called, but is a stub
on Windows
W1205 17:24:30.146951  4284 fcntl.hpp:82] `os::isNonblock` has been called, but is a stub
on Windows
W1205 17:24:30.148962   716 fcntl.hpp:82] `os::isNonblock` has been called, but is a stub
on Windows
W1205 17:24:30.163938  2972 fcntl.hpp:30] `os::cloexec` has been called, but is a no-op on
Windows
W1205 17:24:30.164988  2972 fcntl.hpp:30] `os::cloexec` has been called, but is a no-op on
Windows
W1205 17:24:30.168977  2972 fcntl.hpp:30] `os::cloexec` has been called, but is a no-op on
Windows
W1205 17:24:30.168977  2972 fcntl.hpp:30] `os::cloexec` has been called, but is a no-op on
Windows
W1205 17:24:30.190955  2972 fcntl.hpp:30] `os::cloexec` has been called, but is a no-op on
Windows
W1205 17:24:30.191974   716 fcntl.hpp:30] `os::cloexec` has been called, but is a no-op on
Windows
W1205 17:24:30.192997   716 fcntl.hpp:82] `os::isNonblock` has been called, but is a stub
on Windows
W1205 17:24:30.194952  5276 fcntl.hpp:82] `os::isNonblock` has been called, but is a stub
on Windows
W1205 17:24:30.198792   716 fcntl.hpp:82] `os::isNonblock` has been called, but is a stub
on Windows
W1205 17:24:30.241963  2972 fcntl.hpp:30] `os::cloexec` has been called, but is a no-op on
Windows
W1205 17:24:30.242959   716 fcntl.hpp:30] `os::cloexec` has been called, but is a no-op on
Windows
W1205 17:24:30.242959   716 fcntl.hpp:82] `os::isNonblock` has been called, but is a stub
on Windows
W1205 17:24:30.244948  2796 fcntl.hpp:82] `os::isNonblock` has been called, but is a stub
on Windows
W1205 17:24:30.248953   716 fcntl.hpp:82] `os::isNonblock` has been called, but is a stub
on Windows
W1205 17:24:30.251956  2972 fcntl.hpp:30] `os::cloexec` has been called, but is a no-op on
Windows
W1205 17:24:30.251956   716 fcntl.hpp:30] `os::cloexec` has been called, but is a no-op on
Windows
W1205 17:24:30.252941   716 fcntl.hpp:82] `os::isNonblock` has been called, but is a stub
on Windows
W1205 17:24:30.253957  5276 fcntl.hpp:82] `os::isNonblock` has been called, but is a stub
on Windows
W1205 17:24:30.256961   716 fcntl.hpp:82] `os::isNonblock` has been called, but is a stub
on Windows

<https://builds.apache.org/job/Mesos-Windows/ws/build>if> 1 NEQ 0 exit /b 1 
Build step 'Execute Windows batch command' marked build as failure

Mime
View raw message