mesos-builds mailing list archives

Site index · List index
Message view « Date » · « Thread »
Top « Date » · « Thread »
From Apache Jenkins Server <jenk...@builds.apache.org>
Subject Build failed in Jenkins: Mesos » autotools,clang,--verbose --enable-libevent --enable-ssl,GLOG_v=1 MESOS_VERBOSE=1,ubuntu:14.04,(docker||Hadoop)&&(!ubuntu-us1)&&(!ubuntu-6)&&(!ubuntu-eu2) #3014
Date Wed, 07 Dec 2016 05:36:11 GMT
See <https://builds.apache.org/job/Mesos/BUILDTOOL=autotools,COMPILER=clang,CONFIGURATION=--verbose%20--enable-libevent%20--enable-ssl,ENVIRONMENT=GLOG_v=1%20MESOS_VERBOSE=1,OS=ubuntu%3A14.04,label_exp=(docker%7C%7CHadoop)&&(!ubuntu-us1)&&(!ubuntu-6)&&(!ubuntu-eu2)/3014/changes>

Changes:

[yujie.jay] Fixed a compiler warning on Ubuntu.

[bmahler] Updated master to add/remove active roles for multi-role frameworks.

------------------------------------------
[...truncated 229961 lines...]
I1207 05:34:29.922761 29796 containerizer.cpp:207] Using isolation: posix/cpu,posix/mem,filesystem/posix,network/cni
W1207 05:34:29.935178 29796 backend.cpp:76] Failed to create 'aufs' backend: AufsBackend requires
root privileges, but is running as user mesos
W1207 05:34:29.935343 29796 backend.cpp:76] Failed to create 'bind' backend: BindBackend requires
root privileges
I1207 05:34:29.939219 29819 slave.cpp:208] Mesos agent started on (655)@172.17.0.2:52982
I1207 05:34:29.939260 29819 slave.cpp:209] Flags at startup: --acls="" --appc_simple_discovery_uri_prefix="http://"
--appc_store_dir="/tmp/mesos/store/appc" --authenticate_http_readonly="true" --authenticate_http_readwrite="true"
--authenticatee="crammd5" --authentication_backoff_factor="1secs" --authorizer="local" --cgroups_cpu_enable_pids_and_tids_count="false"
--cgroups_enable_cfs="false" --cgroups_hierarchy="/sys/fs/cgroup" --cgroups_limit_swap="false"
--cgroups_root="mesos" --container_disk_watch_interval="15secs" --containerizers="mesos" --credential="/tmp/Endpoint_SlaveEndpointTest_AuthorizedRequest_1_I3ntLX/credential"
--default_role="*" --disk_watch_interval="1mins" --docker="docker" --docker_kill_orphans="true"
--docker_registry="https://registry-1.docker.io" --docker_remove_delay="6hrs" --docker_socket="/var/run/docker.sock"
--docker_stop_timeout="0ns" --docker_store_dir="/tmp/mesos/store/docker" --docker_volume_checkpoint_dir="/var/run/mesos/isolators/docker/volume"
--enforce_container_disk_quota="false" --executor_registration_timeout="1mins" --executor_shutdown_grace_period="5secs"
--fetcher_cache_dir="/tmp/Endpoint_SlaveEndpointTest_AuthorizedRequest_1_I3ntLX/fetch" --fetcher_cache_size="2GB"
--frameworks_home="" --gc_delay="1weeks" --gc_disk_headroom="0.1" --hadoop_home="" --help="false"
--hostname_lookup="true" --http_authenticators="basic" --http_command_executor="false" --http_credentials="/tmp/Endpoint_SlaveEndpointTest_AuthorizedRequest_1_I3ntLX/http_credentials"
--image_provisioner_backend="copy" --initialize_driver_logging="true" --io_switchboard_enable_server="true"
--isolation="posix/cpu,posix/mem" --launcher="posix" --launcher_dir="/mesos/mesos-1.2.0/_build/src"
--logbufsecs="0" --logging_level="INFO" --max_completed_executors_per_framework="150" --oversubscribed_resources_interval="15secs"
--perf_duration="10secs" --perf_interval="1mins" --qos_correction_interval_min="0ns" --quiet="false"
--recover="reconnect" --recovery_timeout="15mins" --registration_backoff_factor="10ms" --resources="cpus:2;gpus:0;mem:1024;disk:1024;ports:[31000-32000]"
--revocable_cpu_low_priority="true" --runtime_dir="/tmp/Endpoint_SlaveEndpointTest_AuthorizedRequest_1_I3ntLX"
--sandbox_directory="/mnt/mesos/sandbox" --strict="true" --switch_user="true" --systemd_enable_support="true"
--systemd_runtime_directory="/run/systemd/system" --version="false" --work_dir="/tmp/Endpoint_SlaveEndpointTest_AuthorizedRequest_1_W06hGS"
I1207 05:34:29.939793 29819 credentials.hpp:86] Loading credential for authentication from
'/tmp/Endpoint_SlaveEndpointTest_AuthorizedRequest_1_I3ntLX/credential'
I1207 05:34:29.939937 29819 slave.cpp:346] Agent using credential for: test-principal
I1207 05:34:29.939961 29819 credentials.hpp:37] Loading credentials for authentication from
'/tmp/Endpoint_SlaveEndpointTest_AuthorizedRequest_1_I3ntLX/http_credentials'
I1207 05:34:29.940193 29819 http.cpp:922] Using default 'basic' HTTP authenticator for realm
'mesos-agent-readonly'
I1207 05:34:29.940397 29819 http.cpp:922] Using default 'basic' HTTP authenticator for realm
'mesos-agent-readwrite'
I1207 05:34:29.941758 29819 slave.cpp:533] Agent resources: cpus(*):2; mem(*):1024; disk(*):1024;
ports(*):[31000-32000]
I1207 05:34:29.941864 29819 slave.cpp:541] Agent attributes: [  ]
I1207 05:34:29.941890 29819 slave.cpp:546] Agent hostname: eb11a2f0d1d7
I1207 05:34:29.943541 29818 state.cpp:57] Recovering state from '/tmp/Endpoint_SlaveEndpointTest_AuthorizedRequest_1_W06hGS/meta'
I1207 05:34:29.944129 29818 status_update_manager.cpp:203] Recovering status update manager
I1207 05:34:29.944406 29825 containerizer.cpp:581] Recovering containerizer
I1207 05:34:29.945798 29815 provisioner.cpp:253] Provisioner recovery complete
I1207 05:34:29.946303 29817 slave.cpp:5414] Finished recovery
I1207 05:34:29.946872 29817 slave.cpp:5588] Querying resource estimator for oversubscribable
resources
I1207 05:34:29.947135 29823 slave.cpp:5602] Received oversubscribable resources {} from the
resource estimator
I1207 05:34:29.949070 29819 process.cpp:3679] Handling HTTP event for process 'slave(655)'
with path: '/slave(655)/monitor/statistics.json'
I1207 05:34:29.950654 29816 http.cpp:874] Authorizing principal 'test-principal' to GET the
'/monitor/statistics.json' endpoint
I1207 05:34:29.955546 29816 slave.cpp:790] Agent terminating
[       OK ] Endpoint/SlaveEndpointTest.AuthorizedRequest/1 (59 ms)
[ RUN      ] Endpoint/SlaveEndpointTest.AuthorizedRequest/2
I1207 05:34:29.981614 29796 containerizer.cpp:207] Using isolation: posix/cpu,posix/mem,filesystem/posix,network/cni
W1207 05:34:29.982092 29796 backend.cpp:76] Failed to create 'aufs' backend: AufsBackend requires
root privileges, but is running as user mesos
W1207 05:34:29.982247 29796 backend.cpp:76] Failed to create 'bind' backend: BindBackend requires
root privileges
I1207 05:34:29.984940 29815 slave.cpp:208] Mesos agent started on (656)@172.17.0.2:52982
I1207 05:34:29.984989 29815 slave.cpp:209] Flags at startup: --acls="" --appc_simple_discovery_uri_prefix="http://"
--appc_store_dir="/tmp/mesos/store/appc" --authenticate_http_readonly="true" --authenticate_http_readwrite="true"
--authenticatee="crammd5" --authentication_backoff_factor="1secs" --authorizer="local" --cgroups_cpu_enable_pids_and_tids_count="false"
--cgroups_enable_cfs="false" --cgroups_hierarchy="/sys/fs/cgroup" --cgroups_limit_swap="false"
--cgroups_root="mesos" --container_disk_watch_interval="15secs" --containerizers="mesos" --credential="/tmp/Endpoint_SlaveEndpointTest_AuthorizedRequest_2_AER7Ci/credential"
--default_role="*" --disk_watch_interval="1mins" --docker="docker" --docker_kill_orphans="true"
--docker_registry="https://registry-1.docker.io" --docker_remove_delay="6hrs" --docker_socket="/var/run/docker.sock"
--docker_stop_timeout="0ns" --docker_store_dir="/tmp/mesos/store/docker" --docker_volume_checkpoint_dir="/var/run/mesos/isolators/docker/volume"
--enforce_container_disk_quota="false" --executor_registration_timeout="1mins" --executor_shutdown_grace_period="5secs"
--fetcher_cache_dir="/tmp/Endpoint_SlaveEndpointTest_AuthorizedRequest_2_AER7Ci/fetch" --fetcher_cache_size="2GB"
--frameworks_home="" --gc_delay="1weeks" --gc_disk_headroom="0.1" --hadoop_home="" --help="false"
--hostname_lookup="true" --http_authenticators="basic" --http_command_executor="false" --http_credentials="/tmp/Endpoint_SlaveEndpointTest_AuthorizedRequest_2_AER7Ci/http_credentials"
--image_provisioner_backend="copy" --initialize_driver_logging="true" --io_switchboard_enable_server="true"
--isolation="posix/cpu,posix/mem" --launcher="posix" --launcher_dir="/mesos/mesos-1.2.0/_build/src"
--logbufsecs="0" --logging_level="INFO" --max_completed_executors_per_framework="150" --oversubscribed_resources_interval="15secs"
--perf_duration="10secs" --perf_interval="1mins" --qos_correction_interval_min="0ns" --quiet="false"
--recover="reconnect" --recovery_timeout="15mins" --registration_backoff_factor="10ms" --resources="cpus:2;gpus:0;mem:1024;disk:1024;ports:[31000-32000]"
--revocable_cpu_low_priority="true" --runtime_dir="/tmp/Endpoint_SlaveEndpointTest_AuthorizedRequest_2_AER7Ci"
--sandbox_directory="/mnt/mesos/sandbox" --strict="true" --switch_user="true" --systemd_enable_support="true"
--systemd_runtime_directory="/run/systemd/system" --version="false" --work_dir="/tmp/Endpoint_SlaveEndpointTest_AuthorizedRequest_2_c8qiod"
I1207 05:34:29.985465 29815 credentials.hpp:86] Loading credential for authentication from
'/tmp/Endpoint_SlaveEndpointTest_AuthorizedRequest_2_AER7Ci/credential'
I1207 05:34:29.985610 29815 slave.cpp:346] Agent using credential for: test-principal
I1207 05:34:29.985631 29815 credentials.hpp:37] Loading credentials for authentication from
'/tmp/Endpoint_SlaveEndpointTest_AuthorizedRequest_2_AER7Ci/http_credentials'
I1207 05:34:29.985844 29815 http.cpp:922] Using default 'basic' HTTP authenticator for realm
'mesos-agent-readonly'
I1207 05:34:29.985970 29815 http.cpp:922] Using default 'basic' HTTP authenticator for realm
'mesos-agent-readwrite'
I1207 05:34:29.987030 29815 slave.cpp:533] Agent resources: cpus(*):2; mem(*):1024; disk(*):1024;
ports(*):[31000-32000]
I1207 05:34:29.987107 29815 slave.cpp:541] Agent attributes: [  ]
I1207 05:34:29.987126 29815 slave.cpp:546] Agent hostname: eb11a2f0d1d7
I1207 05:34:29.988692 29826 state.cpp:57] Recovering state from '/tmp/Endpoint_SlaveEndpointTest_AuthorizedRequest_2_c8qiod/meta'
I1207 05:34:29.988965 29828 status_update_manager.cpp:203] Recovering status update manager
I1207 05:34:29.989205 29814 containerizer.cpp:581] Recovering containerizer
I1207 05:34:29.990634 29817 provisioner.cpp:253] Provisioner recovery complete
I1207 05:34:29.990980 29823 slave.cpp:5414] Finished recovery
I1207 05:34:29.991413 29823 slave.cpp:5588] Querying resource estimator for oversubscribable
resources
I1207 05:34:29.991646 29822 slave.cpp:5602] Received oversubscribable resources {} from the
resource estimator
I1207 05:34:29.993376 29816 process.cpp:3679] Handling HTTP event for process 'slave(656)'
with path: '/slave(656)/containers'
I1207 05:34:29.994388 29820 http.cpp:874] Authorizing principal 'test-principal' to GET the
'/containers' endpoint
I1207 05:34:29.997102 29824 slave.cpp:790] Agent terminating
[       OK ] Endpoint/SlaveEndpointTest.AuthorizedRequest/2 (39 ms)
[ RUN      ] Endpoint/SlaveEndpointTest.UnauthorizedRequest/0
I1207 05:34:30.021754 29796 containerizer.cpp:207] Using isolation: posix/cpu,posix/mem,filesystem/posix,network/cni
W1207 05:34:30.022362 29796 backend.cpp:76] Failed to create 'aufs' backend: AufsBackend requires
root privileges, but is running as user mesos
W1207 05:34:30.022531 29796 backend.cpp:76] Failed to create 'bind' backend: BindBackend requires
root privileges
I1207 05:34:30.026159 29817 slave.cpp:208] Mesos agent started on (657)@172.17.0.2:52982
I1207 05:34:30.026201 29817 slave.cpp:209] Flags at startup: --acls="" --appc_simple_discovery_uri_prefix="http://"
--appc_store_dir="/tmp/mesos/store/appc" --authenticate_http_readonly="true" --authenticate_http_readwrite="true"
--authenticatee="crammd5" --authentication_backoff_factor="1secs" --authorizer="local" --cgroups_cpu_enable_pids_and_tids_count="false"
--cgroups_enable_cfs="false" --cgroups_hierarchy="/sys/fs/cgroup" --cgroups_limit_swap="false"
--cgroups_root="mesos" --container_disk_watch_interval="15secs" --containerizers="mesos" --credential="/tmp/Endpoint_SlaveEndpointTest_UnauthorizedRequest_0_6SDkVD/credential"
--default_role="*" --disk_watch_interval="1mins" --docker="docker" --docker_kill_orphans="true"
--docker_registry="https://registry-1.docker.io" --docker_remove_delay="6hrs" --docker_socket="/var/run/docker.sock"
--docker_stop_timeout="0ns" --docker_store_dir="/tmp/mesos/store/docker" --docker_volume_checkpoint_dir="/var/run/mesos/isolators/docker/volume"
--enforce_container_disk_quota="false" --executor_registration_timeout="1mins" --executor_shutdown_grace_period="5secs"
--fetcher_cache_dir="/tmp/Endpoint_SlaveEndpointTest_UnauthorizedRequest_0_6SDkVD/fetch" --fetcher_cache_size="2GB"
--frameworks_home="" --gc_delay="1weeks" --gc_disk_headroom="0.1" --hadoop_home="" --help="false"
--hostname_lookup="true" --http_authenticators="basic" --http_command_executor="false" --http_credentials="/tmp/Endpoint_SlaveEndpointTest_UnauthorizedRequest_0_6SDkVD/http_credentials"
--image_provisioner_backend="copy" --initialize_driver_logging="true" --io_switchboard_enable_server="true"
--isolation="posix/cpu,posix/mem" --launcher="posix" --launcher_dir="/mesos/mesos-1.2.0/_build/src"
--logbufsecs="0" --logging_level="INFO" --max_completed_executors_per_framework="150" --oversubscribed_resources_interval="15secs"
--perf_duration="10secs" --perf_interval="1mins" --qos_correction_interval_min="0ns" --quiet="false"
--recover="reconnect" --recovery_timeout="15mins" --registration_backoff_factor="10ms" --resources="cpus:2;gpus:0;mem:1024;disk:1024;ports:[31000-32000]"
--revocable_cpu_low_priority="true" --runtime_dir="/tmp/Endpoint_SlaveEndpointTest_UnauthorizedRequest_0_6SDkVD"
--sandbox_directory="/mnt/mesos/sandbox" --strict="true" --switch_user="true" --systemd_enable_support="true"
--systemd_runtime_directory="/run/systemd/system" --version="false" --work_dir="/tmp/Endpoint_SlaveEndpointTest_UnauthorizedRequest_0_qsC3zy"
I1207 05:34:30.026780 29817 credentials.hpp:86] Loading credential for authentication from
'/tmp/Endpoint_SlaveEndpointTest_UnauthorizedRequest_0_6SDkVD/credential'
I1207 05:34:30.026953 29817 slave.cpp:346] Agent using credential for: test-principal
I1207 05:34:30.026986 29817 credentials.hpp:37] Loading credentials for authentication from
'/tmp/Endpoint_SlaveEndpointTest_UnauthorizedRequest_0_6SDkVD/http_credentials'
I1207 05:34:30.027281 29817 http.cpp:922] Using default 'basic' HTTP authenticator for realm
'mesos-agent-readonly'
I1207 05:34:30.027457 29817 http.cpp:922] Using default 'basic' HTTP authenticator for realm
'mesos-agent-readwrite'
I1207 05:34:30.028810 29817 slave.cpp:533] Agent resources: cpus(*):2; mem(*):1024; disk(*):1024;
ports(*):[31000-32000]
I1207 05:34:30.028885 29817 slave.cpp:541] Agent attributes: [  ]
I1207 05:34:30.028904 29817 slave.cpp:546] Agent hostname: eb11a2f0d1d7
I1207 05:34:30.030376 29823 state.cpp:57] Recovering state from '/tmp/Endpoint_SlaveEndpointTest_UnauthorizedRequest_0_qsC3zy/meta'
I1207 05:34:30.030627 29814 status_update_manager.cpp:203] Recovering status update manager
I1207 05:34:30.030886 29828 containerizer.cpp:581] Recovering containerizer
I1207 05:34:30.031976 29827 provisioner.cpp:253] Provisioner recovery complete
I1207 05:34:30.032354 29824 slave.cpp:5414] Finished recovery
I1207 05:34:30.032798 29824 slave.cpp:5588] Querying resource estimator for oversubscribable
resources
I1207 05:34:30.033002 29823 slave.cpp:5602] Received oversubscribable resources {} from the
resource estimator
I1207 05:34:30.034710 29823 process.cpp:3679] Handling HTTP event for process 'slave(657)'
with path: '/slave(657)/monitor/statistics'
I1207 05:34:30.035676 29823 http.cpp:874] Authorizing principal 'test-principal' to GET the
'/monitor/statistics' endpoint
I1207 05:34:30.037458 29829 slave.cpp:790] Agent terminating
[       OK ] Endpoint/SlaveEndpointTest.UnauthorizedRequest/0 (26 ms)
[ RUN      ] Endpoint/SlaveEndpointTest.UnauthorizedRequest/1
I1207 05:34:30.057739 29796 containerizer.cpp:207] Using isolation: posix/cpu,posix/mem,filesystem/posix,network/cni
W1207 05:34:30.076375 29796 backend.cpp:76] Failed to create 'aufs' backend: AufsBackend requires
root privileges, but is running as user mesos
W1207 05:34:30.076525 29796 backend.cpp:76] Failed to create 'bind' backend: BindBackend requires
root privileges
I1207 05:34:30.080891 29825 slave.cpp:208] Mesos agent started on (658)@172.17.0.2:52982
I1207 05:34:30.080955 29825 slave.cpp:209] Flags at startup: --acls="" --appc_simple_discovery_uri_prefix="http://"
--appc_store_dir="/tmp/mesos/store/appc" --authenticate_http_readonly="true" --authenticate_http_readwrite="true"
--authenticatee="crammd5" --authentication_backoff_factor="1secs" --authorizer="local" --cgroups_cpu_enable_pids_and_tids_count="false"
--cgroups_enable_cfs="false" --cgroups_hierarchy="/sys/fs/cgroup" --cgroups_limit_swap="false"
--cgroups_root="mesos" --container_disk_watch_interval="15secs" --containerizers="mesos" --credential="/tmp/Endpoint_SlaveEndpointTest_UnauthorizedRequest_1_e9ROBZ/credential"
--default_role="*" --disk_watch_interval="1mins" --docker="docker" --docker_kill_orphans="true"
--docker_registry="https://registry-1.docker.io" --docker_remove_delay="6hrs" --docker_socket="/var/run/docker.sock"
--docker_stop_timeout="0ns" --docker_store_dir="/tmp/mesos/store/docker" --docker_volume_checkpoint_dir="/var/run/mesos/isolators/docker/volume"
--enforce_container_disk_quota="false" --executor_registration_timeout="1mins" --executor_shutdown_grace_period="5secs"
--fetcher_cache_dir="/tmp/Endpoint_SlaveEndpointTest_UnauthorizedRequest_1_e9ROBZ/fetch" --fetcher_cache_size="2GB"
--frameworks_home="" --gc_delay="1weeks" --gc_disk_headroom="0.1" --hadoop_home="" --help="false"
--hostname_lookup="true" --http_authenticators="basic" --http_command_executor="false" --http_credentials="/tmp/Endpoint_SlaveEndpointTest_UnauthorizedRequest_1_e9ROBZ/http_credentials"
--image_provisioner_backend="copy" --initialize_driver_logging="true" --io_switchboard_enable_server="true"
--isolation="posix/cpu,posix/mem" --launcher="posix" --launcher_dir="/mesos/mesos-1.2.0/_build/src"
--logbufsecs="0" --logging_level="INFO" --max_completed_executors_per_framework="150" --oversubscribed_resources_interval="15secs"
--perf_duration="10secs" --perf_interval="1mins" --qos_correction_interval_min="0ns" --quiet="false"
--recover="reconnect" --recovery_timeout="15mins" --registration_backoff_factor="10ms" --resources="cpus:2;gpus:0;mem:1024;disk:1024;ports:[31000-32000]"
--revocable_cpu_low_priority="true" --runtime_dir="/tmp/Endpoint_SlaveEndpointTest_UnauthorizedRequest_1_e9ROBZ"
--sandbox_directory="/mnt/mesos/sandbox" --strict="true" --switch_user="true" --systemd_enable_support="true"
--systemd_runtime_directory="/run/systemd/system" --version="false" --work_dir="/tmp/Endpoint_SlaveEndpointTest_UnauthorizedRequest_1_uY2GaU"
I1207 05:34:30.081480 29825 credentials.hpp:86] Loading credential for authentication from
'/tmp/Endpoint_SlaveEndpointTest_UnauthorizedRequest_1_e9ROBZ/credential'
I1207 05:34:30.081637 29825 slave.cpp:346] Agent using credential for: test-principal
I1207 05:34:30.081660 29825 credentials.hpp:37] Loading credentials for authentication from
'/tmp/Endpoint_SlaveEndpointTest_UnauthorizedRequest_1_e9ROBZ/http_credentials'
I1207 05:34:30.081874 29825 http.cpp:922] Using default 'basic' HTTP authenticator for realm
'mesos-agent-readonly'
I1207 05:34:30.082012 29825 http.cpp:922] Using default 'basic' HTTP authenticator for realm
'mesos-agent-readwrite'
I1207 05:34:30.083086 29825 slave.cpp:533] Agent resources: cpus(*):2; mem(*):1024; disk(*):1024;
ports(*):[31000-32000]
I1207 05:34:30.083165 29825 slave.cpp:541] Agent attributes: [  ]
I1207 05:34:30.083185 29825 slave.cpp:546] Agent hostname: eb11a2f0d1d7
I1207 05:34:30.084662 29819 state.cpp:57] Recovering state from '/tmp/Endpoint_SlaveEndpointTest_UnauthorizedRequest_1_uY2GaU/meta'
I1207 05:34:30.084913 29828 status_update_manager.cpp:203] Recovering status update manager
I1207 05:34:30.085070 29828 containerizer.cpp:581] Recovering containerizer
I1207 05:34:30.086201 29823 provisioner.cpp:253] Provisioner recovery complete
I1207 05:34:30.086551 29817 slave.cpp:5414] Finished recovery
I1207 05:34:30.087002 29817 slave.cpp:5588] Querying resource estimator for oversubscribable
resources
I1207 05:34:30.087239 29828 slave.cpp:5602] Received oversubscribable resources {} from the
resource estimator
I1207 05:34:30.089071 29824 process.cpp:3679] Handling HTTP event for process 'slave(658)'
with path: '/slave(658)/monitor/statistics.json'
I1207 05:34:30.090283 29815 http.cpp:874] Authorizing principal 'test-principal' to GET the
'/monitor/statistics.json' endpoint
I1207 05:34:30.092326 29829 slave.cpp:790] Agent terminating
[       OK ] Endpoint/SlaveEndpointTest.UnauthorizedRequest/1 (74 ms)
[ RUN      ] Endpoint/SlaveEndpointTest.UnauthorizedRequest/2
I1207 05:34:30.132436 29796 containerizer.cpp:207] Using isolation: posix/cpu,posix/mem,filesystem/posix,network/cni
W1207 05:34:30.133091 29796 backend.cpp:76] Failed to create 'aufs' backend: AufsBackend requires
root privileges, but is running as user mesos
W1207 05:34:30.133287 29796 backend.cpp:76] Failed to create 'bind' backend: BindBackend requires
root privileges
I1207 05:34:30.136991 29817 slave.cpp:208] Mesos agent started on (659)@172.17.0.2:52982
I1207 05:34:30.137042 29817 slave.cpp:209] Flags at startup: --acls="" --appc_simple_discovery_uri_prefix="http://"
--appc_store_dir="/tmp/mesos/store/appc" --authenticate_http_readonly="true" --authenticate_http_readwrite="true"
--authenticatee="crammd5" --authentication_backoff_factor="1secs" --authorizer="local" --cgroups_cpu_enable_pids_and_tids_count="false"
--cgroups_enable_cfs="false" --cgroups_hierarchy="/sys/fs/cgroup" --cgroups_limit_swap="false"
--cgroups_root="mesos" --container_disk_watch_interval="15secs" --containerizers="mesos" --credential="/tmp/Endpoint_SlaveEndpointTest_UnauthorizedRequest_2_aZGt1l/credential"
--default_role="*" --disk_watch_interval="1mins" --docker="docker" --docker_kill_orphans="true"
--docker_registry="https://registry-1.docker.io" --docker_remove_delay="6hrs" --docker_socket="/var/run/docker.sock"
--docker_stop_timeout="0ns" --docker_store_dir="/tmp/mesos/store/docker" --docker_volume_checkpoint_dir="/var/run/mesos/isolators/docker/volume"
--enforce_container_disk_quota="false" --executor_registration_timeout="1mins" --executor_shutdown_grace_period="5secs"
--fetcher_cache_dir="/tmp/Endpoint_SlaveEndpointTest_UnauthorizedRequest_2_aZGt1l/fetch" --fetcher_cache_size="2GB"
--frameworks_home="" --gc_delay="1weeks" --gc_disk_headroom="0.1" --hadoop_home="" --help="false"
--hostname_lookup="true" --http_authenticators="basic" --http_command_executor="false" --http_credentials="/tmp/Endpoint_SlaveEndpointTest_UnauthorizedRequest_2_aZGt1l/http_credentials"
--image_provisioner_backend="copy" --initialize_driver_logging="true" --io_switchboard_enable_server="true"
--isolation="posix/cpu,posix/mem" --launcher="posix" --launcher_dir="/mesos/mesos-1.2.0/_build/src"
--logbufsecs="0" --logging_level="INFO" --max_completed_executors_per_framework="150" --oversubscribed_resources_interval="15secs"
--perf_duration="10secs" --perf_interval="1mins" --qos_correction_interval_min="0ns" --quiet="false"
--recover="reconnect" --recovery_timeout="15mins" --registration_backoff_factor="10ms" --resources="cpus:2;gpus:0;mem:1024;disk:1024;ports:[31000-32000]"
--revocable_cpu_low_priority="true" --runtime_dir="/tmp/Endpoint_SlaveEndpointTest_UnauthorizedRequest_2_aZGt1l"
--sandbox_directory="/mnt/mesos/sandbox" --strict="true" --switch_user="true" --systemd_enable_support="true"
--systemd_runtime_directory="/run/systemd/system" --version="false" --work_dir="/tmp/Endpoint_SlaveEndpointTest_UnauthorizedRequest_2_Wtheog"
I1207 05:34:30.137652 29817 credentials.hpp:86] Loading credential for authentication from
'/tmp/Endpoint_SlaveEndpointTest_UnauthorizedRequest_2_aZGt1l/credential'
I1207 05:34:30.137843 29817 slave.cpp:346] Agent using credential for: test-principal
I1207 05:34:30.137874 29817 credentials.hpp:37] Loading credentials for authentication from
'/tmp/Endpoint_SlaveEndpointTest_UnauthorizedRequest_2_aZGt1l/http_credentials'
I1207 05:34:30.138149 29817 http.cpp:922] Using default 'basic' HTTP authenticator for realm
'mesos-agent-readonly'
I1207 05:34:30.138584 29817 http.cpp:922] Using default 'basic' HTTP authenticator for realm
'mesos-agent-readwrite'
I1207 05:34:30.140029 29817 slave.cpp:533] Agent resources: cpus(*):2; mem(*):1024; disk(*):1024;
ports(*):[31000-32000]
I1207 05:34:30.140130 29817 slave.cpp:541] Agent attributes: [  ]
I1207 05:34:30.140146 29817 slave.cpp:546] Agent hostname: eb11a2f0d1d7
I1207 05:34:30.141775 29826 state.cpp:57] Recovering state from '/tmp/Endpoint_SlaveEndpointTest_UnauthorizedRequest_2_Wtheog/meta'
I1207 05:34:30.142086 29828 status_update_manager.cpp:203] Recovering status update manager
I1207 05:34:30.142943 29824 containerizer.cpp:581] Recovering containerizer
I1207 05:34:30.144381 29822 provisioner.cpp:253] Provisioner recovery complete
I1207 05:34:30.144841 29816 slave.cpp:5414] Finished recovery
I1207 05:34:30.145437 29816 slave.cpp:5588] Querying resource estimator for oversubscribable
resources
I1207 05:34:30.145731 29821 slave.cpp:5602] Received oversubscribable resources {} from the
resource estimator
I1207 05:34:30.147469 29818 process.cpp:3679] Handling HTTP event for process 'slave(659)'
with path: '/slave(659)/containers'
I1207 05:34:30.148886 29815 http.cpp:874] Authorizing principal 'test-principal' to GET the
'/containers' endpoint
I1207 05:34:30.151597 29823 slave.cpp:790] Agent terminating
[       OK ] Endpoint/SlaveEndpointTest.UnauthorizedRequest/2 (30 ms)
[ RUN      ] Endpoint/SlaveEndpointTest.NoAuthorizer/0
I1207 05:34:30.190383 29796 containerizer.cpp:207] Using isolation: posix/cpu,posix/mem,filesystem/posix,network/cni
W1207 05:34:30.190857 29796 backend.cpp:76] Failed to create 'aufs' backend: AufsBackend requires
root privileges, but is running as user mesos
W1207 05:34:30.191062 29796 backend.cpp:76] Failed to create 'bind' backend: BindBackend requires
root privileges
I1207 05:34:30.193244 29796 cluster.cpp:446] Creating default 'local' authorizer
I1207 05:34:30.195153 29816 slave.cpp:208] Mesos agent started on (660)@172.17.0.2:52982
I1207 05:34:30.195207 29816 slave.cpp:209] Flags at startup: --acls="" --appc_simple_discovery_uri_prefix="http://"
--appc_store_dir="/tmp/mesos/store/appc" --authenticate_http_readonly="true" --authenticate_http_readwrite="true"
--authenticatee="crammd5" --authentication_backoff_factor="1secs" --authorizer="local" --cgroups_cpu_enable_pids_and_tids_count="false"
--cgroups_enable_cfs="false" --cgroups_hierarchy="/sys/fs/cgroup" --cgroups_limit_swap="false"
--cgroups_root="mesos" --container_disk_watch_interval="15secs" --containerizers="mesos" --credential="/tmp/Endpoint_SlaveEndpointTest_NoAuthorizer_0_Ecsb3I/credential"
--default_role="*" --disk_watch_interval="1mins" --docker="docker" --docker_kill_orphans="true"
--docker_registry="https://registry-1.docker.io" --docker_remove_delay="6hrs" --docker_socket="/var/run/docker.sock"
--docker_stop_timeout="0ns" --docker_store_dir="/tmp/mesos/store/docker" --docker_volume_checkpoint_dir="/var/run/mesos/isolators/docker/volume"
--enforce_container_disk_quota="false" --executor_registration_timeout="1mins" --executor_shutdown_grace_period="5secs"
--fetcher_cache_dir="/tmp/Endpoint_SlaveEndpointTest_NoAuthorizer_0_Ecsb3I/fetch" --fetcher_cache_size="2GB"
--frameworks_home="" --gc_delay="1weeks" --gc_disk_headroom="0.1" --hadoop_home="" --help="false"
--hostname_lookup="true" --http_authenticators="basic" --http_command_executor="false" --http_credentials="/tmp/Endpoint_SlaveEndpointTest_NoAuthorizer_0_Ecsb3I/http_credentials"
--image_provisioner_backend="copy" --initialize_driver_logging="true" --io_switchboard_enable_server="true"
--isolation="posix/cpu,posix/mem" --launcher="posix" --launcher_dir="/mesos/mesos-1.2.0/_build/src"
--logbufsecs="0" --logging_level="INFO" --max_completed_executors_per_framework="150" --oversubscribed_resources_interval="15secs"
--perf_duration="10secs" --perf_interval="1mins" --qos_correction_interval_min="0ns" --quiet="false"
--recover="reconnect" --recovery_timeout="15mins" --registration_backoff_factor="10ms" --resources="cpus:2;gpus:0;mem:1024;disk:1024;ports:[31000-32000]"
--revocable_cpu_low_priority="true" --runtime_dir="/tmp/Endpoint_SlaveEndpointTest_NoAuthorizer_0_Ecsb3I"
--sandbox_directory="/mnt/mesos/sandbox" --strict="true" --switch_user="true" --systemd_enable_support="true"
--systemd_runtime_directory="/run/systemd/system" --version="false" --work_dir="/tmp/Endpoint_SlaveEndpointTest_NoAuthorizer_0_qLorgD"
I1207 05:34:30.195938 29816 credentials.hpp:86] Loading credential for authentication from
'/tmp/Endpoint_SlaveEndpointTest_NoAuthorizer_0_Ecsb3I/credential'
I1207 05:34:30.196126 29816 slave.cpp:346] Agent using credential for: test-principal
I1207 05:34:30.196158 29816 credentials.hpp:37] Loading credentials for authentication from
'/tmp/Endpoint_SlaveEndpointTest_NoAuthorizer_0_Ecsb3I/http_credentials'
I1207 05:34:30.196460 29816 http.cpp:922] Using default 'basic' HTTP authenticator for realm
'mesos-agent-readonly'
I1207 05:34:30.196614 29816 http.cpp:922] Using default 'basic' HTTP authenticator for realm
'mesos-agent-readwrite'
I1207 05:34:30.198050 29816 slave.cpp:533] Agent resources: cpus(*):2; mem(*):1024; disk(*):1024;
ports(*):[31000-32000]
I1207 05:34:30.198155 29816 slave.cpp:541] Agent attributes: [  ]
I1207 05:34:30.198182 29816 slave.cpp:546] Agent hostname: eb11a2f0d1d7
I1207 05:34:30.199832 29815 state.cpp:57] Recovering state from '/tmp/Endpoint_SlaveEndpointTest_NoAuthorizer_0_qLorgD/meta'
I1207 05:34:30.200116 29819 status_update_manager.cpp:203] Recovering status update manager
I1207 05:34:30.200475 29828 containerizer.cpp:581] Recovering containerizer
I1207 05:34:30.202095 29816 provisioner.cpp:253] Provisioner recovery complete
I1207 05:34:30.202527 29825 slave.cpp:5414] Finished recovery
I1207 05:34:30.203135 29825 slave.cpp:5588] Querying resource estimator for oversubscribable
resources
I1207 05:34:30.203486 29829 slave.cpp:5602] Received oversubscribable resources {} from the
resource estimator
I1207 05:34:30.205296 29819 process.cpp:3679] Handling HTTP event for process 'slave(660)'
with path: '/slave(660)/monitor/statistics'
I1207 05:34:30.206672 29825 http.cpp:874] Authorizing principal 'test-principal' to GET the
'/monitor/statistics' endpoint
I1207 05:34:30.209905 29815 slave.cpp:790] Agent terminating
[       OK ] Endpoint/SlaveEndpointTest.NoAuthorizer/0 (28 ms)
[ RUN      ] Endpoint/SlaveEndpointTest.NoAuthorizer/1
I1207 05:34:30.218569 29796 containerizer.cpp:207] Using isolation: posix/cpu,posix/mem,filesystem/posix,network/cni
W1207 05:34:30.219007 29796 backend.cpp:76] Failed to create 'aufs' backend: AufsBackend requires
root privileges, but is running as user mesos
W1207 05:34:30.219182 29796 backend.cpp:76] Failed to create 'bind' backend: BindBackend requires
root privileges
I1207 05:34:30.221174 29796 cluster.cpp:446] Creating default 'local' authorizer
I1207 05:34:30.223573 29824 slave.cpp:208] Mesos agent started on (661)@172.17.0.2:52982
I1207 05:34:30.223630 29824 slave.cpp:209] Flags at startup: --acls="" --appc_simple_discovery_uri_prefix="http://"
--appc_store_dir="/tmp/mesos/store/appc" --authenticate_http_readonly="true" --authenticate_http_readwrite="true"
--authenticatee="crammd5" --authentication_backoff_factor="1secs" --authorizer="local" --cgroups_cpu_enable_pids_and_tids_count="false"
--cgroups_enable_cfs="false" --cgroups_hierarchy="/sys/fs/cgroup" --cgroups_limit_swap="false"
--cgroups_root="mesos" --container_disk_watch_interval="15secs" --containerizers="mesos" --credential="/tmp/Endpoint_SlaveEndpointTest_NoAuthorizer_1_MdtVr6/credential"
--default_role="*" --disk_watch_interval="1mins" --docker="docker" --docker_kill_orphans="true"
--docker_registry="https://registry-1.docker.io" --docker_remove_delay="6hrs" --docker_socket="/var/run/docker.sock"
--docker_stop_timeout="0ns" --docker_store_dir="/tmp/mesos/store/docker" --docker_volume_checkpoint_dir="/var/run/mesos/isolators/docker/volume"
--enforce_container_disk_quota="false" --executor_registration_timeout="1mins" --executor_shutdown_grace_period="5secs"
--fetcher_cache_dir="/tmp/Endpoint_SlaveEndpointTest_NoAuthorizer_1_MdtVr6/fetch" --fetcher_cache_size="2GB"
--frameworks_home="" --gc_delay="1weeks" --gc_disk_headroom="0.1" --hadoop_home="" --help="false"
--hostname_lookup="true" --http_authenticators="basic" --http_command_executor="false" --http_credentials="/tmp/Endpoint_SlaveEndpointTest_NoAuthorizer_1_MdtVr6/http_credentials"
--image_provisioner_backend="copy" --initialize_driver_logging="true" --io_switchboard_enable_server="true"
--isolation="posix/cpu,posix/mem" --launcher="posix" --launcher_dir="/mesos/mesos-1.2.0/_build/src"
--logbufsecs="0" --logging_level="INFO" --max_completed_executors_per_framework="150" --oversubscribed_resources_interval="15secs"
--perf_duration="10secs" --perf_interval="1mins" --qos_correction_interval_min="0ns" --quiet="false"
--recover="reconnect" --recovery_timeout="15mins" --registration_backoff_factor="10ms" --resources="cpus:2;gpus:0;mem:1024;disk:1024;ports:[31000-32000]"
--revocable_cpu_low_priority="true" --runtime_dir="/tmp/Endpoint_SlaveEndpointTest_NoAuthorizer_1_MdtVr6"
--sandbox_directory="/mnt/mesos/sandbox" --strict="true" --switch_user="true" --systemd_enable_support="true"
--systemd_runtime_directory="/run/systemd/system" --version="false" --work_dir="/tmp/Endpoint_SlaveEndpointTest_NoAuthorizer_1_C6rDA0"
I1207 05:34:30.224213 29824 credentials.hpp:86] Loading credential for authentication from
'/tmp/Endpoint_SlaveEndpointTest_NoAuthorizer_1_MdtVr6/credential'
I1207 05:34:30.224403 29824 slave.cpp:346] Agent using credential for: test-principal
I1207 05:34:30.224431 29824 credentials.hpp:37] Loading credentials for authentication from
'/tmp/Endpoint_SlaveEndpointTest_NoAuthorizer_1_MdtVr6/http_credentials'
I1207 05:34:30.224720 29824 http.cpp:922] Using default 'basic' HTTP authenticator for realm
'mesos-agent-readonly'
I1207 05:34:30.224887 29824 http.cpp:922] Using default 'basic' HTTP authenticator for realm
'mesos-agent-readwrite'
I1207 05:34:30.226189 29824 slave.cpp:533] Agent resources: cpus(*):2; mem(*):1024; disk(*):1024;
ports(*):[31000-32000]
I1207 05:34:30.226289 29824 slave.cpp:541] Agent attributes: [  ]
I1207 05:34:30.226305 29824 slave.cpp:546] Agent hostname: eb11a2f0d1d7
I1207 05:34:30.227946 29822 state.cpp:57] Recovering state from '/tmp/Endpoint_SlaveEndpointTest_NoAuthorizer_1_C6rDA0/meta'
I1207 05:34:30.228226 29829 status_update_manager.cpp:203] Recovering status update manager
I1207 05:34:30.228538 29818 containerizer.cpp:581] Recovering containerizer
I1207 05:34:30.229936 29823 provisioner.cpp:253] Provisioner recovery complete
I1207 05:34:30.230435 29821 slave.cpp:5414] Finished recovery
I1207 05:34:30.262830 29821 slave.cpp:5588] Querying resource estimator for oversubscribable
resources
I1207 05:34:30.263083 29818 slave.cpp:5602] Received oversubscribable resources {} from the
resource estimator
I1207 05:34:30.264674 29815 process.cpp:3679] Handling HTTP event for process 'slave(661)'
with path: '/slave(661)/monitor/statistics.json'
I1207 05:34:30.265718 29824 http.cpp:874] Authorizing principal 'test-principal' to GET the
'/monitor/statistics.json' endpoint
I1207 05:34:30.268893 29820 slave.cpp:790] Agent terminating
[       OK ] Endpoint/SlaveEndpointTest.NoAuthorizer/1 (60 ms)
[ RUN      ] Endpoint/SlaveEndpointTest.NoAuthorizer/2
I1207 05:34:30.284284 29796 containerizer.cpp:207] Using isolation: posix/cpu,posix/mem,filesystem/posix,network/cni
W1207 05:34:30.284735 29796 backend.cpp:76] Failed to create 'aufs' backend: AufsBackend requires
root privileges, but is running as user mesos
W1207 05:34:30.284857 29796 backend.cpp:76] Failed to create 'bind' backend: BindBackend requires
root privileges
I1207 05:34:30.286314 29796 cluster.cpp:446] Creating default 'local' authorizer
I1207 05:34:30.287726 29826 slave.cpp:208] Mesos agent started on (662)@172.17.0.2:52982
I1207 05:34:30.287773 29826 slave.cpp:209] Flags at startup: --acls="" --appc_simple_discovery_uri_prefix="http://"
--appc_store_dir="/tmp/mesos/store/appc" --authenticate_http_readonly="true" --authenticate_http_readwrite="true"
--authenticatee="crammd5" --authentication_backoff_factor="1secs" --authorizer="local" --cgroups_cpu_enable_pids_and_tids_count="false"
--cgroups_enable_cfs="false" --cgroups_hierarchy="/sys/fs/cgroup" --cgroups_limit_swap="false"
--cgroups_root="mesos" --container_disk_watch_interval="15secs" --containerizers="mesos" --credential="/tmp/Endpoint_SlaveEndpointTest_NoAuthorizer_2_0ubOqu/credential"
--default_role="*" --disk_watch_interval="1mins" --docker="docker" --docker_kill_orphans="true"
--docker_registry="https://registry-1.docker.io" --docker_remove_delay="6hrs" --docker_socket="/var/run/docker.sock"
--docker_stop_timeout="0ns" --docker_store_dir="/tmp/mesos/store/docker" --docker_volume_checkpoint_dir="/var/run/mesos/isolators/docker/volume"
--enforce_container_disk_quota="false" --executor_registration_timeout="1mins" --executor_shutdown_grace_period="5secs"
--fetcher_cache_dir="/tmp/Endpoint_SlaveEndpointTest_NoAuthorizer_2_0ubOqu/fetch" --fetcher_cache_size="2GB"
--frameworks_home="" --gc_delay="1weeks" --gc_disk_headroom="0.1" --hadoop_home="" --help="false"
--hostname_lookup="true" --http_authenticators="basic" --http_command_executor="false" --http_credentials="/tmp/Endpoint_SlaveEndpointTest_NoAuthorizer_2_0ubOqu/http_credentials"
--image_provisioner_backend="copy" --initialize_driver_logging="true" --io_switchboard_enable_server="true"
--isolation="posix/cpu,posix/mem" --launcher="posix" --launcher_dir="/mesos/mesos-1.2.0/_build/src"
--logbufsecs="0" --logging_level="INFO" --max_completed_executors_per_framework="150" --oversubscribed_resources_interval="15secs"
--perf_duration="10secs" --perf_interval="1mins" --qos_correction_interval_min="0ns" --quiet="false"
--recover="reconnect" --recovery_timeout="15mins" --registration_backoff_factor="10ms" --resources="cpus:2;gpus:0;mem:1024;disk:1024;ports:[31000-32000]"
--revocable_cpu_low_priority="true" --runtime_dir="/tmp/Endpoint_SlaveEndpointTest_NoAuthorizer_2_0ubOqu"
--sandbox_directory="/mnt/mesos/sandbox" --strict="true" --switch_user="true" --systemd_enable_support="true"
--systemd_runtime_directory="/run/systemd/system" --version="false" --work_dir="/tmp/Endpoint_SlaveEndpointTest_NoAuthorizer_2_05PWoo"
I1207 05:34:30.288828 29826 credentials.hpp:86] Loading credential for authentication from
'/tmp/Endpoint_SlaveEndpointTest_NoAuthorizer_2_0ubOqu/credential'
I1207 05:34:30.289057 29826 slave.cpp:346] Agent using credential for: test-principal
I1207 05:34:30.289090 29826 credentials.hpp:37] Loading credentials for authentication from
'/tmp/Endpoint_SlaveEndpointTest_NoAuthorizer_2_0ubOqu/http_credentials'
I1207 05:34:30.305899 29826 http.cpp:922] Using default 'basic' HTTP authenticator for realm
'mesos-agent-readonly'
I1207 05:34:30.306054 29826 http.cpp:922] Using default 'basic' HTTP authenticator for realm
'mesos-agent-readwrite'
I1207 05:34:30.307310 29826 slave.cpp:533] Agent resources: cpus(*):2; mem(*):1024; disk(*):1024;
ports(*):[31000-32000]
I1207 05:34:30.307411 29826 slave.cpp:541] Agent attributes: [  ]
I1207 05:34:30.307426 29826 slave.cpp:546] Agent hostname: eb11a2f0d1d7
I1207 05:34:30.309365 29823 state.cpp:57] Recovering state from '/tmp/Endpoint_SlaveEndpointTest_NoAuthorizer_2_05PWoo/meta'
I1207 05:34:30.309689 29825 status_update_manager.cpp:203] Recovering status update manager
I1207 05:34:30.309937 29821 containerizer.cpp:581] Recovering containerizer
I1207 05:34:30.311477 29814 provisioner.cpp:253] Provisioner recovery complete
I1207 05:34:30.311929 29828 slave.cpp:5414] Finished recovery
I1207 05:34:30.312562 29828 slave.cpp:5588] Querying resource estimator for oversubscribable
resources
I1207 05:34:30.312844 29823 slave.cpp:5602] Received oversubscribable resources {} from the
resource estimator
I1207 05:34:30.314586 29828 process.cpp:3679] Handling HTTP event for process 'slave(662)'
with path: '/slave(662)/containers'
I1207 05:34:30.316202 29820 http.cpp:874] Authorizing principal 'test-principal' to GET the
'/containers' endpoint
I1207 05:34:30.320614 29828 slave.cpp:790] Agent terminating
[       OK ] Endpoint/SlaveEndpointTest.NoAuthorizer/2 (48 ms)
[----------] 9 tests from Endpoint/SlaveEndpointTest (455 ms total)

[----------] Global test environment tear-down
[==========] 1413 tests from 162 test cases ran. (1029918 ms total)
[  PASSED  ] 1412 tests.
[  FAILED  ] 1 test, listed below:
[  FAILED  ] DefaultExecutorTest.KillTaskGroupOnTaskFailure

 1 FAILED TEST
  YOU HAVE 9 DISABLED TESTS

make[4]: *** [check-local] Error 1
make[4]: Leaving directory `/mesos/mesos-1.2.0/_build/src'
make[3]: *** [check-am] Error 2
make[3]: Leaving directory `/mesos/mesos-1.2.0/_build/src'
make[2]: *** [check] Error 2
make[2]: Leaving directory `/mesos/mesos-1.2.0/_build/src'
make[1]: *** [check-recursive] Error 1
make[1]: Leaving directory `/mesos/mesos-1.2.0/_build'
make: *** [distcheck] Error 1
+ docker rmi mesos-1481085380-8615
Untagged: mesos-1481085380-8615:latest
Deleted: sha256:0ceaa11d8569d85d67fa6644973c05aa02256cc72f2c1ba5f7150c0a9a6c6f06
Deleted: sha256:2cb81d9a7ab8a6798ec98274045b59e2e878cc35c057afe3acc21ed3640b724f
Deleted: sha256:46cff8edab9408b10fcc23c82758d129bfbf5658a2d824500e12b6f9f53e4396
Deleted: sha256:a5524b31d622a4b04bae9fe6f8efdabedf92e5603baee30de661ca8d4d11150a
Deleted: sha256:d1e9b4c7f3e6ff1a3d9eadffa2a62a935354277c6cd56d7d3a76bd47c19dce7c
Deleted: sha256:147038014dcd75901533a36669bb30b070172c84ce66a880c12b5e8c65cc36e7
Deleted: sha256:fd54732bc5b9428bbd2bed15a88269fd4bd19b02ba05bebefd32baa051fd4a3b
Deleted: sha256:02301f46ab2c2f09e8d41c3436f350fb746f2acfad8829c55c0c223fe30cff3c
Deleted: sha256:3ef0ce2576e5bac37c1f09a82e75e8b28d2595c51d84df73c6fdc82f8c3e0415
Deleted: sha256:74cd925f644d1035dbac65ea85750f49b4e69631deeb424fa7e1563810196a7a
Deleted: sha256:49a4b70124d31992e024b5d69133e01aa008b214dd5be3ba639dd8271d8fb126
Deleted: sha256:d3de1ff0a39ed741ef8111d3678156dafe2965a1bc0df47cae7a93bf20b8dd7a
Deleted: sha256:5ea028231fbe4ced6240959b691f7c7b135f17241b1c689b5a468a1e5f6c81ca
Deleted: sha256:59b4e64336126d062861869afa2c5ba135db9263e5aefdd71c220eceb138fbac
Deleted: sha256:d48986579a25d2d85bda8c1ab946c50421d5985ae0342c6ef9739c683c7d9e9d
Deleted: sha256:0ba836a4cf2d1c092cb086ee58a721a6bc05341d6b48afc5a594b7b3a253509f
Deleted: sha256:1ff0aea55e7fe430095391ae498141d506cf6373de3035997cf03337e43465be
Deleted: sha256:1e762afbd368e2479e951cc09463d13930d17a656101fbda4b6a083cef2180e4
Deleted: sha256:6be691c70d72e50df9b5041f3b0dc17c20989d058d92ae8a81e19c98ffb34b90
Deleted: sha256:67f948e189cba72c332cb92bcae18eb8ea30300505a801e304628c1e4a90a387
Deleted: sha256:b16a0978c90310e30eaa50148fe842cc44cf1b0ef1f317bb0785b1f2efb993a2
Deleted: sha256:278ce06dfe99e21110f0068714192df0262ddaf308fcccd305e45d297e02512e
Deleted: sha256:56f60970411306fa695eeafd5d37417658b537b0834f6e1407e13aefda0d2b9b
Deleted: sha256:f2e72e44ac6827010c6f460be60497fc4a0ae76ef685329ad4687c36e2373a2b
Build step 'Execute shell' marked build as failure

Mime
View raw message