mesos-builds mailing list archives

Site index · List index
Message view « Date » · « Thread »
Top « Date » · « Thread »
From Apache Jenkins Server <jenk...@builds.apache.org>
Subject Build failed in Jenkins: Mesos » autotools,gcc,--verbose,GLOG_v=1 MESOS_VERBOSE=1,centos:7,(docker||Hadoop)&&(!ubuntu-us1)&&(!ubuntu-6)&&(!ubuntu-eu2) #3035
Date Wed, 14 Dec 2016 06:38:20 GMT
See <https://builds.apache.org/job/Mesos/BUILDTOOL=autotools,COMPILER=gcc,CONFIGURATION=--verbose,ENVIRONMENT=GLOG_v=1%20MESOS_VERBOSE=1,OS=centos%3A7,label_exp=(docker%7C%7CHadoop)&&(!ubuntu-us1)&&(!ubuntu-6)&&(!ubuntu-eu2)/3035/changes>

Changes:

[adam] Added authorization actions VIEW_CONTAINERS and SET_LOG_LEVEL.

[adam] Enabled fine grained authorization for the getContainers API Call.

[adam] Enabled authorization for the GET_FLAGS API Call.

[adam] Enabled authorization in SET_LOG_LEVEL API call.

[vinodkone] Fixed a check bug in LAUNCH_NESTED_CONTAINER_SESSION_CALL.

------------------------------------------
[...truncated 168302 lines...]
W1214 06:37:17.460202 30741 backend.cpp:76] Failed to create 'aufs' backend: AufsBackend requires
root privileges, but is running as user mesos
W1214 06:37:17.460330 30741 backend.cpp:76] Failed to create 'bind' backend: BindBackend requires
root privileges
I1214 06:37:17.462873 30773 slave.cpp:209] Mesos agent started on (666)@172.17.0.4:51138
I1214 06:37:17.462893 30773 slave.cpp:210] Flags at startup: --acls="" --appc_simple_discovery_uri_prefix="http://"
--appc_store_dir="/tmp/mesos/store/appc" --authenticate_http_readonly="true" --authenticate_http_readwrite="true"
--authenticatee="crammd5" --authentication_backoff_factor="1secs" --authorizer="local" --cgroups_cpu_enable_pids_and_tids_count="false"
--cgroups_enable_cfs="false" --cgroups_hierarchy="/sys/fs/cgroup" --cgroups_limit_swap="false"
--cgroups_root="mesos" --container_disk_watch_interval="15secs" --containerizers="mesos" --credential="/tmp/Endpoint_SlaveEndpointTest_AuthorizedRequest_1_n1fdVC/credential"
--default_role="*" --disk_watch_interval="1mins" --docker="docker" --docker_kill_orphans="true"
--docker_registry="https://registry-1.docker.io" --docker_remove_delay="6hrs" --docker_socket="/var/run/docker.sock"
--docker_stop_timeout="0ns" --docker_store_dir="/tmp/mesos/store/docker" --docker_volume_checkpoint_dir="/var/run/mesos/isolators/docker/volume"
--enforce_container_disk_quota="false" --executor_registration_timeout="1mins" --executor_shutdown_grace_period="5secs"
--fetcher_cache_dir="/tmp/Endpoint_SlaveEndpointTest_AuthorizedRequest_1_n1fdVC/fetch" --fetcher_cache_size="2GB"
--frameworks_home="" --gc_delay="1weeks" --gc_disk_headroom="0.1" --hadoop_home="" --help="false"
--hostname_lookup="true" --http_authenticators="basic" --http_command_executor="false" --http_credentials="/tmp/Endpoint_SlaveEndpointTest_AuthorizedRequest_1_n1fdVC/http_credentials"
--http_heartbeat_interval="30secs" --image_provisioner_backend="copy" --initialize_driver_logging="true"
--isolation="posix/cpu,posix/mem" --launcher="posix" --launcher_dir="/mesos/mesos-1.2.0/_build/src"
--logbufsecs="0" --logging_level="INFO" --max_completed_executors_per_framework="150" --oversubscribed_resources_interval="15secs"
--perf_duration="10secs" --perf_interval="1mins" --qos_correction_interval_min="0ns" --quiet="false"
--recover="reconnect" --recovery_timeout="15mins" --registration_backoff_factor="10ms" --resources="cpus:2;gpus:0;mem:1024;disk:1024;ports:[31000-32000]"
--revocable_cpu_low_priority="true" --runtime_dir="/tmp/Endpoint_SlaveEndpointTest_AuthorizedRequest_1_n1fdVC"
--sandbox_directory="/mnt/mesos/sandbox" --strict="true" --switch_user="true" --systemd_enable_support="true"
--systemd_runtime_directory="/run/systemd/system" --version="false" --work_dir="/tmp/Endpoint_SlaveEndpointTest_AuthorizedRequest_1_yMuxf9"
I1214 06:37:17.463353 30773 credentials.hpp:86] Loading credential for authentication from
'/tmp/Endpoint_SlaveEndpointTest_AuthorizedRequest_1_n1fdVC/credential'
I1214 06:37:17.463533 30773 slave.cpp:352] Agent using credential for: test-principal
I1214 06:37:17.463556 30773 credentials.hpp:37] Loading credentials for authentication from
'/tmp/Endpoint_SlaveEndpointTest_AuthorizedRequest_1_n1fdVC/http_credentials'
I1214 06:37:17.463757 30773 http.cpp:922] Using default 'basic' HTTP authenticator for realm
'mesos-agent-readonly'
I1214 06:37:17.463884 30773 http.cpp:922] Using default 'basic' HTTP authenticator for realm
'mesos-agent-readwrite'
I1214 06:37:17.464778 30773 slave.cpp:539] Agent resources: cpus(*):2; mem(*):1024; disk(*):1024;
ports(*):[31000-32000]
I1214 06:37:17.464853 30773 slave.cpp:547] Agent attributes: [  ]
I1214 06:37:17.464870 30773 slave.cpp:552] Agent hostname: 90995dc2a1eb
I1214 06:37:17.465955 30772 state.cpp:57] Recovering state from '/tmp/Endpoint_SlaveEndpointTest_AuthorizedRequest_1_yMuxf9/meta'
I1214 06:37:17.466258 30760 status_update_manager.cpp:203] Recovering status update manager
I1214 06:37:17.466419 30762 containerizer.cpp:594] Recovering containerizer
I1214 06:37:17.467548 30772 provisioner.cpp:253] Provisioner recovery complete
I1214 06:37:17.467874 30761 slave.cpp:5420] Finished recovery
I1214 06:37:17.468291 30761 slave.cpp:5594] Querying resource estimator for oversubscribable
resources
I1214 06:37:17.468493 30772 slave.cpp:5608] Received oversubscribable resources {} from the
resource estimator
I1214 06:37:17.470080 30766 process.cpp:3679] Handling HTTP event for process 'slave(666)'
with path: '/slave(666)/monitor/statistics.json'
I1214 06:37:17.471063 30769 http.cpp:874] Authorizing principal 'test-principal' to GET the
'/monitor/statistics.json' endpoint
I1214 06:37:17.473932 30760 slave.cpp:796] Agent terminating
[       OK ] Endpoint/SlaveEndpointTest.AuthorizedRequest/1 (22 ms)
[ RUN      ] Endpoint/SlaveEndpointTest.AuthorizedRequest/2
I1214 06:37:17.482084 30741 containerizer.cpp:220] Using isolation: posix/cpu,posix/mem,filesystem/posix,network/cni
W1214 06:37:17.482503 30741 backend.cpp:76] Failed to create 'aufs' backend: AufsBackend requires
root privileges, but is running as user mesos
W1214 06:37:17.482625 30741 backend.cpp:76] Failed to create 'bind' backend: BindBackend requires
root privileges
I1214 06:37:17.485152 30774 slave.cpp:209] Mesos agent started on (667)@172.17.0.4:51138
I1214 06:37:17.485170 30774 slave.cpp:210] Flags at startup: --acls="" --appc_simple_discovery_uri_prefix="http://"
--appc_store_dir="/tmp/mesos/store/appc" --authenticate_http_readonly="true" --authenticate_http_readwrite="true"
--authenticatee="crammd5" --authentication_backoff_factor="1secs" --authorizer="local" --cgroups_cpu_enable_pids_and_tids_count="false"
--cgroups_enable_cfs="false" --cgroups_hierarchy="/sys/fs/cgroup" --cgroups_limit_swap="false"
--cgroups_root="mesos" --container_disk_watch_interval="15secs" --containerizers="mesos" --credential="/tmp/Endpoint_SlaveEndpointTest_AuthorizedRequest_2_Kdn8Nx/credential"
--default_role="*" --disk_watch_interval="1mins" --docker="docker" --docker_kill_orphans="true"
--docker_registry="https://registry-1.docker.io" --docker_remove_delay="6hrs" --docker_socket="/var/run/docker.sock"
--docker_stop_timeout="0ns" --docker_store_dir="/tmp/mesos/store/docker" --docker_volume_checkpoint_dir="/var/run/mesos/isolators/docker/volume"
--enforce_container_disk_quota="false" --executor_registration_timeout="1mins" --executor_shutdown_grace_period="5secs"
--fetcher_cache_dir="/tmp/Endpoint_SlaveEndpointTest_AuthorizedRequest_2_Kdn8Nx/fetch" --fetcher_cache_size="2GB"
--frameworks_home="" --gc_delay="1weeks" --gc_disk_headroom="0.1" --hadoop_home="" --help="false"
--hostname_lookup="true" --http_authenticators="basic" --http_command_executor="false" --http_credentials="/tmp/Endpoint_SlaveEndpointTest_AuthorizedRequest_2_Kdn8Nx/http_credentials"
--http_heartbeat_interval="30secs" --image_provisioner_backend="copy" --initialize_driver_logging="true"
--isolation="posix/cpu,posix/mem" --launcher="posix" --launcher_dir="/mesos/mesos-1.2.0/_build/src"
--logbufsecs="0" --logging_level="INFO" --max_completed_executors_per_framework="150" --oversubscribed_resources_interval="15secs"
--perf_duration="10secs" --perf_interval="1mins" --qos_correction_interval_min="0ns" --quiet="false"
--recover="reconnect" --recovery_timeout="15mins" --registration_backoff_factor="10ms" --resources="cpus:2;gpus:0;mem:1024;disk:1024;ports:[31000-32000]"
--revocable_cpu_low_priority="true" --runtime_dir="/tmp/Endpoint_SlaveEndpointTest_AuthorizedRequest_2_Kdn8Nx"
--sandbox_directory="/mnt/mesos/sandbox" --strict="true" --switch_user="true" --systemd_enable_support="true"
--systemd_runtime_directory="/run/systemd/system" --version="false" --work_dir="/tmp/Endpoint_SlaveEndpointTest_AuthorizedRequest_2_C3tQ43"
I1214 06:37:17.485575 30774 credentials.hpp:86] Loading credential for authentication from
'/tmp/Endpoint_SlaveEndpointTest_AuthorizedRequest_2_Kdn8Nx/credential'
I1214 06:37:17.485690 30774 slave.cpp:352] Agent using credential for: test-principal
I1214 06:37:17.485709 30774 credentials.hpp:37] Loading credentials for authentication from
'/tmp/Endpoint_SlaveEndpointTest_AuthorizedRequest_2_Kdn8Nx/http_credentials'
I1214 06:37:17.485888 30774 http.cpp:922] Using default 'basic' HTTP authenticator for realm
'mesos-agent-readonly'
I1214 06:37:17.485996 30774 http.cpp:922] Using default 'basic' HTTP authenticator for realm
'mesos-agent-readwrite'
I1214 06:37:17.486878 30774 slave.cpp:539] Agent resources: cpus(*):2; mem(*):1024; disk(*):1024;
ports(*):[31000-32000]
I1214 06:37:17.486950 30774 slave.cpp:547] Agent attributes: [  ]
I1214 06:37:17.486963 30774 slave.cpp:552] Agent hostname: 90995dc2a1eb
I1214 06:37:17.488059 30766 state.cpp:57] Recovering state from '/tmp/Endpoint_SlaveEndpointTest_AuthorizedRequest_2_C3tQ43/meta'
I1214 06:37:17.488327 30764 status_update_manager.cpp:203] Recovering status update manager
I1214 06:37:17.488481 30765 containerizer.cpp:594] Recovering containerizer
I1214 06:37:17.489578 30773 provisioner.cpp:253] Provisioner recovery complete
I1214 06:37:17.489894 30767 slave.cpp:5420] Finished recovery
I1214 06:37:17.490259 30767 slave.cpp:5594] Querying resource estimator for oversubscribable
resources
I1214 06:37:17.490473 30763 slave.cpp:5608] Received oversubscribable resources {} from the
resource estimator
I1214 06:37:17.492317 30770 process.cpp:3679] Handling HTTP event for process 'slave(667)'
with path: '/slave(667)/containers'
I1214 06:37:17.493341 30760 http.cpp:874] Authorizing principal 'test-principal' to GET the
'/containers' endpoint
I1214 06:37:17.496127 30768 slave.cpp:796] Agent terminating
[       OK ] Endpoint/SlaveEndpointTest.AuthorizedRequest/2 (22 ms)
[ RUN      ] Endpoint/SlaveEndpointTest.UnauthorizedRequest/0
I1214 06:37:17.504402 30741 containerizer.cpp:220] Using isolation: posix/cpu,posix/mem,filesystem/posix,network/cni
W1214 06:37:17.504847 30741 backend.cpp:76] Failed to create 'aufs' backend: AufsBackend requires
root privileges, but is running as user mesos
W1214 06:37:17.504979 30741 backend.cpp:76] Failed to create 'bind' backend: BindBackend requires
root privileges
I1214 06:37:17.507562 30765 slave.cpp:209] Mesos agent started on (668)@172.17.0.4:51138
I1214 06:37:17.507585 30765 slave.cpp:210] Flags at startup: --acls="" --appc_simple_discovery_uri_prefix="http://"
--appc_store_dir="/tmp/mesos/store/appc" --authenticate_http_readonly="true" --authenticate_http_readwrite="true"
--authenticatee="crammd5" --authentication_backoff_factor="1secs" --authorizer="local" --cgroups_cpu_enable_pids_and_tids_count="false"
--cgroups_enable_cfs="false" --cgroups_hierarchy="/sys/fs/cgroup" --cgroups_limit_swap="false"
--cgroups_root="mesos" --container_disk_watch_interval="15secs" --containerizers="mesos" --credential="/tmp/Endpoint_SlaveEndpointTest_UnauthorizedRequest_0_gBquVs/credential"
--default_role="*" --disk_watch_interval="1mins" --docker="docker" --docker_kill_orphans="true"
--docker_registry="https://registry-1.docker.io" --docker_remove_delay="6hrs" --docker_socket="/var/run/docker.sock"
--docker_stop_timeout="0ns" --docker_store_dir="/tmp/mesos/store/docker" --docker_volume_checkpoint_dir="/var/run/mesos/isolators/docker/volume"
--enforce_container_disk_quota="false" --executor_registration_timeout="1mins" --executor_shutdown_grace_period="5secs"
--fetcher_cache_dir="/tmp/Endpoint_SlaveEndpointTest_UnauthorizedRequest_0_gBquVs/fetch" --fetcher_cache_size="2GB"
--frameworks_home="" --gc_delay="1weeks" --gc_disk_headroom="0.1" --hadoop_home="" --help="false"
--hostname_lookup="true" --http_authenticators="basic" --http_command_executor="false" --http_credentials="/tmp/Endpoint_SlaveEndpointTest_UnauthorizedRequest_0_gBquVs/http_credentials"
--http_heartbeat_interval="30secs" --image_provisioner_backend="copy" --initialize_driver_logging="true"
--isolation="posix/cpu,posix/mem" --launcher="posix" --launcher_dir="/mesos/mesos-1.2.0/_build/src"
--logbufsecs="0" --logging_level="INFO" --max_completed_executors_per_framework="150" --oversubscribed_resources_interval="15secs"
--perf_duration="10secs" --perf_interval="1mins" --qos_correction_interval_min="0ns" --quiet="false"
--recover="reconnect" --recovery_timeout="15mins" --registration_backoff_factor="10ms" --resources="cpus:2;gpus:0;mem:1024;disk:1024;ports:[31000-32000]"
--revocable_cpu_low_priority="true" --runtime_dir="/tmp/Endpoint_SlaveEndpointTest_UnauthorizedRequest_0_gBquVs"
--sandbox_directory="/mnt/mesos/sandbox" --strict="true" --switch_user="true" --systemd_enable_support="true"
--systemd_runtime_directory="/run/systemd/system" --version="false" --work_dir="/tmp/Endpoint_SlaveEndpointTest_UnauthorizedRequest_0_9n1z8Y"
I1214 06:37:17.507995 30765 credentials.hpp:86] Loading credential for authentication from
'/tmp/Endpoint_SlaveEndpointTest_UnauthorizedRequest_0_gBquVs/credential'
I1214 06:37:17.508121 30765 slave.cpp:352] Agent using credential for: test-principal
I1214 06:37:17.508143 30765 credentials.hpp:37] Loading credentials for authentication from
'/tmp/Endpoint_SlaveEndpointTest_UnauthorizedRequest_0_gBquVs/http_credentials'
I1214 06:37:17.508335 30765 http.cpp:922] Using default 'basic' HTTP authenticator for realm
'mesos-agent-readonly'
I1214 06:37:17.508460 30765 http.cpp:922] Using default 'basic' HTTP authenticator for realm
'mesos-agent-readwrite'
I1214 06:37:17.509338 30765 slave.cpp:539] Agent resources: cpus(*):2; mem(*):1024; disk(*):1024;
ports(*):[31000-32000]
I1214 06:37:17.509414 30765 slave.cpp:547] Agent attributes: [  ]
I1214 06:37:17.509431 30765 slave.cpp:552] Agent hostname: 90995dc2a1eb
I1214 06:37:17.510572 30767 state.cpp:57] Recovering state from '/tmp/Endpoint_SlaveEndpointTest_UnauthorizedRequest_0_9n1z8Y/meta'
I1214 06:37:17.510830 30761 status_update_manager.cpp:203] Recovering status update manager
I1214 06:37:17.510998 30773 containerizer.cpp:594] Recovering containerizer
I1214 06:37:17.512128 30772 provisioner.cpp:253] Provisioner recovery complete
I1214 06:37:17.512459 30760 slave.cpp:5420] Finished recovery
I1214 06:37:17.512850 30760 slave.cpp:5594] Querying resource estimator for oversubscribable
resources
I1214 06:37:17.513111 30761 slave.cpp:5608] Received oversubscribable resources {} from the
resource estimator
I1214 06:37:17.514860 30767 process.cpp:3679] Handling HTTP event for process 'slave(668)'
with path: '/slave(668)/monitor/statistics'
I1214 06:37:17.515871 30762 http.cpp:874] Authorizing principal 'test-principal' to GET the
'/monitor/statistics' endpoint
I1214 06:37:17.517642 30770 slave.cpp:796] Agent terminating
[       OK ] Endpoint/SlaveEndpointTest.UnauthorizedRequest/0 (21 ms)
[ RUN      ] Endpoint/SlaveEndpointTest.UnauthorizedRequest/1
I1214 06:37:17.525277 30741 containerizer.cpp:220] Using isolation: posix/cpu,posix/mem,filesystem/posix,network/cni
W1214 06:37:17.525719 30741 backend.cpp:76] Failed to create 'aufs' backend: AufsBackend requires
root privileges, but is running as user mesos
W1214 06:37:17.525852 30741 backend.cpp:76] Failed to create 'bind' backend: BindBackend requires
root privileges
I1214 06:37:17.528437 30761 slave.cpp:209] Mesos agent started on (669)@172.17.0.4:51138
I1214 06:37:17.528458 30761 slave.cpp:210] Flags at startup: --acls="" --appc_simple_discovery_uri_prefix="http://"
--appc_store_dir="/tmp/mesos/store/appc" --authenticate_http_readonly="true" --authenticate_http_readwrite="true"
--authenticatee="crammd5" --authentication_backoff_factor="1secs" --authorizer="local" --cgroups_cpu_enable_pids_and_tids_count="false"
--cgroups_enable_cfs="false" --cgroups_hierarchy="/sys/fs/cgroup" --cgroups_limit_swap="false"
--cgroups_root="mesos" --container_disk_watch_interval="15secs" --containerizers="mesos" --credential="/tmp/Endpoint_SlaveEndpointTest_UnauthorizedRequest_1_NCvFgo/credential"
--default_role="*" --disk_watch_interval="1mins" --docker="docker" --docker_kill_orphans="true"
--docker_registry="https://registry-1.docker.io" --docker_remove_delay="6hrs" --docker_socket="/var/run/docker.sock"
--docker_stop_timeout="0ns" --docker_store_dir="/tmp/mesos/store/docker" --docker_volume_checkpoint_dir="/var/run/mesos/isolators/docker/volume"
--enforce_container_disk_quota="false" --executor_registration_timeout="1mins" --executor_shutdown_grace_period="5secs"
--fetcher_cache_dir="/tmp/Endpoint_SlaveEndpointTest_UnauthorizedRequest_1_NCvFgo/fetch" --fetcher_cache_size="2GB"
--frameworks_home="" --gc_delay="1weeks" --gc_disk_headroom="0.1" --hadoop_home="" --help="false"
--hostname_lookup="true" --http_authenticators="basic" --http_command_executor="false" --http_credentials="/tmp/Endpoint_SlaveEndpointTest_UnauthorizedRequest_1_NCvFgo/http_credentials"
--http_heartbeat_interval="30secs" --image_provisioner_backend="copy" --initialize_driver_logging="true"
--isolation="posix/cpu,posix/mem" --launcher="posix" --launcher_dir="/mesos/mesos-1.2.0/_build/src"
--logbufsecs="0" --logging_level="INFO" --max_completed_executors_per_framework="150" --oversubscribed_resources_interval="15secs"
--perf_duration="10secs" --perf_interval="1mins" --qos_correction_interval_min="0ns" --quiet="false"
--recover="reconnect" --recovery_timeout="15mins" --registration_backoff_factor="10ms" --resources="cpus:2;gpus:0;mem:1024;disk:1024;ports:[31000-32000]"
--revocable_cpu_low_priority="true" --runtime_dir="/tmp/Endpoint_SlaveEndpointTest_UnauthorizedRequest_1_NCvFgo"
--sandbox_directory="/mnt/mesos/sandbox" --strict="true" --switch_user="true" --systemd_enable_support="true"
--systemd_runtime_directory="/run/systemd/system" --version="false" --work_dir="/tmp/Endpoint_SlaveEndpointTest_UnauthorizedRequest_1_H4tnqU"
I1214 06:37:17.528893 30761 credentials.hpp:86] Loading credential for authentication from
'/tmp/Endpoint_SlaveEndpointTest_UnauthorizedRequest_1_NCvFgo/credential'
I1214 06:37:17.529019 30761 slave.cpp:352] Agent using credential for: test-principal
I1214 06:37:17.529042 30761 credentials.hpp:37] Loading credentials for authentication from
'/tmp/Endpoint_SlaveEndpointTest_UnauthorizedRequest_1_NCvFgo/http_credentials'
I1214 06:37:17.529232 30761 http.cpp:922] Using default 'basic' HTTP authenticator for realm
'mesos-agent-readonly'
I1214 06:37:17.529353 30761 http.cpp:922] Using default 'basic' HTTP authenticator for realm
'mesos-agent-readwrite'
I1214 06:37:17.530217 30761 slave.cpp:539] Agent resources: cpus(*):2; mem(*):1024; disk(*):1024;
ports(*):[31000-32000]
I1214 06:37:17.530292 30761 slave.cpp:547] Agent attributes: [  ]
I1214 06:37:17.530308 30761 slave.cpp:552] Agent hostname: 90995dc2a1eb
I1214 06:37:17.531384 30767 state.cpp:57] Recovering state from '/tmp/Endpoint_SlaveEndpointTest_UnauthorizedRequest_1_H4tnqU/meta'
I1214 06:37:17.531668 30765 status_update_manager.cpp:203] Recovering status update manager
I1214 06:37:17.531837 30762 containerizer.cpp:594] Recovering containerizer
I1214 06:37:17.532918 30773 provisioner.cpp:253] Provisioner recovery complete
I1214 06:37:17.533238 30771 slave.cpp:5420] Finished recovery
I1214 06:37:17.533735 30771 slave.cpp:5594] Querying resource estimator for oversubscribable
resources
I1214 06:37:17.533937 30769 slave.cpp:5608] Received oversubscribable resources {} from the
resource estimator
I1214 06:37:17.535553 30768 process.cpp:3679] Handling HTTP event for process 'slave(669)'
with path: '/slave(669)/monitor/statistics.json'
I1214 06:37:17.536540 30771 http.cpp:874] Authorizing principal 'test-principal' to GET the
'/monitor/statistics.json' endpoint
I1214 06:37:17.538400 30770 slave.cpp:796] Agent terminating
[       OK ] Endpoint/SlaveEndpointTest.UnauthorizedRequest/1 (20 ms)
[ RUN      ] Endpoint/SlaveEndpointTest.UnauthorizedRequest/2
I1214 06:37:17.545811 30741 containerizer.cpp:220] Using isolation: posix/cpu,posix/mem,filesystem/posix,network/cni
W1214 06:37:17.546331 30741 backend.cpp:76] Failed to create 'aufs' backend: AufsBackend requires
root privileges, but is running as user mesos
W1214 06:37:17.546452 30741 backend.cpp:76] Failed to create 'bind' backend: BindBackend requires
root privileges
I1214 06:37:17.548941 30774 slave.cpp:209] Mesos agent started on (670)@172.17.0.4:51138
I1214 06:37:17.548960 30774 slave.cpp:210] Flags at startup: --acls="" --appc_simple_discovery_uri_prefix="http://"
--appc_store_dir="/tmp/mesos/store/appc" --authenticate_http_readonly="true" --authenticate_http_readwrite="true"
--authenticatee="crammd5" --authentication_backoff_factor="1secs" --authorizer="local" --cgroups_cpu_enable_pids_and_tids_count="false"
--cgroups_enable_cfs="false" --cgroups_hierarchy="/sys/fs/cgroup" --cgroups_limit_swap="false"
--cgroups_root="mesos" --container_disk_watch_interval="15secs" --containerizers="mesos" --credential="/tmp/Endpoint_SlaveEndpointTest_UnauthorizedRequest_2_lFVePj/credential"
--default_role="*" --disk_watch_interval="1mins" --docker="docker" --docker_kill_orphans="true"
--docker_registry="https://registry-1.docker.io" --docker_remove_delay="6hrs" --docker_socket="/var/run/docker.sock"
--docker_stop_timeout="0ns" --docker_store_dir="/tmp/mesos/store/docker" --docker_volume_checkpoint_dir="/var/run/mesos/isolators/docker/volume"
--enforce_container_disk_quota="false" --executor_registration_timeout="1mins" --executor_shutdown_grace_period="5secs"
--fetcher_cache_dir="/tmp/Endpoint_SlaveEndpointTest_UnauthorizedRequest_2_lFVePj/fetch" --fetcher_cache_size="2GB"
--frameworks_home="" --gc_delay="1weeks" --gc_disk_headroom="0.1" --hadoop_home="" --help="false"
--hostname_lookup="true" --http_authenticators="basic" --http_command_executor="false" --http_credentials="/tmp/Endpoint_SlaveEndpointTest_UnauthorizedRequest_2_lFVePj/http_credentials"
--http_heartbeat_interval="30secs" --image_provisioner_backend="copy" --initialize_driver_logging="true"
--isolation="posix/cpu,posix/mem" --launcher="posix" --launcher_dir="/mesos/mesos-1.2.0/_build/src"
--logbufsecs="0" --logging_level="INFO" --max_completed_executors_per_framework="150" --oversubscribed_resources_interval="15secs"
--perf_duration="10secs" --perf_interval="1mins" --qos_correction_interval_min="0ns" --quiet="false"
--recover="reconnect" --recovery_timeout="15mins" --registration_backoff_factor="10ms" --resources="cpus:2;gpus:0;mem:1024;disk:1024;ports:[31000-32000]"
--revocable_cpu_low_priority="true" --runtime_dir="/tmp/Endpoint_SlaveEndpointTest_UnauthorizedRequest_2_lFVePj"
--sandbox_directory="/mnt/mesos/sandbox" --strict="true" --switch_user="true" --systemd_enable_support="true"
--systemd_runtime_directory="/run/systemd/system" --version="false" --work_dir="/tmp/Endpoint_SlaveEndpointTest_UnauthorizedRequest_2_RBiCVP"
I1214 06:37:17.549381 30774 credentials.hpp:86] Loading credential for authentication from
'/tmp/Endpoint_SlaveEndpointTest_UnauthorizedRequest_2_lFVePj/credential'
I1214 06:37:17.549492 30774 slave.cpp:352] Agent using credential for: test-principal
I1214 06:37:17.549511 30774 credentials.hpp:37] Loading credentials for authentication from
'/tmp/Endpoint_SlaveEndpointTest_UnauthorizedRequest_2_lFVePj/http_credentials'
I1214 06:37:17.549687 30774 http.cpp:922] Using default 'basic' HTTP authenticator for realm
'mesos-agent-readonly'
I1214 06:37:17.549793 30774 http.cpp:922] Using default 'basic' HTTP authenticator for realm
'mesos-agent-readwrite'
I1214 06:37:17.550755 30774 slave.cpp:539] Agent resources: cpus(*):2; mem(*):1024; disk(*):1024;
ports(*):[31000-32000]
I1214 06:37:17.550827 30774 slave.cpp:547] Agent attributes: [  ]
I1214 06:37:17.550840 30774 slave.cpp:552] Agent hostname: 90995dc2a1eb
I1214 06:37:17.551925 30767 state.cpp:57] Recovering state from '/tmp/Endpoint_SlaveEndpointTest_UnauthorizedRequest_2_RBiCVP/meta'
I1214 06:37:17.552126 30770 status_update_manager.cpp:203] Recovering status update manager
I1214 06:37:17.552304 30772 containerizer.cpp:594] Recovering containerizer
I1214 06:37:17.553414 30765 provisioner.cpp:253] Provisioner recovery complete
I1214 06:37:17.553725 30768 slave.cpp:5420] Finished recovery
I1214 06:37:17.554085 30768 slave.cpp:5594] Querying resource estimator for oversubscribable
resources
I1214 06:37:17.554275 30760 slave.cpp:5608] Received oversubscribable resources {} from the
resource estimator
I1214 06:37:17.555950 30772 process.cpp:3679] Handling HTTP event for process 'slave(670)'
with path: '/slave(670)/containers'
I1214 06:37:17.556918 30764 http.cpp:874] Authorizing principal 'test-principal' to GET the
'/containers' endpoint
I1214 06:37:17.558940 30766 slave.cpp:796] Agent terminating
[       OK ] Endpoint/SlaveEndpointTest.UnauthorizedRequest/2 (20 ms)
[ RUN      ] Endpoint/SlaveEndpointTest.NoAuthorizer/0
I1214 06:37:17.566570 30741 containerizer.cpp:220] Using isolation: posix/cpu,posix/mem,filesystem/posix,network/cni
W1214 06:37:17.567009 30741 backend.cpp:76] Failed to create 'aufs' backend: AufsBackend requires
root privileges, but is running as user mesos
W1214 06:37:17.567136 30741 backend.cpp:76] Failed to create 'bind' backend: BindBackend requires
root privileges
I1214 06:37:17.568392 30741 cluster.cpp:446] Creating default 'local' authorizer
I1214 06:37:17.569656 30767 slave.cpp:209] Mesos agent started on (671)@172.17.0.4:51138
I1214 06:37:17.569679 30767 slave.cpp:210] Flags at startup: --acls="" --appc_simple_discovery_uri_prefix="http://"
--appc_store_dir="/tmp/mesos/store/appc" --authenticate_http_readonly="true" --authenticate_http_readwrite="true"
--authenticatee="crammd5" --authentication_backoff_factor="1secs" --authorizer="local" --cgroups_cpu_enable_pids_and_tids_count="false"
--cgroups_enable_cfs="false" --cgroups_hierarchy="/sys/fs/cgroup" --cgroups_limit_swap="false"
--cgroups_root="mesos" --container_disk_watch_interval="15secs" --containerizers="mesos" --credential="/tmp/Endpoint_SlaveEndpointTest_NoAuthorizer_0_nbBcBf/credential"
--default_role="*" --disk_watch_interval="1mins" --docker="docker" --docker_kill_orphans="true"
--docker_registry="https://registry-1.docker.io" --docker_remove_delay="6hrs" --docker_socket="/var/run/docker.sock"
--docker_stop_timeout="0ns" --docker_store_dir="/tmp/mesos/store/docker" --docker_volume_checkpoint_dir="/var/run/mesos/isolators/docker/volume"
--enforce_container_disk_quota="false" --executor_registration_timeout="1mins" --executor_shutdown_grace_period="5secs"
--fetcher_cache_dir="/tmp/Endpoint_SlaveEndpointTest_NoAuthorizer_0_nbBcBf/fetch" --fetcher_cache_size="2GB"
--frameworks_home="" --gc_delay="1weeks" --gc_disk_headroom="0.1" --hadoop_home="" --help="false"
--hostname_lookup="true" --http_authenticators="basic" --http_command_executor="false" --http_credentials="/tmp/Endpoint_SlaveEndpointTest_NoAuthorizer_0_nbBcBf/http_credentials"
--http_heartbeat_interval="30secs" --image_provisioner_backend="copy" --initialize_driver_logging="true"
--isolation="posix/cpu,posix/mem" --launcher="posix" --launcher_dir="/mesos/mesos-1.2.0/_build/src"
--logbufsecs="0" --logging_level="INFO" --max_completed_executors_per_framework="150" --oversubscribed_resources_interval="15secs"
--perf_duration="10secs" --perf_interval="1mins" --qos_correction_interval_min="0ns" --quiet="false"
--recover="reconnect" --recovery_timeout="15mins" --registration_backoff_factor="10ms" --resources="cpus:2;gpus:0;mem:1024;disk:1024;ports:[31000-32000]"
--revocable_cpu_low_priority="true" --runtime_dir="/tmp/Endpoint_SlaveEndpointTest_NoAuthorizer_0_nbBcBf"
--sandbox_directory="/mnt/mesos/sandbox" --strict="true" --switch_user="true" --systemd_enable_support="true"
--systemd_runtime_directory="/run/systemd/system" --version="false" --work_dir="/tmp/Endpoint_SlaveEndpointTest_NoAuthorizer_0_7KDdEL"
I1214 06:37:17.570307 30767 credentials.hpp:86] Loading credential for authentication from
'/tmp/Endpoint_SlaveEndpointTest_NoAuthorizer_0_nbBcBf/credential'
I1214 06:37:17.570456 30767 slave.cpp:352] Agent using credential for: test-principal
I1214 06:37:17.570480 30767 credentials.hpp:37] Loading credentials for authentication from
'/tmp/Endpoint_SlaveEndpointTest_NoAuthorizer_0_nbBcBf/http_credentials'
I1214 06:37:17.570741 30767 http.cpp:922] Using default 'basic' HTTP authenticator for realm
'mesos-agent-readonly'
I1214 06:37:17.570914 30767 http.cpp:922] Using default 'basic' HTTP authenticator for realm
'mesos-agent-readwrite'
I1214 06:37:17.571806 30767 slave.cpp:539] Agent resources: cpus(*):2; mem(*):1024; disk(*):1024;
ports(*):[31000-32000]
I1214 06:37:17.571889 30767 slave.cpp:547] Agent attributes: [  ]
I1214 06:37:17.571910 30767 slave.cpp:552] Agent hostname: 90995dc2a1eb
I1214 06:37:17.573060 30775 state.cpp:57] Recovering state from '/tmp/Endpoint_SlaveEndpointTest_NoAuthorizer_0_7KDdEL/meta'
I1214 06:37:17.573261 30763 status_update_manager.cpp:203] Recovering status update manager
I1214 06:37:17.573417 30764 containerizer.cpp:594] Recovering containerizer
I1214 06:37:17.574512 30764 provisioner.cpp:253] Provisioner recovery complete
I1214 06:37:17.574822 30771 slave.cpp:5420] Finished recovery
I1214 06:37:17.575209 30771 slave.cpp:5594] Querying resource estimator for oversubscribable
resources
I1214 06:37:17.575547 30774 slave.cpp:5608] Received oversubscribable resources {} from the
resource estimator
I1214 06:37:17.577221 30775 process.cpp:3679] Handling HTTP event for process 'slave(671)'
with path: '/slave(671)/monitor/statistics'
I1214 06:37:17.578161 30769 http.cpp:874] Authorizing principal 'test-principal' to GET the
'/monitor/statistics' endpoint
I1214 06:37:17.580652 30769 slave.cpp:796] Agent terminating
[       OK ] Endpoint/SlaveEndpointTest.NoAuthorizer/0 (22 ms)
[ RUN      ] Endpoint/SlaveEndpointTest.NoAuthorizer/1
I1214 06:37:17.588354 30741 containerizer.cpp:220] Using isolation: posix/cpu,posix/mem,filesystem/posix,network/cni
W1214 06:37:17.588781 30741 backend.cpp:76] Failed to create 'aufs' backend: AufsBackend requires
root privileges, but is running as user mesos
W1214 06:37:17.588902 30741 backend.cpp:76] Failed to create 'bind' backend: BindBackend requires
root privileges
I1214 06:37:17.590257 30741 cluster.cpp:446] Creating default 'local' authorizer
I1214 06:37:17.591584 30769 slave.cpp:209] Mesos agent started on (672)@172.17.0.4:51138
I1214 06:37:17.591605 30769 slave.cpp:210] Flags at startup: --acls="" --appc_simple_discovery_uri_prefix="http://"
--appc_store_dir="/tmp/mesos/store/appc" --authenticate_http_readonly="true" --authenticate_http_readwrite="true"
--authenticatee="crammd5" --authentication_backoff_factor="1secs" --authorizer="local" --cgroups_cpu_enable_pids_and_tids_count="false"
--cgroups_enable_cfs="false" --cgroups_hierarchy="/sys/fs/cgroup" --cgroups_limit_swap="false"
--cgroups_root="mesos" --container_disk_watch_interval="15secs" --containerizers="mesos" --credential="/tmp/Endpoint_SlaveEndpointTest_NoAuthorizer_1_StnbBb/credential"
--default_role="*" --disk_watch_interval="1mins" --docker="docker" --docker_kill_orphans="true"
--docker_registry="https://registry-1.docker.io" --docker_remove_delay="6hrs" --docker_socket="/var/run/docker.sock"
--docker_stop_timeout="0ns" --docker_store_dir="/tmp/mesos/store/docker" --docker_volume_checkpoint_dir="/var/run/mesos/isolators/docker/volume"
--enforce_container_disk_quota="false" --executor_registration_timeout="1mins" --executor_shutdown_grace_period="5secs"
--fetcher_cache_dir="/tmp/Endpoint_SlaveEndpointTest_NoAuthorizer_1_StnbBb/fetch" --fetcher_cache_size="2GB"
--frameworks_home="" --gc_delay="1weeks" --gc_disk_headroom="0.1" --hadoop_home="" --help="false"
--hostname_lookup="true" --http_authenticators="basic" --http_command_executor="false" --http_credentials="/tmp/Endpoint_SlaveEndpointTest_NoAuthorizer_1_StnbBb/http_credentials"
--http_heartbeat_interval="30secs" --image_provisioner_backend="copy" --initialize_driver_logging="true"
--isolation="posix/cpu,posix/mem" --launcher="posix" --launcher_dir="/mesos/mesos-1.2.0/_build/src"
--logbufsecs="0" --logging_level="INFO" --max_completed_executors_per_framework="150" --oversubscribed_resources_interval="15secs"
--perf_duration="10secs" --perf_interval="1mins" --qos_correction_interval_min="0ns" --quiet="false"
--recover="reconnect" --recovery_timeout="15mins" --registration_backoff_factor="10ms" --resources="cpus:2;gpus:0;mem:1024;disk:1024;ports:[31000-32000]"
--revocable_cpu_low_priority="true" --runtime_dir="/tmp/Endpoint_SlaveEndpointTest_NoAuthorizer_1_StnbBb"
--sandbox_directory="/mnt/mesos/sandbox" --strict="true" --switch_user="true" --systemd_enable_support="true"
--systemd_runtime_directory="/run/systemd/system" --version="false" --work_dir="/tmp/Endpoint_SlaveEndpointTest_NoAuthorizer_1_C7zFAH"
I1214 06:37:17.592231 30769 credentials.hpp:86] Loading credential for authentication from
'/tmp/Endpoint_SlaveEndpointTest_NoAuthorizer_1_StnbBb/credential'
I1214 06:37:17.592380 30769 slave.cpp:352] Agent using credential for: test-principal
I1214 06:37:17.592403 30769 credentials.hpp:37] Loading credentials for authentication from
'/tmp/Endpoint_SlaveEndpointTest_NoAuthorizer_1_StnbBb/http_credentials'
I1214 06:37:17.592661 30769 http.cpp:922] Using default 'basic' HTTP authenticator for realm
'mesos-agent-readonly'
I1214 06:37:17.592769 30769 http.cpp:922] Using default 'basic' HTTP authenticator for realm
'mesos-agent-readwrite'
I1214 06:37:17.593602 30769 slave.cpp:539] Agent resources: cpus(*):2; mem(*):1024; disk(*):1024;
ports(*):[31000-32000]
I1214 06:37:17.593674 30769 slave.cpp:547] Agent attributes: [  ]
I1214 06:37:17.593685 30769 slave.cpp:552] Agent hostname: 90995dc2a1eb
I1214 06:37:17.594769 30772 state.cpp:57] Recovering state from '/tmp/Endpoint_SlaveEndpointTest_NoAuthorizer_1_C7zFAH/meta'
I1214 06:37:17.595021 30760 status_update_manager.cpp:203] Recovering status update manager
I1214 06:37:17.595171 30761 containerizer.cpp:594] Recovering containerizer
I1214 06:37:17.596261 30766 provisioner.cpp:253] Provisioner recovery complete
I1214 06:37:17.596585 30769 slave.cpp:5420] Finished recovery
I1214 06:37:17.597003 30769 slave.cpp:5594] Querying resource estimator for oversubscribable
resources
I1214 06:37:17.597196 30764 slave.cpp:5608] Received oversubscribable resources {} from the
resource estimator
I1214 06:37:17.598805 30765 process.cpp:3679] Handling HTTP event for process 'slave(672)'
with path: '/slave(672)/monitor/statistics.json'
I1214 06:37:17.599786 30774 http.cpp:874] Authorizing principal 'test-principal' to GET the
'/monitor/statistics.json' endpoint
I1214 06:37:17.602155 30771 slave.cpp:796] Agent terminating
[       OK ] Endpoint/SlaveEndpointTest.NoAuthorizer/1 (22 ms)
[ RUN      ] Endpoint/SlaveEndpointTest.NoAuthorizer/2
I1214 06:37:17.610522 30741 containerizer.cpp:220] Using isolation: posix/cpu,posix/mem,filesystem/posix,network/cni
W1214 06:37:17.610954 30741 backend.cpp:76] Failed to create 'aufs' backend: AufsBackend requires
root privileges, but is running as user mesos
W1214 06:37:17.611098 30741 backend.cpp:76] Failed to create 'bind' backend: BindBackend requires
root privileges
I1214 06:37:17.612475 30741 cluster.cpp:446] Creating default 'local' authorizer
I1214 06:37:17.613768 30761 slave.cpp:209] Mesos agent started on (673)@172.17.0.4:51138
I1214 06:37:17.613791 30761 slave.cpp:210] Flags at startup: --acls="" --appc_simple_discovery_uri_prefix="http://"
--appc_store_dir="/tmp/mesos/store/appc" --authenticate_http_readonly="true" --authenticate_http_readwrite="true"
--authenticatee="crammd5" --authentication_backoff_factor="1secs" --authorizer="local" --cgroups_cpu_enable_pids_and_tids_count="false"
--cgroups_enable_cfs="false" --cgroups_hierarchy="/sys/fs/cgroup" --cgroups_limit_swap="false"
--cgroups_root="mesos" --container_disk_watch_interval="15secs" --containerizers="mesos" --credential="/tmp/Endpoint_SlaveEndpointTest_NoAuthorizer_2_TaXhP7/credential"
--default_role="*" --disk_watch_interval="1mins" --docker="docker" --docker_kill_orphans="true"
--docker_registry="https://registry-1.docker.io" --docker_remove_delay="6hrs" --docker_socket="/var/run/docker.sock"
--docker_stop_timeout="0ns" --docker_store_dir="/tmp/mesos/store/docker" --docker_volume_checkpoint_dir="/var/run/mesos/isolators/docker/volume"
--enforce_container_disk_quota="false" --executor_registration_timeout="1mins" --executor_shutdown_grace_period="5secs"
--fetcher_cache_dir="/tmp/Endpoint_SlaveEndpointTest_NoAuthorizer_2_TaXhP7/fetch" --fetcher_cache_size="2GB"
--frameworks_home="" --gc_delay="1weeks" --gc_disk_headroom="0.1" --hadoop_home="" --help="false"
--hostname_lookup="true" --http_authenticators="basic" --http_command_executor="false" --http_credentials="/tmp/Endpoint_SlaveEndpointTest_NoAuthorizer_2_TaXhP7/http_credentials"
--http_heartbeat_interval="30secs" --image_provisioner_backend="copy" --initialize_driver_logging="true"
--isolation="posix/cpu,posix/mem" --launcher="posix" --launcher_dir="/mesos/mesos-1.2.0/_build/src"
--logbufsecs="0" --logging_level="INFO" --max_completed_executors_per_framework="150" --oversubscribed_resources_interval="15secs"
--perf_duration="10secs" --perf_interval="1mins" --qos_correction_interval_min="0ns" --quiet="false"
--recover="reconnect" --recovery_timeout="15mins" --registration_backoff_factor="10ms" --resources="cpus:2;gpus:0;mem:1024;disk:1024;ports:[31000-32000]"
--revocable_cpu_low_priority="true" --runtime_dir="/tmp/Endpoint_SlaveEndpointTest_NoAuthorizer_2_TaXhP7"
--sandbox_directory="/mnt/mesos/sandbox" --strict="true" --switch_user="true" --systemd_enable_support="true"
--systemd_runtime_directory="/run/systemd/system" --version="false" --work_dir="/tmp/Endpoint_SlaveEndpointTest_NoAuthorizer_2_H68eLD"
I1214 06:37:17.614253 30761 credentials.hpp:86] Loading credential for authentication from
'/tmp/Endpoint_SlaveEndpointTest_NoAuthorizer_2_TaXhP7/credential'
I1214 06:37:17.614365 30761 slave.cpp:352] Agent using credential for: test-principal
I1214 06:37:17.614383 30761 credentials.hpp:37] Loading credentials for authentication from
'/tmp/Endpoint_SlaveEndpointTest_NoAuthorizer_2_TaXhP7/http_credentials'
I1214 06:37:17.614559 30761 http.cpp:922] Using default 'basic' HTTP authenticator for realm
'mesos-agent-readonly'
I1214 06:37:17.614675 30761 http.cpp:922] Using default 'basic' HTTP authenticator for realm
'mesos-agent-readwrite'
I1214 06:37:17.615571 30761 slave.cpp:539] Agent resources: cpus(*):2; mem(*):1024; disk(*):1024;
ports(*):[31000-32000]
I1214 06:37:17.615643 30761 slave.cpp:547] Agent attributes: [  ]
I1214 06:37:17.615653 30761 slave.cpp:552] Agent hostname: 90995dc2a1eb
I1214 06:37:17.616742 30775 state.cpp:57] Recovering state from '/tmp/Endpoint_SlaveEndpointTest_NoAuthorizer_2_H68eLD/meta'
I1214 06:37:17.616938 30764 status_update_manager.cpp:203] Recovering status update manager
I1214 06:37:17.617095 30766 containerizer.cpp:594] Recovering containerizer
I1214 06:37:17.618116 30766 provisioner.cpp:253] Provisioner recovery complete
I1214 06:37:17.618432 30761 slave.cpp:5420] Finished recovery
I1214 06:37:17.618852 30761 slave.cpp:5594] Querying resource estimator for oversubscribable
resources
I1214 06:37:17.619104 30764 slave.cpp:5608] Received oversubscribable resources {} from the
resource estimator
I1214 06:37:17.620810 30762 process.cpp:3679] Handling HTTP event for process 'slave(673)'
with path: '/slave(673)/containers'
I1214 06:37:17.621753 30766 http.cpp:874] Authorizing principal 'test-principal' to GET the
'/containers' endpoint
I1214 06:37:17.624599 30774 slave.cpp:796] Agent terminating
[       OK ] Endpoint/SlaveEndpointTest.NoAuthorizer/2 (22 ms)
[----------] 9 tests from Endpoint/SlaveEndpointTest (195 ms total)

[----------] Global test environment tear-down
[==========] 1428 tests from 164 test cases ran. (416884 ms total)
[  PASSED  ] 1427 tests.
[  FAILED  ] 1 test, listed below:
[  FAILED  ] SlaveRecoveryTest/0.CleanupExecutor, where TypeParam = mesos::internal::slave::MesosContainerizer

 1 FAILED TEST
  YOU HAVE 9 DISABLED TESTS

make[4]: *** [check-local] Error 1
make[4]: Leaving directory `/mesos/mesos-1.2.0/_build/src'
make[3]: *** [check-am] Error 2
make[3]: Leaving directory `/mesos/mesos-1.2.0/_build/src'
make[2]: *** [check] Error 2
make[2]: Leaving directory `/mesos/mesos-1.2.0/_build/src'
make[1]: *** [check-recursive] Error 1
make[1]: Leaving directory `/mesos/mesos-1.2.0/_build'
make: *** [distcheck] Error 1
+ docker rmi mesos-1481695021-23899
Untagged: mesos-1481695021-23899:latest
Deleted: sha256:15a40f3710e21ab1ae5c73e5ca5c0b3578b3f0a8007f83bc4747d6487199ee2f
Deleted: sha256:67d34991987abbda9926c1a30c8aa27141b1247e6c0c55e4b36831561e9271a7
Deleted: sha256:0e3fb73ef20dea416465e04d32a6e79779a640073aed8e732c6ee2eb58ec639a
Deleted: sha256:00e038435de96cf4e1275ec67c2e67869509c7733140964d2b5c4772d008a18c
Deleted: sha256:09db4949ffe280ee2c426f52a407429463c1c4f5c0cd40b649f2b863b221e9a4
Deleted: sha256:6cb1db98994f237f5cc343822ae9bcae2283edb4fa2108ba7801cec251b01d84
Deleted: sha256:63f8784b961998b590e5209f97dc199107486ee0fd9cb66cc600798d65ce3a46
Deleted: sha256:63477ad2e8084337cee765554345592a3c7536e2dc49afe5e1fe24e7c50c6d20
Deleted: sha256:e1748d2518848639f0975ed93a51777a4904a6d1c546581c5acaf960fb0cc62d
Deleted: sha256:e5d045d5f0065b7a02735d5f750b35489a2207308820171791bb894722b3c120
Deleted: sha256:6e98afd2a409cac8299597e6b604b0859185be3e949264c40c894aa21d43d016
Deleted: sha256:c758351974400d10519da7d114a37390e7ae6bdffb11268243b7598ce5b60fc2
Deleted: sha256:a4a26a23022f1607234a8741bb29d54c7d0c47f58d66ac7a2a37c2e20d076d69
Deleted: sha256:48f12d26e056ae17b94c149cfe92bdfaf05d3802afd7608e36225f3863c1f3e8
Deleted: sha256:a525e8caa978536b8ad37f903e9315d7f0c0faf0bf15ea29b4def4ef09d816c0
Deleted: sha256:69b37c492d89e581ffb71f5ce4cddce1a5b0c63928c5b3c43f16bede96489702
Deleted: sha256:487c9a6bbca6f805172d16c815a168253950211d9680f97bb475b349ec0559ea
Deleted: sha256:3782190b17a225da8fdc074a818273fe79c96c574c3e1ba4a40d034b7810c01a
Deleted: sha256:838ea20c344ebc6f1d1be9a57c234b14487431cc44a1be18549fa25b391f7c77
Deleted: sha256:e7f0b5f7e24d75e4cdc0a09e8e8e0a0e7028a90da52b0ac385d9ab12be1e9dc9
Deleted: sha256:9f84c046ae6f6546343d09ffb216e31dc712db362feccf5f77a177bb51f941e8
Deleted: sha256:fcad10802104fc0e5c48867ec3425ec2d020d4463dab815608f6f396d9dacd34
Deleted: sha256:50101326e9221ba43d19cef9576fa1169e5fdf77417390c5385f1eacdd598ec6
Deleted: sha256:ba37a2bf5a43069ed4e0f1781a1d11f05a2db59bc48a32238af967ef07761cea
Deleted: sha256:5b8e65e2cf74e615409d6f752e0ecb8693f5b70913543f4061e6fdb15d1f7a68
Build step 'Execute shell' marked build as failure

Mime
View raw message