mesos-builds mailing list archives

Site index · List index
Message view « Date » · « Thread »
Top « Date » · « Thread »
From Apache Jenkins Server <jenk...@builds.apache.org>
Subject Build failed in Jenkins: Mesos-Windows #967
Date Mon, 12 Dec 2016 01:15:14 GMT
See <https://builds.apache.org/job/Mesos-Windows/967/changes>

Changes:

[vinodkone] Change `Accept-Type` to `Accept` in operator api docs.

------------------------------------------
[...truncated 6608 lines...]
         F:\jenkins\jenkins-slave\workspace\Mesos-Windows\3rdparty\stout\include\stout/os/socket.hpp(34): warning C4244: '=': conversion from 'SOCKET' to 'int', possible loss of data (compiling source file F:\jenkins\jenkins-slave\workspace\Mesos-Windows\3rdparty\libprocess\src\subprocess.cpp) [<https://builds.apache.org/job/Mesos-Windows/ws/build\3rdparty\libprocess\src\process-0.0.1.vcxproj]>
         F:\jenkins\jenkins-slave\workspace\Mesos-Windows\3rdparty\stout\include\stout/os/windows/close.hpp(51): warning C4800: 'BOOL': forcing value to bool 'true' or 'false' (performance warning) (compiling source file F:\jenkins\jenkins-slave\workspace\Mesos-Windows\3rdparty\libprocess\src\subprocess.cpp) [<https://builds.apache.org/job/Mesos-Windows/ws/build\3rdparty\libprocess\src\process-0.0.1.vcxproj]>
         F:\jenkins\jenkins-slave\workspace\Mesos-Windows\3rdparty\stout\include\stout/windows/os.hpp(49): warning C4996: 'GetVersionExA': was declared deprecated (compiling source file F:\jenkins\jenkins-slave\workspace\Mesos-Windows\3rdparty\libprocess\src\socket.cpp) [<https://builds.apache.org/job/Mesos-Windows/ws/build\3rdparty\libprocess\src\process-0.0.1.vcxproj]>
         F:\jenkins\jenkins-slave\workspace\Mesos-Windows\3rdparty\stout\include\stout/windows/os.hpp(457): warning C4996: 'GetVersionExA': was declared deprecated (compiling source file F:\jenkins\jenkins-slave\workspace\Mesos-Windows\3rdparty\libprocess\src\socket.cpp) [<https://builds.apache.org/job/Mesos-Windows/ws/build\3rdparty\libprocess\src\process-0.0.1.vcxproj]>
         F:\jenkins\jenkins-slave\workspace\Mesos-Windows\3rdparty\stout\include\stout/os/windows/shell.hpp(119): warning C4244: 'return': conversion from 'intptr_t' to 'int', possible loss of data (compiling source file F:\jenkins\jenkins-slave\workspace\Mesos-Windows\3rdparty\libprocess\src\socket.cpp) [<https://builds.apache.org/job/Mesos-Windows/ws/build\3rdparty\libprocess\src\process-0.0.1.vcxproj]>
         F:\jenkins\jenkins-slave\workspace\Mesos-Windows\3rdparty\stout\include\stout/os/windows/shell.hpp(119): warning C4244: 'return': conversion from 'intptr_t' to 'int', possible loss of data (compiling source file F:\jenkins\jenkins-slave\workspace\Mesos-Windows\3rdparty\libprocess\src\subprocess.cpp) [<https://builds.apache.org/job/Mesos-Windows/ws/build\3rdparty\libprocess\src\process-0.0.1.vcxproj]>
         F:\jenkins\jenkins-slave\workspace\Mesos-Windows\3rdparty\stout\include\stout/windows/os.hpp(49): warning C4996: 'GetVersionExA': was declared deprecated (compiling source file F:\jenkins\jenkins-slave\workspace\Mesos-Windows\3rdparty\libprocess\src\subprocess.cpp) [<https://builds.apache.org/job/Mesos-Windows/ws/build\3rdparty\libprocess\src\process-0.0.1.vcxproj]>
         F:\jenkins\jenkins-slave\workspace\Mesos-Windows\3rdparty\stout\include\stout/windows/os.hpp(457): warning C4996: 'GetVersionExA': was declared deprecated (compiling source file F:\jenkins\jenkins-slave\workspace\Mesos-Windows\3rdparty\libprocess\src\subprocess.cpp) [<https://builds.apache.org/job/Mesos-Windows/ws/build\3rdparty\libprocess\src\process-0.0.1.vcxproj]>
         f:\jenkins\jenkins-slave\workspace\mesos-windows\3rdparty\libprocess\src\socket.cpp(47): warning C4715: 'process::network::internal::SocketImpl::create': not all control paths return a value [<https://builds.apache.org/job/Mesos-Windows/ws/build\3rdparty\libprocess\src\process-0.0.1.vcxproj]>
         f:\jenkins\jenkins-slave\workspace\mesos-windows\3rdparty\libprocess\src\socket.cpp(61): warning C4715: '<lambda_a7e2a9c0692741259237c30a025f5b41>::operator()': not all control paths return a value [<https://builds.apache.org/job/Mesos-Windows/ws/build\3rdparty\libprocess\src\process-0.0.1.vcxproj]>
         f:\jenkins\jenkins-slave\workspace\mesos-windows\3rdparty\libprocess\include\process\address.hpp(106): warning C4715: 'process::network::Address::size': not all control paths return a value [<https://builds.apache.org/job/Mesos-Windows/ws/build\3rdparty\libprocess\src\process-0.0.1.vcxproj]>
         F:\jenkins\jenkins-slave\workspace\Mesos-Windows\3rdparty\stout\include\stout/duration.hpp(99): warning C4244: '=': conversion from 'double' to 'long', possible loss of data (compiling source file F:\jenkins\jenkins-slave\workspace\Mesos-Windows\3rdparty\libprocess\src\time.cpp) [<https://builds.apache.org/job/Mesos-Windows/ws/build\3rdparty\libprocess\src\process-0.0.1.vcxproj]>
         F:\jenkins\jenkins-slave\workspace\Mesos-Windows\3rdparty\stout\include\stout/duration.hpp(100): warning C4244: '=': conversion from 'double' to 'long', possible loss of data (compiling source file F:\jenkins\jenkins-slave\workspace\Mesos-Windows\3rdparty\libprocess\src\time.cpp) [<https://builds.apache.org/job/Mesos-Windows/ws/build\3rdparty\libprocess\src\process-0.0.1.vcxproj]>
         F:\jenkins\jenkins-slave\workspace\Mesos-Windows\3rdparty\stout\include\stout/os/socket.hpp(34): warning C4244: '=': conversion from 'SOCKET' to 'int', possible loss of data (compiling source file F:\jenkins\jenkins-slave\workspace\Mesos-Windows\3rdparty\libprocess\src\time.cpp) [<https://builds.apache.org/job/Mesos-Windows/ws/build\3rdparty\libprocess\src\process-0.0.1.vcxproj]>
         F:\jenkins\jenkins-slave\workspace\Mesos-Windows\3rdparty\stout\include\stout/windows/os.hpp(49): warning C4996: 'GetVersionExA': was declared deprecated (compiling source file F:\jenkins\jenkins-slave\workspace\Mesos-Windows\3rdparty\libprocess\src\time.cpp) [<https://builds.apache.org/job/Mesos-Windows/ws/build\3rdparty\libprocess\src\process-0.0.1.vcxproj]>
         F:\jenkins\jenkins-slave\workspace\Mesos-Windows\3rdparty\stout\include\stout/windows/os.hpp(457): warning C4996: 'GetVersionExA': was declared deprecated (compiling source file F:\jenkins\jenkins-slave\workspace\Mesos-Windows\3rdparty\libprocess\src\time.cpp) [<https://builds.apache.org/job/Mesos-Windows/ws/build\3rdparty\libprocess\src\process-0.0.1.vcxproj]>
         F:\jenkins\jenkins-slave\workspace\Mesos-Windows\3rdparty\stout\include\stout/os/windows/close.hpp(51): warning C4800: 'BOOL': forcing value to bool 'true' or 'false' (performance warning) (compiling source file F:\jenkins\jenkins-slave\workspace\Mesos-Windows\3rdparty\libprocess\src\time.cpp) [<https://builds.apache.org/job/Mesos-Windows/ws/build\3rdparty\libprocess\src\process-0.0.1.vcxproj]>
         F:\jenkins\jenkins-slave\workspace\Mesos-Windows\3rdparty\stout\include\stout/os/windows/shell.hpp(119): warning C4244: 'return': conversion from 'intptr_t' to 'int', possible loss of data (compiling source file F:\jenkins\jenkins-slave\workspace\Mesos-Windows\3rdparty\libprocess\src\time.cpp) [<https://builds.apache.org/job/Mesos-Windows/ws/build\3rdparty\libprocess\src\process-0.0.1.vcxproj]>
         F:\jenkins\jenkins-slave\workspace\Mesos-Windows\3rdparty\stout\include\stout/duration.hpp(99): warning C4244: '=': conversion from 'double' to 'long', possible loss of data (compiling source file F:\jenkins\jenkins-slave\workspace\Mesos-Windows\3rdparty\libprocess\src\timeseries.cpp) [<https://builds.apache.org/job/Mesos-Windows/ws/build\3rdparty\libprocess\src\process-0.0.1.vcxproj]>
         F:\jenkins\jenkins-slave\workspace\Mesos-Windows\3rdparty\stout\include\stout/duration.hpp(100): warning C4244: '=': conversion from 'double' to 'long', possible loss of data (compiling source file F:\jenkins\jenkins-slave\workspace\Mesos-Windows\3rdparty\libprocess\src\timeseries.cpp) [<https://builds.apache.org/job/Mesos-Windows/ws/build\3rdparty\libprocess\src\process-0.0.1.vcxproj]>
         F:\jenkins\jenkins-slave\workspace\Mesos-Windows\3rdparty\stout\include\stout/duration.hpp(99): warning C4244: '=': conversion from 'double' to 'long', possible loss of data (compiling source file F:\jenkins\jenkins-slave\workspace\Mesos-Windows\3rdparty\libprocess\src\libevent.cpp) [<https://builds.apache.org/job/Mesos-Windows/ws/build\3rdparty\libprocess\src\process-0.0.1.vcxproj]>
         F:\jenkins\jenkins-slave\workspace\Mesos-Windows\3rdparty\stout\include\stout/duration.hpp(100): warning C4244: '=': conversion from 'double' to 'long', possible loss of data (compiling source file F:\jenkins\jenkins-slave\workspace\Mesos-Windows\3rdparty\libprocess\src\libevent.cpp) [<https://builds.apache.org/job/Mesos-Windows/ws/build\3rdparty\libprocess\src\process-0.0.1.vcxproj]>
         F:\jenkins\jenkins-slave\workspace\Mesos-Windows\3rdparty\stout\include\stout/os/socket.hpp(34): warning C4244: '=': conversion from 'SOCKET' to 'int', possible loss of data (compiling source file F:\jenkins\jenkins-slave\workspace\Mesos-Windows\3rdparty\libprocess\src\libevent.cpp) [<https://builds.apache.org/job/Mesos-Windows/ws/build\3rdparty\libprocess\src\process-0.0.1.vcxproj]>
         F:\jenkins\jenkins-slave\workspace\Mesos-Windows\3rdparty\stout\include\stout/os/windows/close.hpp(51): warning C4800: 'BOOL': forcing value to bool 'true' or 'false' (performance warning) (compiling source file F:\jenkins\jenkins-slave\workspace\Mesos-Windows\3rdparty\libprocess\src\libevent.cpp) [<https://builds.apache.org/job/Mesos-Windows/ws/build\3rdparty\libprocess\src\process-0.0.1.vcxproj]>
         F:\jenkins\jenkins-slave\workspace\Mesos-Windows\3rdparty\stout\include\stout/duration.hpp(99): warning C4244: '=': conversion from 'double' to 'long', possible loss of data (compiling source file F:\jenkins\jenkins-slave\workspace\Mesos-Windows\3rdparty\libprocess\src\libevent_poll.cpp) [<https://builds.apache.org/job/Mesos-Windows/ws/build\3rdparty\libprocess\src\process-0.0.1.vcxproj]>
         F:\jenkins\jenkins-slave\workspace\Mesos-Windows\3rdparty\stout\include\stout/duration.hpp(100): warning C4244: '=': conversion from 'double' to 'long', possible loss of data (compiling source file F:\jenkins\jenkins-slave\workspace\Mesos-Windows\3rdparty\libprocess\src\libevent_poll.cpp) [<https://builds.apache.org/job/Mesos-Windows/ws/build\3rdparty\libprocess\src\process-0.0.1.vcxproj]>
         F:\jenkins\jenkins-slave\workspace\Mesos-Windows\3rdparty\stout\include\stout/os/socket.hpp(34): warning C4244: '=': conversion from 'SOCKET' to 'int', possible loss of data (compiling source file F:\jenkins\jenkins-slave\workspace\Mesos-Windows\3rdparty\libprocess\src\libevent_poll.cpp) [<https://builds.apache.org/job/Mesos-Windows/ws/build\3rdparty\libprocess\src\process-0.0.1.vcxproj]>
         F:\jenkins\jenkins-slave\workspace\Mesos-Windows\3rdparty\stout\include\stout/os/windows/close.hpp(51): warning C4800: 'BOOL': forcing value to bool 'true' or 'false' (performance warning) (compiling source file F:\jenkins\jenkins-slave\workspace\Mesos-Windows\3rdparty\libprocess\src\libevent_poll.cpp) [<https://builds.apache.org/job/Mesos-Windows/ws/build\3rdparty\libprocess\src\process-0.0.1.vcxproj]>
         f:\jenkins\jenkins-slave\workspace\mesos-windows\3rdparty\libprocess\include\process\socket.hpp(398): warning C4715: '<lambda_991863ca74b0b9b65b49ad723634fbf9>::operator()': not all control paths return a value [<https://builds.apache.org/job/Mesos-Windows/ws/build\3rdparty\libprocess\src\process-0.0.1.vcxproj]>


       "<https://builds.apache.org/job/Mesos-Windows/ws/build\Mesos.sln"> (process_tests target) (1) ->
       "<https://builds.apache.org/job/Mesos-Windows/ws/build\3rdparty\libprocess\src\tests\process_tests.vcxproj.metaproj"> (default target) (2) ->
       "<https://builds.apache.org/job/Mesos-Windows/ws/build\3rdparty\libprocess\src\tests\test-linkee.vcxproj.metaproj"> (default target) (18) ->
       "<https://builds.apache.org/job/Mesos-Windows/ws/build\3rdparty\libprocess\src\tests\test-linkee.vcxproj"> (default target) (29) ->
         F:\jenkins\jenkins-slave\workspace\Mesos-Windows\3rdparty\stout\include\stout/os/socket.hpp(34): warning C4244: '=': conversion from 'SOCKET' to 'int', possible loss of data [<https://builds.apache.org/job/Mesos-Windows/ws/build\3rdparty\libprocess\src\tests\test-linkee.vcxproj]>
         F:\jenkins\jenkins-slave\workspace\Mesos-Windows\3rdparty\stout\include\stout/os/windows/close.hpp(51): warning C4800: 'BOOL': forcing value to bool 'true' or 'false' (performance warning) [<https://builds.apache.org/job/Mesos-Windows/ws/build\3rdparty\libprocess\src\tests\test-linkee.vcxproj]>
         F:\jenkins\jenkins-slave\workspace\Mesos-Windows\3rdparty\stout\include\stout/duration.hpp(99): warning C4244: '=': conversion from 'double' to 'long', possible loss of data [<https://builds.apache.org/job/Mesos-Windows/ws/build\3rdparty\libprocess\src\tests\test-linkee.vcxproj]>
         F:\jenkins\jenkins-slave\workspace\Mesos-Windows\3rdparty\stout\include\stout/duration.hpp(100): warning C4244: '=': conversion from 'double' to 'long', possible loss of data [<https://builds.apache.org/job/Mesos-Windows/ws/build\3rdparty\libprocess\src\tests\test-linkee.vcxproj]>
         F:\jenkins\jenkins-slave\workspace\Mesos-Windows\3rdparty\stout\include\stout/windows/os.hpp(49): warning C4996: 'GetVersionExA': was declared deprecated [<https://builds.apache.org/job/Mesos-Windows/ws/build\3rdparty\libprocess\src\tests\test-linkee.vcxproj]>
         F:\jenkins\jenkins-slave\workspace\Mesos-Windows\3rdparty\stout\include\stout/windows/os.hpp(457): warning C4996: 'GetVersionExA': was declared deprecated [<https://builds.apache.org/job/Mesos-Windows/ws/build\3rdparty\libprocess\src\tests\test-linkee.vcxproj]>
         F:\jenkins\jenkins-slave\workspace\Mesos-Windows\3rdparty\stout\include\stout/os/windows/shell.hpp(119): warning C4244: 'return': conversion from 'intptr_t' to 'int', possible loss of data [<https://builds.apache.org/job/Mesos-Windows/ws/build\3rdparty\libprocess\src\tests\test-linkee.vcxproj]>
         F:\jenkins\jenkins-slave\workspace\Mesos-Windows\3rdparty\stout\include\stout/gzip.hpp(126): warning C4267: '=': conversion from 'size_t' to 'uInt', possible loss of data [<https://builds.apache.org/job/Mesos-Windows/ws/build\3rdparty\libprocess\src\tests\test-linkee.vcxproj]>
         F:\jenkins\jenkins-slave\workspace\Mesos-Windows\3rdparty\stout\include\stout/gzip.hpp(192): warning C4267: '=': conversion from 'size_t' to 'uInt', possible loss of data [<https://builds.apache.org/job/Mesos-Windows/ws/build\3rdparty\libprocess\src\tests\test-linkee.vcxproj]>
         F:\jenkins\jenkins-slave\workspace\Mesos-Windows\3rdparty\libprocess\src\encoder.hpp(246): warning C4267: 'initializing': conversion from 'size_t' to 'off_t', possible loss of data [<https://builds.apache.org/job/Mesos-Windows/ws/build\3rdparty\libprocess\src\tests\test-linkee.vcxproj]>
         F:\jenkins\jenkins-slave\workspace\Mesos-Windows\3rdparty\libprocess\src\encoder.hpp(271): warning C4267: '-=': conversion from 'size_t' to 'off_t', possible loss of data [<https://builds.apache.org/job/Mesos-Windows/ws/build\3rdparty\libprocess\src\tests\test-linkee.vcxproj]>


       "<https://builds.apache.org/job/Mesos-Windows/ws/build\Mesos.sln"> (process_tests target) (1) ->
       "<https://builds.apache.org/job/Mesos-Windows/ws/build\3rdparty\libprocess\src\tests\process_tests.vcxproj.metaproj"> (default target) (2) ->
       "<https://builds.apache.org/job/Mesos-Windows/ws/build\3rdparty\libprocess\src\tests\test-linkee.vcxproj.metaproj"> (default target) (18) ->
       "<https://builds.apache.org/job/Mesos-Windows/ws/build\3rdparty\libprocess\src\tests\test-linkee.vcxproj"> (default target) (29) ->
       (Link target) -> 
         LINK : warning LNK4098: defaultlib 'MSVCRTD' conflicts with use of other libs; use /NODEFAULTLIB:library [<https://builds.apache.org/job/Mesos-Windows/ws/build\3rdparty\libprocess\src\tests\test-linkee.vcxproj]>
         zlibstaticd.lib(zutil.obj) : warning LNK4217: locally defined symbol free imported in function zcfree [<https://builds.apache.org/job/Mesos-Windows/ws/build\3rdparty\libprocess\src\tests\test-linkee.vcxproj]>
         zlibstaticd.lib(zutil.obj) : warning LNK4217: locally defined symbol malloc imported in function zcalloc [<https://builds.apache.org/job/Mesos-Windows/ws/build\3rdparty\libprocess\src\tests\test-linkee.vcxproj]>
         http_parser.lib(http_parser.obj) : warning LNK4217: locally defined symbol _wassert imported in function http_parser_execute [<https://builds.apache.org/job/Mesos-Windows/ws/build\3rdparty\libprocess\src\tests\test-linkee.vcxproj]>
         http_parser.lib(http_parser.obj) : warning LNK4217: locally defined symbol strtoul imported in function http_parser_parse_url [<https://builds.apache.org/job/Mesos-Windows/ws/build\3rdparty\libprocess\src\tests\test-linkee.vcxproj]>
         http_parser.lib(http_parser.obj) : warning LNK4217: locally defined symbol memchr imported in function http_parser_execute [<https://builds.apache.org/job/Mesos-Windows/ws/build\3rdparty\libprocess\src\tests\test-linkee.vcxproj]>


       "<https://builds.apache.org/job/Mesos-Windows/ws/build\Mesos.sln"> (process_tests target) (1) ->
       "<https://builds.apache.org/job/Mesos-Windows/ws/build\3rdparty\libprocess\src\tests\process_tests.vcxproj.metaproj"> (default target) (2) ->
       "<https://builds.apache.org/job/Mesos-Windows/ws/build\3rdparty\libprocess\src\tests\process_tests.vcxproj"> (default target) (30) ->
       (ClCompile target) -> 
         F:\jenkins\jenkins-slave\workspace\Mesos-Windows\3rdparty\stout\include\stout/duration.hpp(99): warning C4244: '=': conversion from 'double' to 'long', possible loss of data (compiling source file F:\jenkins\jenkins-slave\workspace\Mesos-Windows\3rdparty\libprocess\src\tests\collect_tests.cpp) [<https://builds.apache.org/job/Mesos-Windows/ws/build\3rdparty\libprocess\src\tests\process_tests.vcxproj]>
         F:\jenkins\jenkins-slave\workspace\Mesos-Windows\3rdparty\stout\include\stout/duration.hpp(100): warning C4244: '=': conversion from 'double' to 'long', possible loss of data (compiling source file F:\jenkins\jenkins-slave\workspace\Mesos-Windows\3rdparty\libprocess\src\tests\collect_tests.cpp) [<https://builds.apache.org/job/Mesos-Windows/ws/build\3rdparty\libprocess\src\tests\process_tests.vcxproj]>
         F:\jenkins\jenkins-slave\workspace\Mesos-Windows\3rdparty\stout\include\stout/os/socket.hpp(34): warning C4244: '=': conversion from 'SOCKET' to 'int', possible loss of data (compiling source file F:\jenkins\jenkins-slave\workspace\Mesos-Windows\3rdparty\libprocess\src\tests\collect_tests.cpp) [<https://builds.apache.org/job/Mesos-Windows/ws/build\3rdparty\libprocess\src\tests\process_tests.vcxproj]>
         F:\jenkins\jenkins-slave\workspace\Mesos-Windows\3rdparty\stout\include\stout/os/socket.hpp(34): warning C4244: '=': conversion from 'SOCKET' to 'int', possible loss of data (compiling source file F:\jenkins\jenkins-slave\workspace\Mesos-Windows\3rdparty\libprocess\src\tests\main.cpp) [<https://builds.apache.org/job/Mesos-Windows/ws/build\3rdparty\libprocess\src\tests\process_tests.vcxproj]>
         F:\jenkins\jenkins-slave\workspace\Mesos-Windows\3rdparty\stout\include\stout/os/windows/close.hpp(51): warning C4800: 'BOOL': forcing value to bool 'true' or 'false' (performance warning) (compiling source file F:\jenkins\jenkins-slave\workspace\Mesos-Windows\3rdparty\libprocess\src\tests\main.cpp) [<https://builds.apache.org/job/Mesos-Windows/ws/build\3rdparty\libprocess\src\tests\process_tests.vcxproj]>
         F:\jenkins\jenkins-slave\workspace\Mesos-Windows\3rdparty\stout\include\stout/os/windows/close.hpp(51): warning C4800: 'BOOL': forcing value to bool 'true' or 'false' (performance warning) (compiling source file F:\jenkins\jenkins-slave\workspace\Mesos-Windows\3rdparty\libprocess\src\tests\collect_tests.cpp) [<https://builds.apache.org/job/Mesos-Windows/ws/build\3rdparty\libprocess\src\tests\process_tests.vcxproj]>
         F:\jenkins\jenkins-slave\workspace\Mesos-Windows\3rdparty\stout\include\stout/duration.hpp(99): warning C4244: '=': conversion from 'double' to 'long', possible loss of data (compiling source file F:\jenkins\jenkins-slave\workspace\Mesos-Windows\3rdparty\libprocess\src\tests\main.cpp) [<https://builds.apache.org/job/Mesos-Windows/ws/build\3rdparty\libprocess\src\tests\process_tests.vcxproj]>
         F:\jenkins\jenkins-slave\workspace\Mesos-Windows\3rdparty\stout\include\stout/duration.hpp(100): warning C4244: '=': conversion from 'double' to 'long', possible loss of data (compiling source file F:\jenkins\jenkins-slave\workspace\Mesos-Windows\3rdparty\libprocess\src\tests\main.cpp) [<https://builds.apache.org/job/Mesos-Windows/ws/build\3rdparty\libprocess\src\tests\process_tests.vcxproj]>
         F:\jenkins\jenkins-slave\workspace\Mesos-Windows\3rdparty\stout\include\stout/duration.hpp(99): warning C4244: '=': conversion from 'double' to 'long', possible loss of data (compiling source file F:\jenkins\jenkins-slave\workspace\Mesos-Windows\3rdparty\libprocess\src\tests\decoder_tests.cpp) [<https://builds.apache.org/job/Mesos-Windows/ws/build\3rdparty\libprocess\src\tests\process_tests.vcxproj]>
         F:\jenkins\jenkins-slave\workspace\Mesos-Windows\3rdparty\stout\include\stout/duration.hpp(100): warning C4244: '=': conversion from 'double' to 'long', possible loss of data (compiling source file F:\jenkins\jenkins-slave\workspace\Mesos-Windows\3rdparty\libprocess\src\tests\decoder_tests.cpp) [<https://builds.apache.org/job/Mesos-Windows/ws/build\3rdparty\libprocess\src\tests\process_tests.vcxproj]>
         F:\jenkins\jenkins-slave\workspace\Mesos-Windows\3rdparty\stout\include\stout/os/socket.hpp(34): warning C4244: '=': conversion from 'SOCKET' to 'int', possible loss of data (compiling source file F:\jenkins\jenkins-slave\workspace\Mesos-Windows\3rdparty\libprocess\src\tests\encoder_tests.cpp) [<https://builds.apache.org/job/Mesos-Windows/ws/build\3rdparty\libprocess\src\tests\process_tests.vcxproj]>
         F:\jenkins\jenkins-slave\workspace\Mesos-Windows\3rdparty\stout\include\stout/os/windows/close.hpp(51): warning C4800: 'BOOL': forcing value to bool 'true' or 'false' (performance warning) (compiling source file F:\jenkins\jenkins-slave\workspace\Mesos-Windows\3rdparty\libprocess\src\tests\encoder_tests.cpp) [<https://builds.apache.org/job/Mesos-Windows/ws/build\3rdparty\libprocess\src\tests\process_tests.vcxproj]>
         F:\jenkins\jenkins-slave\workspace\Mesos-Windows\3rdparty\stout\include\stout/os/socket.hpp(34): warning C4244: '=': conversion from 'SOCKET' to 'int', possible loss of data (compiling source file F:\jenkins\jenkins-slave\workspace\Mesos-Windows\3rdparty\libprocess\src\tests\decoder_tests.cpp) [<https://builds.apache.org/job/Mesos-Windows/ws/build\3rdparty\libprocess\src\tests\process_tests.vcxproj]>
         F:\jenkins\jenkins-slave\workspace\Mesos-Windows\3rdparty\stout\include\stout/os/windows/close.hpp(51): warning C4800: 'BOOL': forcing value to bool 'true' or 'false' (performance warning) (compiling source file F:\jenkins\jenkins-slave\workspace\Mesos-Windows\3rdparty\libprocess\src\tests\decoder_tests.cpp) [<https://builds.apache.org/job/Mesos-Windows/ws/build\3rdparty\libprocess\src\tests\process_tests.vcxproj]>
         F:\jenkins\jenkins-slave\workspace\Mesos-Windows\3rdparty\stout\include\stout/duration.hpp(99): warning C4244: '=': conversion from 'double' to 'long', possible loss of data (compiling source file F:\jenkins\jenkins-slave\workspace\Mesos-Windows\3rdparty\libprocess\src\tests\encoder_tests.cpp) [<https://builds.apache.org/job/Mesos-Windows/ws/build\3rdparty\libprocess\src\tests\process_tests.vcxproj]>
         F:\jenkins\jenkins-slave\workspace\Mesos-Windows\3rdparty\stout\include\stout/duration.hpp(100): warning C4244: '=': conversion from 'double' to 'long', possible loss of data (compiling source file F:\jenkins\jenkins-slave\workspace\Mesos-Windows\3rdparty\libprocess\src\tests\encoder_tests.cpp) [<https://builds.apache.org/job/Mesos-Windows/ws/build\3rdparty\libprocess\src\tests\process_tests.vcxproj]>
         F:\jenkins\jenkins-slave\workspace\Mesos-Windows\3rdparty\stout\include\stout/gzip.hpp(126): warning C4267: '=': conversion from 'size_t' to 'uInt', possible loss of data (compiling source file F:\jenkins\jenkins-slave\workspace\Mesos-Windows\3rdparty\libprocess\src\tests\encoder_tests.cpp) [<https://builds.apache.org/job/Mesos-Windows/ws/build\3rdparty\libprocess\src\tests\process_tests.vcxproj]>
         F:\jenkins\jenkins-slave\workspace\Mesos-Windows\3rdparty\stout\include\stout/gzip.hpp(192): warning C4267: '=': conversion from 'size_t' to 'uInt', possible loss of data (compiling source file F:\jenkins\jenkins-slave\workspace\Mesos-Windows\3rdparty\libprocess\src\tests\encoder_tests.cpp) [<https://builds.apache.org/job/Mesos-Windows/ws/build\3rdparty\libprocess\src\tests\process_tests.vcxproj]>
         F:\jenkins\jenkins-slave\workspace\Mesos-Windows\3rdparty\stout\include\stout/windows/os.hpp(49): warning C4996: 'GetVersionExA': was declared deprecated (compiling source file F:\jenkins\jenkins-slave\workspace\Mesos-Windows\3rdparty\libprocess\src\tests\encoder_tests.cpp) [<https://builds.apache.org/job/Mesos-Windows/ws/build\3rdparty\libprocess\src\tests\process_tests.vcxproj]>
         F:\jenkins\jenkins-slave\workspace\Mesos-Windows\3rdparty\stout\include\stout/windows/os.hpp(457): warning C4996: 'GetVersionExA': was declared deprecated (compiling source file F:\jenkins\jenkins-slave\workspace\Mesos-Windows\3rdparty\libprocess\src\tests\encoder_tests.cpp) [<https://builds.apache.org/job/Mesos-Windows/ws/build\3rdparty\libprocess\src\tests\process_tests.vcxproj]>
         F:\jenkins\jenkins-slave\workspace\Mesos-Windows\3rdparty\stout\include\stout/windows/os.hpp(49): warning C4996: 'GetVersionExA': was declared deprecated (compiling source file F:\jenkins\jenkins-slave\workspace\Mesos-Windows\3rdparty\libprocess\src\tests\decoder_tests.cpp) [<https://builds.apache.org/job/Mesos-Windows/ws/build\3rdparty\libprocess\src\tests\process_tests.vcxproj]>
         F:\jenkins\jenkins-slave\workspace\Mesos-Windows\3rdparty\stout\include\stout/windows/os.hpp(457): warning C4996: 'GetVersionExA': was declared deprecated (compiling source file F:\jenkins\jenkins-slave\workspace\Mesos-Windows\3rdparty\libprocess\src\tests\decoder_tests.cpp) [<https://builds.apache.org/job/Mesos-Windows/ws/build\3rdparty\libprocess\src\tests\process_tests.vcxproj]>
         F:\jenkins\jenkins-slave\workspace\Mesos-Windows\3rdparty\stout\include\stout/os/windows/shell.hpp(119): warning C4244: 'return': conversion from 'intptr_t' to 'int', possible loss of data (compiling source file F:\jenkins\jenkins-slave\workspace\Mesos-Windows\3rdparty\libprocess\src\tests\encoder_tests.cpp) [<https://builds.apache.org/job/Mesos-Windows/ws/build\3rdparty\libprocess\src\tests\process_tests.vcxproj]>
         F:\jenkins\jenkins-slave\workspace\Mesos-Windows\3rdparty\libprocess\src\encoder.hpp(246): warning C4267: 'initializing': conversion from 'size_t' to 'off_t', possible loss of data (compiling source file F:\jenkins\jenkins-slave\workspace\Mesos-Windows\3rdparty\libprocess\src\tests\encoder_tests.cpp) [<https://builds.apache.org/job/Mesos-Windows/ws/build\3rdparty\libprocess\src\tests\process_tests.vcxproj]>
         F:\jenkins\jenkins-slave\workspace\Mesos-Windows\3rdparty\libprocess\src\encoder.hpp(271): warning C4267: '-=': conversion from 'size_t' to 'off_t', possible loss of data (compiling source file F:\jenkins\jenkins-slave\workspace\Mesos-Windows\3rdparty\libprocess\src\tests\encoder_tests.cpp) [<https://builds.apache.org/job/Mesos-Windows/ws/build\3rdparty\libprocess\src\tests\process_tests.vcxproj]>
         F:\jenkins\jenkins-slave\workspace\Mesos-Windows\3rdparty\stout\include\stout/windows/os.hpp(49): warning C4996: 'GetVersionExA': was declared deprecated (compiling source file F:\jenkins\jenkins-slave\workspace\Mesos-Windows\3rdparty\libprocess\src\tests\collect_tests.cpp) [<https://builds.apache.org/job/Mesos-Windows/ws/build\3rdparty\libprocess\src\tests\process_tests.vcxproj]>
         F:\jenkins\jenkins-slave\workspace\Mesos-Windows\3rdparty\stout\include\stout/windows/os.hpp(49): warning C4996: 'GetVersionExA': was declared deprecated (compiling source file F:\jenkins\jenkins-slave\workspace\Mesos-Windows\3rdparty\libprocess\src\tests\main.cpp) [<https://builds.apache.org/job/Mesos-Windows/ws/build\3rdparty\libprocess\src\tests\process_tests.vcxproj]>
         F:\jenkins\jenkins-slave\workspace\Mesos-Windows\3rdparty\stout\include\stout/os/windows/shell.hpp(119): warning C4244: 'return': conversion from 'intptr_t' to 'int', possible loss of data (compiling source file F:\jenkins\jenkins-slave\workspace\Mesos-Windows\3rdparty\libprocess\src\tests\decoder_tests.cpp) [<https://builds.apache.org/job/Mesos-Windows/ws/build\3rdparty\libprocess\src\tests\process_tests.vcxproj]>
         F:\jenkins\jenkins-slave\workspace\Mesos-Windows\3rdparty\stout\include\stout/windows/os.hpp(457): warning C4996: 'GetVersionExA': was declared deprecated (compiling source file F:\jenkins\jenkins-slave\workspace\Mesos-Windows\3rdparty\libprocess\src\tests\collect_tests.cpp) [<https://builds.apache.org/job/Mesos-Windows/ws/build\3rdparty\libprocess\src\tests\process_tests.vcxproj]>
         F:\jenkins\jenkins-slave\workspace\Mesos-Windows\3rdparty\stout\include\stout/windows/os.hpp(457): warning C4996: 'GetVersionExA': was declared deprecated (compiling source file F:\jenkins\jenkins-slave\workspace\Mesos-Windows\3rdparty\libprocess\src\tests\main.cpp) [<https://builds.apache.org/job/Mesos-Windows/ws/build\3rdparty\libprocess\src\tests\process_tests.vcxproj]>
         F:\jenkins\jenkins-slave\workspace\Mesos-Windows\3rdparty\stout\include\stout/gzip.hpp(126): warning C4267: '=': conversion from 'size_t' to 'uInt', possible loss of data (compiling source file F:\jenkins\jenkins-slave\workspace\Mesos-Windows\3rdparty\libprocess\src\tests\decoder_tests.cpp) [<https://builds.apache.org/job/Mesos-Windows/ws/build\3rdparty\libprocess\src\tests\process_tests.vcxproj]>
         F:\jenkins\jenkins-slave\workspace\Mesos-Windows\3rdparty\stout\include\stout/gzip.hpp(192): warning C4267: '=': conversion from 'size_t' to 'uInt', possible loss of data (compiling source file F:\jenkins\jenkins-slave\workspace\Mesos-Windows\3rdparty\libprocess\src\tests\decoder_tests.cpp) [<https://builds.apache.org/job/Mesos-Windows/ws/build\3rdparty\libprocess\src\tests\process_tests.vcxproj]>
         F:\jenkins\jenkins-slave\workspace\Mesos-Windows\3rdparty\stout\include\stout/os/windows/shell.hpp(119): warning C4244: 'return': conversion from 'intptr_t' to 'int', possible loss of data (compiling source file F:\jenkins\jenkins-slave\workspace\Mesos-Windows\3rdparty\libprocess\src\tests\collect_tests.cpp) [<https://builds.apache.org/job/Mesos-Windows/ws/build\3rdparty\libprocess\src\tests\process_tests.vcxproj]>
         F:\jenkins\jenkins-slave\workspace\Mesos-Windows\3rdparty\stout\include\stout/os/windows/shell.hpp(119): warning C4244: 'return': conversion from 'intptr_t' to 'int', possible loss of data (compiling source file F:\jenkins\jenkins-slave\workspace\Mesos-Windows\3rdparty\libprocess\src\tests\main.cpp) [<https://builds.apache.org/job/Mesos-Windows/ws/build\3rdparty\libprocess\src\tests\process_tests.vcxproj]>
         F:\jenkins\jenkins-slave\workspace\Mesos-Windows\3rdparty\stout\include\stout/duration.hpp(99): warning C4244: '=': conversion from 'double' to 'long', possible loss of data (compiling source file F:\jenkins\jenkins-slave\workspace\Mesos-Windows\3rdparty\libprocess\src\tests\future_tests.cpp) [<https://builds.apache.org/job/Mesos-Windows/ws/build\3rdparty\libprocess\src\tests\process_tests.vcxproj]>
         F:\jenkins\jenkins-slave\workspace\Mesos-Windows\3rdparty\stout\include\stout/duration.hpp(100): warning C4244: '=': conversion from 'double' to 'long', possible loss of data (compiling source file F:\jenkins\jenkins-slave\workspace\Mesos-Windows\3rdparty\libprocess\src\tests\future_tests.cpp) [<https://builds.apache.org/job/Mesos-Windows/ws/build\3rdparty\libprocess\src\tests\process_tests.vcxproj]>
         F:\jenkins\jenkins-slave\workspace\Mesos-Windows\3rdparty\stout\include\stout/os/socket.hpp(34): warning C4244: '=': conversion from 'SOCKET' to 'int', possible loss of data (compiling source file F:\jenkins\jenkins-slave\workspace\Mesos-Windows\3rdparty\libprocess\src\tests\future_tests.cpp) [<https://builds.apache.org/job/Mesos-Windows/ws/build\3rdparty\libprocess\src\tests\process_tests.vcxproj]>
         F:\jenkins\jenkins-slave\workspace\Mesos-Windows\3rdparty\stout\include\stout/os/windows/close.hpp(51): warning C4800: 'BOOL': forcing value to bool 'true' or 'false' (performance warning) (compiling source file F:\jenkins\jenkins-slave\workspace\Mesos-Windows\3rdparty\libprocess\src\tests\future_tests.cpp) [<https://builds.apache.org/job/Mesos-Windows/ws/build\3rdparty\libprocess\src\tests\process_tests.vcxproj]>
         F:\jenkins\jenkins-slave\workspace\Mesos-Windows\3rdparty\stout\include\stout/duration.hpp(99): warning C4244: '=': conversion from 'double' to 'long', possible loss of data (compiling source file F:\jenkins\jenkins-slave\workspace\Mesos-Windows\3rdparty\libprocess\src\tests\limiter_tests.cpp) [<https://builds.apache.org/job/Mesos-Windows/ws/build\3rdparty\libprocess\src\tests\process_tests.vcxproj]>
         F:\jenkins\jenkins-slave\workspace\Mesos-Windows\3rdparty\stout\include\stout/duration.hpp(100): warning C4244: '=': conversion from 'double' to 'long', possible loss of data (compiling source file F:\jenkins\jenkins-slave\workspace\Mesos-Windows\3rdparty\libprocess\src\tests\limiter_tests.cpp) [<https://builds.apache.org/job/Mesos-Windows/ws/build\3rdparty\libprocess\src\tests\process_tests.vcxproj]>
         F:\jenkins\jenkins-slave\workspace\Mesos-Windows\3rdparty\stout\include\stout/os/socket.hpp(34): warning C4244: '=': conversion from 'SOCKET' to 'int', possible loss of data (compiling source file F:\jenkins\jenkins-slave\workspace\Mesos-Windows\3rdparty\libprocess\src\tests\http_tests.cpp) [<https://builds.apache.org/job/Mesos-Windows/ws/build\3rdparty\libprocess\src\tests\process_tests.vcxproj]>
         F:\jenkins\jenkins-slave\workspace\Mesos-Windows\3rdparty\stout\include\stout/os/windows/close.hpp(51): warning C4800: 'BOOL': forcing value to bool 'true' or 'false' (performance warning) (compiling source file F:\jenkins\jenkins-slave\workspace\Mesos-Windows\3rdparty\libprocess\src\tests\http_tests.cpp) [<https://builds.apache.org/job/Mesos-Windows/ws/build\3rdparty\libprocess\src\tests\process_tests.vcxproj]>
         F:\jenkins\jenkins-slave\workspace\Mesos-Windows\3rdparty\stout\include\stout/duration.hpp(99): warning C4244: '=': conversion from 'double' to 'long', possible loss of data (compiling source file F:\jenkins\jenkins-slave\workspace\Mesos-Windows\3rdparty\libprocess\src\tests\http_tests.cpp) [<https://builds.apache.org/job/Mesos-Windows/ws/build\3rdparty\libprocess\src\tests\process_tests.vcxproj]>
         F:\jenkins\jenkins-slave\workspace\Mesos-Windows\3rdparty\stout\include\stout/duration.hpp(100): warning C4244: '=': conversion from 'double' to 'long', possible loss of data (compiling source file F:\jenkins\jenkins-slave\workspace\Mesos-Windows\3rdparty\libprocess\src\tests\http_tests.cpp) [<https://builds.apache.org/job/Mesos-Windows/ws/build\3rdparty\libprocess\src\tests\process_tests.vcxproj]>
         F:\jenkins\jenkins-slave\workspace\Mesos-Windows\3rdparty\stout\include\stout/os/socket.hpp(34): warning C4244: '=': conversion from 'SOCKET' to 'int', possible loss of data (compiling source file F:\jenkins\jenkins-slave\workspace\Mesos-Windows\3rdparty\libprocess\src\tests\limiter_tests.cpp) [<https://builds.apache.org/job/Mesos-Windows/ws/build\3rdparty\libprocess\src\tests\process_tests.vcxproj]>
         F:\jenkins\jenkins-slave\workspace\Mesos-Windows\3rdparty\stout\include\stout/os/windows/close.hpp(51): warning C4800: 'BOOL': forcing value to bool 'true' or 'false' (performance warning) (compiling source file F:\jenkins\jenkins-slave\workspace\Mesos-Windows\3rdparty\libprocess\src\tests\limiter_tests.cpp) [<https://builds.apache.org/job/Mesos-Windows/ws/build\3rdparty\libprocess\src\tests\process_tests.vcxproj]>
         F:\jenkins\jenkins-slave\workspace\Mesos-Windows\3rdparty\stout\include\stout/windows/os.hpp(49): warning C4996: 'GetVersionExA': was declared deprecated (compiling source file F:\jenkins\jenkins-slave\workspace\Mesos-Windows\3rdparty\libprocess\src\tests\future_tests.cpp) [<https://builds.apache.org/job/Mesos-Windows/ws/build\3rdparty\libprocess\src\tests\process_tests.vcxproj]>
         F:\jenkins\jenkins-slave\workspace\Mesos-Windows\3rdparty\stout\include\stout/windows/os.hpp(457): warning C4996: 'GetVersionExA': was declared deprecated (compiling source file F:\jenkins\jenkins-slave\workspace\Mesos-Windows\3rdparty\libprocess\src\tests\future_tests.cpp) [<https://builds.apache.org/job/Mesos-Windows/ws/build\3rdparty\libprocess\src\tests\process_tests.vcxproj]>
         F:\jenkins\jenkins-slave\workspace\Mesos-Windows\3rdparty\stout\include\stout/os/windows/shell.hpp(119): warning C4244: 'return': conversion from 'intptr_t' to 'int', possible loss of data (compiling source file F:\jenkins\jenkins-slave\workspace\Mesos-Windows\3rdparty\libprocess\src\tests\future_tests.cpp) [<https://builds.apache.org/job/Mesos-Windows/ws/build\3rdparty\libprocess\src\tests\process_tests.vcxproj]>
         F:\jenkins\jenkins-slave\workspace\Mesos-Windows\3rdparty\stout\include\stout/windows/os.hpp(49): warning C4996: 'GetVersionExA': was declared deprecated (compiling source file F:\jenkins\jenkins-slave\workspace\Mesos-Windows\3rdparty\libprocess\src\tests\http_tests.cpp) [<https://builds.apache.org/job/Mesos-Windows/ws/build\3rdparty\libprocess\src\tests\process_tests.vcxproj]>
         F:\jenkins\jenkins-slave\workspace\Mesos-Windows\3rdparty\stout\include\stout/windows/os.hpp(49): warning C4996: 'GetVersionExA': was declared deprecated (compiling source file F:\jenkins\jenkins-slave\workspace\Mesos-Windows\3rdparty\libprocess\src\tests\limiter_tests.cpp) [<https://builds.apache.org/job/Mesos-Windows/ws/build\3rdparty\libprocess\src\tests\process_tests.vcxproj]>
         F:\jenkins\jenkins-slave\workspace\Mesos-Windows\3rdparty\stout\include\stout/windows/os.hpp(457): warning C4996: 'GetVersionExA': was declared deprecated (compiling source file F:\jenkins\jenkins-slave\workspace\Mesos-Windows\3rdparty\libprocess\src\tests\limiter_tests.cpp) [<https://builds.apache.org/job/Mesos-Windows/ws/build\3rdparty\libprocess\src\tests\process_tests.vcxproj]>
         F:\jenkins\jenkins-slave\workspace\Mesos-Windows\3rdparty\stout\include\stout/os/windows/shell.hpp(119): warning C4244: 'return': conversion from 'intptr_t' to 'int', possible loss of data (compiling source file F:\jenkins\jenkins-slave\workspace\Mesos-Windows\3rdparty\libprocess\src\tests\http_tests.cpp) [<https://builds.apache.org/job/Mesos-Windows/ws/build\3rdparty\libprocess\src\tests\process_tests.vcxproj]>
         F:\jenkins\jenkins-slave\workspace\Mesos-Windows\3rdparty\stout\include\stout/gzip.hpp(126): warning C4267: '=': conversion from 'size_t' to 'uInt', possible loss of data (compiling source file F:\jenkins\jenkins-slave\workspace\Mesos-Windows\3rdparty\libprocess\src\tests\http_tests.cpp) [<https://builds.apache.org/job/Mesos-Windows/ws/build\3rdparty\libprocess\src\tests\process_tests.vcxproj]>
         F:\jenkins\jenkins-slave\workspace\Mesos-Windows\3rdparty\stout\include\stout/gzip.hpp(192): warning C4267: '=': conversion from 'size_t' to 'uInt', possible loss of data (compiling source file F:\jenkins\jenkins-slave\workspace\Mesos-Windows\3rdparty\libprocess\src\tests\http_tests.cpp) [<https://builds.apache.org/job/Mesos-Windows/ws/build\3rdparty\libprocess\src\tests\process_tests.vcxproj]>
         F:\jenkins\jenkins-slave\workspace\Mesos-Windows\3rdparty\stout\include\stout/os/windows/shell.hpp(119): warning C4244: 'return': conversion from 'intptr_t' to 'int', possible loss of data (compiling source file F:\jenkins\jenkins-slave\workspace\Mesos-Windows\3rdparty\libprocess\src\tests\limiter_tests.cpp) [<https://builds.apache.org/job/Mesos-Windows/ws/build\3rdparty\libprocess\src\tests\process_tests.vcxproj]>
         F:\jenkins\jenkins-slave\workspace\Mesos-Windows\3rdparty\libprocess\src\encoder.hpp(246): warning C4267: 'initializing': conversion from 'size_t' to 'off_t', possible loss of data (compiling source file F:\jenkins\jenkins-slave\workspace\Mesos-Windows\3rdparty\libprocess\src\tests\http_tests.cpp) [<https://builds.apache.org/job/Mesos-Windows/ws/build\3rdparty\libprocess\src\tests\process_tests.vcxproj]>
         F:\jenkins\jenkins-slave\workspace\Mesos-Windows\3rdparty\libprocess\src\encoder.hpp(271): warning C4267: '-=': conversion from 'size_t' to 'off_t', possible loss of data (compiling source file F:\jenkins\jenkins-slave\workspace\Mesos-Windows\3rdparty\libprocess\src\tests\http_tests.cpp) [<https://builds.apache.org/job/Mesos-Windows/ws/build\3rdparty\libprocess\src\tests\process_tests.vcxproj]>
         F:\jenkins\jenkins-slave\workspace\Mesos-Windows\3rdparty\libprocess\src\tests\http_tests.cpp(971): warning C4267: 'argument': conversion from 'size_t' to 'char', possible loss of data [<https://builds.apache.org/job/Mesos-Windows/ws/build\3rdparty\libprocess\src\tests\process_tests.vcxproj]>
         F:\jenkins\jenkins-slave\workspace\Mesos-Windows\3rdparty\stout\include\stout/duration.hpp(99): warning C4244: '=': conversion from 'double' to 'long', possible loss of data (compiling source file F:\jenkins\jenkins-slave\workspace\Mesos-Windows\3rdparty\libprocess\src\tests\loop_tests.cpp) [<https://builds.apache.org/job/Mesos-Windows/ws/build\3rdparty\libprocess\src\tests\process_tests.vcxproj]>
         F:\jenkins\jenkins-slave\workspace\Mesos-Windows\3rdparty\stout\include\stout/duration.hpp(100): warning C4244: '=': conversion from 'double' to 'long', possible loss of data (compiling source file F:\jenkins\jenkins-slave\workspace\Mesos-Windows\3rdparty\libprocess\src\tests\loop_tests.cpp) [<https://builds.apache.org/job/Mesos-Windows/ws/build\3rdparty\libprocess\src\tests\process_tests.vcxproj]>
         F:\jenkins\jenkins-slave\workspace\Mesos-Windows\3rdparty\stout\include\stout/os/socket.hpp(34): warning C4244: '=': conversion from 'SOCKET' to 'int', possible loss of data (compiling source file F:\jenkins\jenkins-slave\workspace\Mesos-Windows\3rdparty\libprocess\src\tests\loop_tests.cpp) [<https://builds.apache.org/job/Mesos-Windows/ws/build\3rdparty\libprocess\src\tests\process_tests.vcxproj]>
         F:\jenkins\jenkins-slave\workspace\Mesos-Windows\3rdparty\stout\include\stout/os/windows/close.hpp(51): warning C4800: 'BOOL': forcing value to bool 'true' or 'false' (performance warning) (compiling source file F:\jenkins\jenkins-slave\workspace\Mesos-Windows\3rdparty\libprocess\src\tests\loop_tests.cpp) [<https://builds.apache.org/job/Mesos-Windows/ws/build\3rdparty\libprocess\src\tests\process_tests.vcxproj]>
         F:\jenkins\jenkins-slave\workspace\Mesos-Windows\3rdparty\stout\include\stout/duration.hpp(99): warning C4244: '=': conversion from 'double' to 'long', possible loss of data (compiling source file F:\jenkins\jenkins-slave\workspace\Mesos-Windows\3rdparty\libprocess\src\tests\metrics_tests.cpp) [<https://builds.apache.org/job/Mesos-Windows/ws/build\3rdparty\libprocess\src\tests\process_tests.vcxproj]>
         F:\jenkins\jenkins-slave\workspace\Mesos-Windows\3rdparty\stout\include\stout/duration.hpp(100): warning C4244: '=': conversion from 'double' to 'long', possible loss of data (compiling source file F:\jenkins\jenkins-slave\workspace\Mesos-Windows\3rdparty\libprocess\src\tests\metrics_tests.cpp) [<https://builds.apache.org/job/Mesos-Windows/ws/build\3rdparty\libprocess\src\tests\process_tests.vcxproj]>
         F:\jenkins\jenkins-slave\workspace\Mesos-Windows\3rdparty\stout\include\stout/os/socket.hpp(34): warning C4244: '=': conversion from 'SOCKET' to 'int', possible loss of data (compiling source file F:\jenkins\jenkins-slave\workspace\Mesos-Windows\3rdparty\libprocess\src\tests\metrics_tests.cpp) [<https://builds.apache.org/job/Mesos-Windows/ws/build\3rdparty\libprocess\src\tests\process_tests.vcxproj]>
         F:\jenkins\jenkins-slave\workspace\Mesos-Windows\3rdparty\stout\include\stout/os/windows/close.hpp(51): warning C4800: 'BOOL': forcing value to bool 'true' or 'false' (performance warning) (compiling source file F:\jenkins\jenkins-slave\workspace\Mesos-Windows\3rdparty\libprocess\src\tests\metrics_tests.cpp) [<https://builds.apache.org/job/Mesos-Windows/ws/build\3rdparty\libprocess\src\tests\process_tests.vcxproj]>
         F:\jenkins\jenkins-slave\workspace\Mesos-Windows\3rdparty\stout\include\stout/windows/os.hpp(49): warning C4996: 'GetVersionExA': was declared deprecated (compiling source file F:\jenkins\jenkins-slave\workspace\Mesos-Windows\3rdparty\libprocess\src\tests\loop_tests.cpp) [<https://builds.apache.org/job/Mesos-Windows/ws/build\3rdparty\libprocess\src\tests\process_tests.vcxproj]>
         F:\jenkins\jenkins-slave\workspace\Mesos-Windows\3rdparty\stout\include\stout/windows/os.hpp(457): warning C4996: 'GetVersionExA': was declared deprecated (compiling source file F:\jenkins\jenkins-slave\workspace\Mesos-Windows\3rdparty\libprocess\src\tests\loop_tests.cpp) [<https://builds.apache.org/job/Mesos-Windows/ws/build\3rdparty\libprocess\src\tests\process_tests.vcxproj]>
         F:\jenkins\jenkins-slave\workspace\Mesos-Windows\3rdparty\stout\include\stout/os/windows/shell.hpp(119): warning C4244: 'return': conversion from 'intptr_t' to 'int', possible loss of data (compiling source file F:\jenkins\jenkins-slave\workspace\Mesos-Windows\3rdparty\libprocess\src\tests\loop_tests.cpp) [<https://builds.apache.org/job/Mesos-Windows/ws/build\3rdparty\libprocess\src\tests\process_tests.vcxproj]>
         F:\jenkins\jenkins-slave\workspace\Mesos-Windows\3rdparty\stout\include\stout/windows/os.hpp(49): warning C4996: 'GetVersionExA': was declared deprecated (compiling source file F:\jenkins\jenkins-slave\workspace\Mesos-Windows\3rdparty\libprocess\src\tests\metrics_tests.cpp) [<https://builds.apache.org/job/Mesos-Windows/ws/build\3rdparty\libprocess\src\tests\process_tests.vcxproj]>
         F:\jenkins\jenkins-slave\workspace\Mesos-Windows\3rdparty\stout\include\stout/windows/os.hpp(457): warning C4996: 'GetVersionExA': was declared deprecated (compiling source file F:\jenkins\jenkins-slave\workspace\Mesos-Windows\3rdparty\libprocess\src\tests\metrics_tests.cpp) [<https://builds.apache.org/job/Mesos-Windows/ws/build\3rdparty\libprocess\src\tests\process_tests.vcxproj]>
         F:\jenkins\jenkins-slave\workspace\Mesos-Windows\3rdparty\stout\include\stout/os/windows/shell.hpp(119): warning C4244: 'return': conversion from 'intptr_t' to 'int', possible loss of data (compiling source file F:\jenkins\jenkins-slave\workspace\Mesos-Windows\3rdparty\libprocess\src\tests\metrics_tests.cpp) [<https://builds.apache.org/job/Mesos-Windows/ws/build\3rdparty\libprocess\src\tests\process_tests.vcxproj]>
         F:\jenkins\jenkins-slave\workspace\Mesos-Windows\3rdparty\libprocess\include\process/metrics/counter.hpp(36): warning C4244: 'argument': conversion from '__int64' to 'double', possible loss of data (compiling source file F:\jenkins\jenkins-slave\workspace\Mesos-Windows\3rdparty\libprocess\src\tests\metrics_tests.cpp) [<https://builds.apache.org/job/Mesos-Windows/ws/build\3rdparty\libprocess\src\tests\process_tests.vcxproj]>
         F:\jenkins\jenkins-slave\workspace\Mesos-Windows\3rdparty\libprocess\include\process/metrics/counter.hpp(67): warning C4244: 'argument': conversion from 'int64_t' to 'double', possible loss of data (compiling source file F:\jenkins\jenkins-slave\workspace\Mesos-Windows\3rdparty\libprocess\src\tests\metrics_tests.cpp) [<https://builds.apache.org/job/Mesos-Windows/ws/build\3rdparty\libprocess\src\tests\process_tests.vcxproj]>
         F:\jenkins\jenkins-slave\workspace\Mesos-Windows\3rdparty\libprocess\src\tests\metrics_tests.cpp(191): warning C4244: 'argument': conversion from 'double' to 'float', possible loss of data [<https://builds.apache.org/job/Mesos-Windows/ws/build\3rdparty\libprocess\src\tests\process_tests.vcxproj]>
         F:\jenkins\jenkins-slave\workspace\Mesos-Windows\3rdparty\libprocess\src\tests\metrics_tests.cpp(192): warning C4244: 'argument': conversion from 'double' to 'float', possible loss of data [<https://builds.apache.org/job/Mesos-Windows/ws/build\3rdparty\libprocess\src\tests\process_tests.vcxproj]>
         F:\jenkins\jenkins-slave\workspace\Mesos-Windows\3rdparty\libprocess\src\tests\metrics_tests.cpp(194): warning C4244: 'argument': conversion from 'double' to 'float', possible loss of data [<https://builds.apache.org/job/Mesos-Windows/ws/build\3rdparty\libprocess\src\tests\process_tests.vcxproj]>
         F:\jenkins\jenkins-slave\workspace\Mesos-Windows\3rdparty\libprocess\src\tests\metrics_tests.cpp(195): warning C4244: 'argument': conversion from 'double' to 'float', possible loss of data [<https://builds.apache.org/job/Mesos-Windows/ws/build\3rdparty\libprocess\src\tests\process_tests.vcxproj]>
         F:\jenkins\jenkins-slave\workspace\Mesos-Windows\3rdparty\libprocess\src\tests\metrics_tests.cpp(196): warning C4244: 'argument': conversion from 'double' to 'float', possible loss of data [<https://builds.apache.org/job/Mesos-Windows/ws/build\3rdparty\libprocess\src\tests\process_tests.vcxproj]>
         F:\jenkins\jenkins-slave\workspace\Mesos-Windows\3rdparty\libprocess\src\tests\metrics_tests.cpp(197): warning C4244: 'argument': conversion from 'double' to 'float', possible loss of data [<https://builds.apache.org/job/Mesos-Windows/ws/build\3rdparty\libprocess\src\tests\process_tests.vcxproj]>
         F:\jenkins\jenkins-slave\workspace\Mesos-Windows\3rdparty\libprocess\src\tests\metrics_tests.cpp(197): warning C4305: 'argument': truncation from 'double' to 'float' [<https://builds.apache.org/job/Mesos-Windows/ws/build\3rdparty\libprocess\src\tests\process_tests.vcxproj]>
         F:\jenkins\jenkins-slave\workspace\Mesos-Windows\3rdparty\libprocess\src\tests\metrics_tests.cpp(198): warning C4244: 'argument': conversion from 'double' to 'float', possible loss of data [<https://builds.apache.org/job/Mesos-Windows/ws/build\3rdparty\libprocess\src\tests\process_tests.vcxproj]>
         F:\jenkins\jenkins-slave\workspace\Mesos-Windows\3rdparty\libprocess\src\tests\metrics_tests.cpp(198): warning C4305: 'argument': truncation from 'double' to 'float' [<https://builds.apache.org/job/Mesos-Windows/ws/build\3rdparty\libprocess\src\tests\process_tests.vcxproj]>
         F:\jenkins\jenkins-slave\workspace\Mesos-Windows\3rdparty\libprocess\src\tests\metrics_tests.cpp(199): warning C4244: 'argument': conversion from 'double' to 'float', possible loss of data [<https://builds.apache.org/job/Mesos-Windows/ws/build\3rdparty\libprocess\src\tests\process_tests.vcxproj]>
         F:\jenkins\jenkins-slave\workspace\Mesos-Windows\3rdparty\libprocess\src\tests\metrics_tests.cpp(199): warning C4305: 'argument': truncation from 'double' to 'float' [<https://builds.apache.org/job/Mesos-Windows/ws/build\3rdparty\libprocess\src\tests\process_tests.vcxproj]>
         F:\jenkins\jenkins-slave\workspace\Mesos-Windows\3rdparty\libprocess\src\tests\metrics_tests.cpp(242): warning C4244: 'argument': conversion from 'double' to 'float', possible loss of data [<https://builds.apache.org/job/Mesos-Windows/ws/build\3rdparty\libprocess\src\tests\process_tests.vcxproj]>
         F:\jenkins\jenkins-slave\workspace\Mesos-Windows\3rdparty\libprocess\src\tests\metrics_tests.cpp(245): warning C4244: 'argument': conversion from 'double' to 'float', possible loss of data [<https://builds.apache.org/job/Mesos-Windows/ws/build\3rdparty\libprocess\src\tests\process_tests.vcxproj]>
         F:\jenkins\jenkins-slave\workspace\Mesos-Windows\3rdparty\libprocess\src\tests\metrics_tests.cpp(344): warning C4244: 'argument': conversion from 'double' to 'float', possible loss of data [<https://builds.apache.org/job/Mesos-Windows/ws/build\3rdparty\libprocess\src\tests\process_tests.vcxproj]>
         F:\jenkins\jenkins-slave\workspace\Mesos-Windows\3rdparty\libprocess\src\tests\metrics_tests.cpp(347): warning C4244: 'argument': conversion from 'double' to 'float', possible loss of data [<https://builds.apache.org/job/Mesos-Windows/ws/build\3rdparty\libprocess\src\tests\process_tests.vcxproj]>
         F:\jenkins\jenkins-slave\workspace\Mesos-Windows\3rdparty\libprocess\src\tests\metrics_tests.cpp(444): warning C4244: 'argument': conversion from 'double' to 'float', possible loss of data [<https://builds.apache.org/job/Mesos-Windows/ws/build\3rdparty\libprocess\src\tests\process_tests.vcxproj]>
         F:\jenkins\jenkins-slave\workspace\Mesos-Windows\3rdparty\libprocess\src\tests\metrics_tests.cpp(469): warning C4244: 'argument': conversion from 'int64_t' to 'float', possible loss of data [<https://builds.apache.org/job/Mesos-Windows/ws/build\3rdparty\libprocess\src\tests\process_tests.vcxproj]>
         F:\jenkins\jenkins-slave\workspace\Mesos-Windows\3rdparty\libprocess\src\tests\metrics_tests.cpp(469): warning C4244: 'argument': conversion from 'const double' to 'float', possible loss of data [<https://builds.apache.org/job/Mesos-Windows/ws/build\3rdparty\libprocess\src\tests\process_tests.vcxproj]>
         F:\jenkins\jenkins-slave\workspace\Mesos-Windows\3rdparty\libprocess\src\tests\metrics_tests.cpp(505): warning C4244: 'argument': conversion from 'const double' to 'float', possible loss of data [<https://builds.apache.org/job/Mesos-Windows/ws/build\3rdparty\libprocess\src\tests\process_tests.vcxproj]>
         F:\jenkins\jenkins-slave\workspace\Mesos-Windows\3rdparty\stout\include\stout/duration.hpp(99): warning C4244: '=': conversion from 'double' to 'long', possible loss of data (compiling source file F:\jenkins\jenkins-slave\workspace\Mesos-Windows\3rdparty\libprocess\src\tests\mutex_tests.cpp) [<https://builds.apache.org/job/Mesos-Windows/ws/build\3rdparty\libprocess\src\tests\process_tests.vcxproj]>
         F:\jenkins\jenkins-slave\workspace\Mesos-Windows\3rdparty\stout\include\stout/duration.hpp(100): warning C4244: '=': conversion from 'double' to 'long', possible loss of data (compiling source file F:\jenkins\jenkins-slave\workspace\Mesos-Windows\3rdparty\libprocess\src\tests\mutex_tests.cpp) [<https://builds.apache.org/job/Mesos-Windows/ws/build\3rdparty\libprocess\src\tests\process_tests.vcxproj]>
         F:\jenkins\jenkins-slave\workspace\Mesos-Windows\3rdparty\stout\include\stout/os/socket.hpp(34): warning C4244: '=': conversion from 'SOCKET' to 'int', possible loss of data (compiling source file F:\jenkins\jenkins-slave\workspace\Mesos-Windows\3rdparty\libprocess\src\tests\mutex_tests.cpp) [<https://builds.apache.org/job/Mesos-Windows/ws/build\3rdparty\libprocess\src\tests\process_tests.vcxproj]>
         F:\jenkins\jenkins-slave\workspace\Mesos-Windows\3rdparty\stout\include\stout/os/windows/close.hpp(51): warning C4800: 'BOOL': forcing value to bool 'true' or 'false' (performance warning) (compiling source file F:\jenkins\jenkins-slave\workspace\Mesos-Windows\3rdparty\libprocess\src\tests\mutex_tests.cpp) [<https://builds.apache.org/job/Mesos-Windows/ws/build\3rdparty\libprocess\src\tests\process_tests.vcxproj]>
         F:\jenkins\jenkins-slave\workspace\Mesos-Windows\3rdparty\stout\include\stout/duration.hpp(99): warning C4244: '=': conversion from 'double' to 'long', possible loss of data (compiling source file F:\jenkins\jenkins-slave\workspace\Mesos-Windows\3rdparty\libprocess\src\tests\owned_tests.cpp) [<https://builds.apache.org/job/Mesos-Windows/ws/build\3rdparty\libprocess\src\tests\process_tests.vcxproj]>
         F:\jenkins\jenkins-slave\workspace\Mesos-Windows\3rdparty\stout\include\stout/duration.hpp(100): warning C4244: '=': conversion from 'double' to 'long', possible loss of data (compiling source file F:\jenkins\jenkins-slave\workspace\Mesos-Windows\3rdparty\libprocess\src\tests\owned_tests.cpp) [<https://builds.apache.org/job/Mesos-Windows/ws/build\3rdparty\libprocess\src\tests\process_tests.vcxproj]>
         F:\jenkins\jenkins-slave\workspace\Mesos-Windows\3rdparty\stout\include\stout/os/socket.hpp(34): warning C4244: '=': conversion from 'SOCKET' to 'int', possible loss of data (compiling source file F:\jenkins\jenkins-slave\workspace\Mesos-Windows\3rdparty\libprocess\src\tests\owned_tests.cpp) [<https://builds.apache.org/job/Mesos-Windows/ws/build\3rdparty\libprocess\src\tests\process_tests.vcxproj]>
         F:\jenkins\jenkins-slave\workspace\Mesos-Windows\3rdparty\stout\include\stout/os/windows/close.hpp(51): warning C4800: 'BOOL': forcing value to bool 'true' or 'false' (performance warning) (compiling source file F:\jenkins\jenkins-slave\workspace\Mesos-Windows\3rdparty\libprocess\src\tests\owned_tests.cpp) [<https://builds.apache.org/job/Mesos-Windows/ws/build\3rdparty\libprocess\src\tests\process_tests.vcxproj]>
         F:\jenkins\jenkins-slave\workspace\Mesos-Windows\3rdparty\stout\include\stout/os/socket.hpp(34): warning C4244: '=': conversion from 'SOCKET' to 'int', possible loss of data (compiling source file F:\jenkins\jenkins-slave\workspace\Mesos-Windows\3rdparty\libprocess\src\tests\process_tests.cpp) [<https://builds.apache.org/job/Mesos-Windows/ws/build\3rdparty\libprocess\src\tests\process_tests.vcxproj]>
         F:\jenkins\jenkins-slave\workspace\Mesos-Windows\3rdparty\stout\include\stout/os/windows/close.hpp(51): warning C4800: 'BOOL': forcing value to bool 'true' or 'false' (performance warning) (compiling source file F:\jenkins\jenkins-slave\workspace\Mesos-Windows\3rdparty\libprocess\src\tests\process_tests.cpp) [<https://builds.apache.org/job/Mesos-Windows/ws/build\3rdparty\libprocess\src\tests\process_tests.vcxproj]>
         F:\jenkins\jenkins-slave\workspace\Mesos-Windows\3rdparty\stout\include\stout/duration.hpp(99): warning C4244: '=': conversion from 'double' to 'long', possible loss of data (compiling source file F:\jenkins\jenkins-slave\workspace\Mesos-Windows\3rdparty\libprocess\src\tests\process_tests.cpp) [<https://builds.apache.org/job/Mesos-Windows/ws/build\3rdparty\libprocess\src\tests\process_tests.vcxproj]>
         F:\jenkins\jenkins-slave\workspace\Mesos-Windows\3rdparty\stout\include\stout/duration.hpp(100): warning C4244: '=': conversion from 'double' to 'long', possible loss of data (compiling source file F:\jenkins\jenkins-slave\workspace\Mesos-Windows\3rdparty\libprocess\src\tests\process_tests.cpp) [<https://builds.apache.org/job/Mesos-Windows/ws/build\3rdparty\libprocess\src\tests\process_tests.vcxproj]>
         F:\jenkins\jenkins-slave\workspace\Mesos-Windows\3rdparty\stout\include\stout/windows/os.hpp(49): warning C4996: 'GetVersionExA': was declared deprecated (compiling source file F:\jenkins\jenkins-slave\workspace\Mesos-Windows\3rdparty\libprocess\src\tests\owned_tests.cpp) [<https://builds.apache.org/job/Mesos-Windows/ws/build\3rdparty\libprocess\src\tests\process_tests.vcxproj]>
         F:\jenkins\jenkins-slave\workspace\Mesos-Windows\3rdparty\stout\include\stout/windows/os.hpp(457): warning C4996: 'GetVersionExA': was declared deprecated (compiling source file F:\jenkins\jenkins-slave\workspace\Mesos-Windows\3rdparty\libprocess\src\tests\owned_tests.cpp) [<https://builds.apache.org/job/Mesos-Windows/ws/build\3rdparty\libprocess\src\tests\process_tests.vcxproj]>
         F:\jenkins\jenkins-slave\workspace\Mesos-Windows\3rdparty\stout\include\stout/duration.hpp(99): warning C4244: '=': conversion from 'double' to 'long', possible loss of data (compiling source file F:\jenkins\jenkins-slave\workspace\Mesos-Windows\3rdparty\libprocess\src\tests\queue_tests.cpp) [<https://builds.apache.org/job/Mesos-Windows/ws/build\3rdparty\libprocess\src\tests\process_tests.vcxproj]>
         F:\jenkins\jenkins-slave\workspace\Mesos-Windows\3rdparty\stout\include\stout/duration.hpp(100): warning C4244: '=': conversion from 'double' to 'long', possible loss of data (compiling source file F:\jenkins\jenkins-slave\workspace\Mesos-Windows\3rdparty\libprocess\src\tests\queue_tests.cpp) [<https://builds.apache.org/job/Mesos-Windows/ws/build\3rdparty\libprocess\src\tests\process_tests.vcxproj]>
         F:\jenkins\jenkins-slave\workspace\Mesos-Windows\3rdparty\stout\include\stout/os/socket.hpp(34): warning C4244: '=': conversion from 'SOCKET' to 'int', possible loss of data (compiling source file F:\jenkins\jenkins-slave\workspace\Mesos-Windows\3rdparty\libprocess\src\tests\queue_tests.cpp) [<https://builds.apache.org/job/Mesos-Windows/ws/build\3rdparty\libprocess\src\tests\process_tests.vcxproj]>
         F:\jenkins\jenkins-slave\workspace\Mesos-Windows\3rdparty\stout\include\stout/os/windows/close.hpp(51): warning C4800: 'BOOL': forcing value to bool 'true' or 'false' (performance warning) (compiling source file F:\jenkins\jenkins-slave\workspace\Mesos-Windows\3rdparty\libprocess\src\tests\queue_tests.cpp) [<https://builds.apache.org/job/Mesos-Windows/ws/build\3rdparty\libprocess\src\tests\process_tests.vcxproj]>
         F:\jenkins\jenkins-slave\workspace\Mesos-Windows\3rdparty\stout\include\stout/os/windows/shell.hpp(119): warning C4244: 'return': conversion from 'intptr_t' to 'int', possible loss of data (compiling source file F:\jenkins\jenkins-slave\workspace\Mesos-Windows\3rdparty\libprocess\src\tests\owned_tests.cpp) [<https://builds.apache.org/job/Mesos-Windows/ws/build\3rdparty\libprocess\src\tests\process_tests.vcxproj]>
         F:\jenkins\jenkins-slave\workspace\Mesos-Windows\3rdparty\stout\include\stout/windows/os.hpp(49): warning C4996: 'GetVersionExA': was declared deprecated (compiling source file F:\jenkins\jenkins-slave\workspace\Mesos-Windows\3rdparty\libprocess\src\tests\process_tests.cpp) [<https://builds.apache.org/job/Mesos-Windows/ws/build\3rdparty\libprocess\src\tests\process_tests.vcxproj]>
         F:\jenkins\jenkins-slave\workspace\Mesos-Windows\3rdparty\stout\include\stout/os/socket.hpp(34): warning C4244: '=': conversion from 'SOCKET' to 'int', possible loss of data (compiling source file F:\jenkins\jenkins-slave\workspace\Mesos-Windows\3rdparty\libprocess\src\tests\sequence_tests.cpp) [<https://builds.apache.org/job/Mesos-Windows/ws/build\3rdparty\libprocess\src\tests\process_tests.vcxproj]>
         F:\jenkins\jenkins-slave\workspace\Mesos-Windows\3rdparty\stout\include\stout/os/windows/close.hpp(51): warning C4800: 'BOOL': forcing value to bool 'true' or 'false' (performance warning) (compiling source file F:\jenkins\jenkins-slave\workspace\Mesos-Windows\3rdparty\libprocess\src\tests\sequence_tests.cpp) [<https://builds.apache.org/job/Mesos-Windows/ws/build\3rdparty\libprocess\src\tests\process_tests.vcxproj]>
         F:\jenkins\jenkins-slave\workspace\Mesos-Windows\3rdparty\stout\include\stout/windows/os.hpp(457): warning C4996: 'GetVersionExA': was declared deprecated (compiling source file F:\jenkins\jenkins-slave\workspace\Mesos-Windows\3rdparty\libprocess\src\tests\process_tests.cpp) [<https://builds.apache.org/job/Mesos-Windows/ws/build\3rdparty\libprocess\src\tests\process_tests.vcxproj]>
         F:\jenkins\jenkins-slave\workspace\Mesos-Windows\3rdparty\stout\include\stout/duration.hpp(99): warning C4244: '=': conversion from 'double' to 'long', possible loss of data (compiling source file F:\jenkins\jenkins-slave\workspace\Mesos-Windows\3rdparty\libprocess\src\tests\sequence_tests.cpp) [<https://builds.apache.org/job/Mesos-Windows/ws/build\3rdparty\libprocess\src\tests\process_tests.vcxproj]>
         F:\jenkins\jenkins-slave\workspace\Mesos-Windows\3rdparty\stout\include\stout/duration.hpp(100): warning C4244: '=': conversion from 'double' to 'long', possible loss of data (compiling source file F:\jenkins\jenkins-slave\workspace\Mesos-Windows\3rdparty\libprocess\src\tests\sequence_tests.cpp) [<https://builds.apache.org/job/Mesos-Windows/ws/build\3rdparty\libprocess\src\tests\process_tests.vcxproj]>
         F:\jenkins\jenkins-slave\workspace\Mesos-Windows\3rdparty\stout\include\stout/os/windows/shell.hpp(119): warning C4244: 'return': conversion from 'intptr_t' to 'int', possible loss of data (compiling source file F:\jenkins\jenkins-slave\workspace\Mesos-Windows\3rdparty\libprocess\src\tests\process_tests.cpp) [<https://builds.apache.org/job/Mesos-Windows/ws/build\3rdparty\libprocess\src\tests\process_tests.vcxproj]>
         F:\jenkins\jenkins-slave\workspace\Mesos-Windows\3rdparty\libprocess\include\process/network.hpp(36): warning C4244: 'initializing': conversion from 'SOCKET' to 'int', possible loss of data (compiling source file F:\jenkins\jenkins-slave\workspace\Mesos-Windows\3rdparty\libprocess\src\tests\process_tests.cpp) [<https://builds.apache.org/job/Mesos-Windows/ws/build\3rdparty\libprocess\src\tests\process_tests.vcxproj]>
         F:\jenkins\jenkins-slave\workspace\Mesos-Windows\3rdparty\stout\include\stout/gzip.hpp(126): warning C4267: '=': conversion from 'size_t' to 'uInt', possible loss of data (compiling source file F:\jenkins\jenkins-slave\workspace\Mesos-Windows\3rdparty\libprocess\src\tests\process_tests.cpp) [<https://builds.apache.org/job/Mesos-Windows/ws/build\3rdparty\libprocess\src\tests\process_tests.vcxproj]>
         F:\jenkins\jenkins-slave\workspace\Mesos-Windows\3rdparty\stout\include\stout/gzip.hpp(192): warning C4267: '=': conversion from 'size_t' to 'uInt', possible loss of data (compiling source file F:\jenkins\jenkins-slave\workspace\Mesos-Windows\3rdparty\libprocess\src\tests\process_tests.cpp) [<https://builds.apache.org/job/Mesos-Windows/ws/build\3rdparty\libprocess\src\tests\process_tests.vcxproj]>
         F:\jenkins\jenkins-slave\workspace\Mesos-Windows\3rdparty\libprocess\src\encoder.hpp(246): warning C4267: 'initializing': conversion from 'size_t' to 'off_t', possible loss of data (compiling source file F:\jenkins\jenkins-slave\workspace\Mesos-Windows\3rdparty\libprocess\src\tests\process_tests.cpp) [<https://builds.apache.org/job/Mesos-Windows/ws/build\3rdparty\libprocess\src\tests\process_tests.vcxproj]>
         F:\jenkins\jenkins-slave\workspace\Mesos-Windows\3rdparty\libprocess\src\encoder.hpp(271): warning C4267: '-=': conversion from 'size_t' to 'off_t', possible loss of data (compiling source file F:\jenkins\jenkins-slave\workspace\Mesos-Windows\3rdparty\libprocess\src\tests\process_tests.cpp) [<https://builds.apache.org/job/Mesos-Windows/ws/build\3rdparty\libprocess\src\tests\process_tests.vcxproj]>
         F:\jenkins\jenkins-slave\workspace\Mesos-Windows\3rdparty\stout\include\stout/windows/os.hpp(49): warning C4996: 'GetVersionExA': was declared deprecated (compiling source file F:\jenkins\jenkins-slave\workspace\Mesos-Windows\3rdparty\libprocess\src\tests\sequence_tests.cpp) [<https://builds.apache.org/job/Mesos-Windows/ws/build\3rdparty\libprocess\src\tests\process_tests.vcxproj]>
         F:\jenkins\jenkins-slave\workspace\Mesos-Windows\3rdparty\stout\include\stout/windows/os.hpp(457): warning C4996: 'GetVersionExA': was declared deprecated (compiling source file F:\jenkins\jenkins-slave\workspace\Mesos-Windows\3rdparty\libprocess\src\tests\sequence_tests.cpp) [<https://builds.apache.org/job/Mesos-Windows/ws/build\3rdparty\libprocess\src\tests\process_tests.vcxproj]>
         F:\jenkins\jenkins-slave\workspace\Mesos-Windows\3rdparty\stout\include\stout/os/windows/shell.hpp(119): warning C4244: 'return': conversion from 'intptr_t' to 'int', possible loss of data (compiling source file F:\jenkins\jenkins-slave\workspace\Mesos-Windows\3rdparty\libprocess\src\tests\sequence_tests.cpp) [<https://builds.apache.org/job/Mesos-Windows/ws/build\3rdparty\libprocess\src\tests\process_tests.vcxproj]>
         F:\jenkins\jenkins-slave\workspace\Mesos-Windows\3rdparty\stout\include\stout/duration.hpp(99): warning C4244: '=': conversion from 'double' to 'long', possible loss of data (compiling source file F:\jenkins\jenkins-slave\workspace\Mesos-Windows\3rdparty\libprocess\src\tests\shared_tests.cpp) [<https://builds.apache.org/job/Mesos-Windows/ws/build\3rdparty\libprocess\src\tests\process_tests.vcxproj]>
         F:\jenkins\jenkins-slave\workspace\Mesos-Windows\3rdparty\stout\include\stout/duration.hpp(100): warning C4244: '=': conversion from 'double' to 'long', possible loss of data (compiling source file F:\jenkins\jenkins-slave\workspace\Mesos-Windows\3rdparty\libprocess\src\tests\shared_tests.cpp) [<https://builds.apache.org/job/Mesos-Windows/ws/build\3rdparty\libprocess\src\tests\process_tests.vcxproj]>
         F:\jenkins\jenkins-slave\workspace\Mesos-Windows\3rdparty\stout\include\stout/os/socket.hpp(34): warning C4244: '=': conversion from 'SOCKET' to 'int', possible loss of data (compiling source file F:\jenkins\jenkins-slave\workspace\Mesos-Windows\3rdparty\libprocess\src\tests\shared_tests.cpp) [<https://builds.apache.org/job/Mesos-Windows/ws/build\3rdparty\libprocess\src\tests\process_tests.vcxproj]>
         F:\jenkins\jenkins-slave\workspace\Mesos-Windows\3rdparty\stout\include\stout/os/windows/close.hpp(51): warning C4800: 'BOOL': forcing value to bool 'true' or 'false' (performance warning) (compiling source file F:\jenkins\jenkins-slave\workspace\Mesos-Windows\3rdparty\libprocess\src\tests\shared_tests.cpp) [<https://builds.apache.org/job/Mesos-Windows/ws/build\3rdparty\libprocess\src\tests\process_tests.vcxproj]>
         F:\jenkins\jenkins-slave\workspace\Mesos-Windows\3rdparty\stout\include\stout/windows/os.hpp(49): warning C4996: 'GetVersionExA': was declared deprecated (compiling source file F:\jenkins\jenkins-slave\workspace\Mesos-Windows\3rdparty\libprocess\src\tests\shared_tests.cpp) [<https://builds.apache.org/job/Mesos-Windows/ws/build\3rdparty\libprocess\src\tests\process_tests.vcxproj]>
         F:\jenkins\jenkins-slave\workspace\Mesos-Windows\3rdparty\stout\include\stout/windows/os.hpp(457): warning C4996: 'GetVersionExA': was declared deprecated (compiling source file F:\jenkins\jenkins-slave\workspace\Mesos-Windows\3rdparty\libprocess\src\tests\shared_tests.cpp) [<https://builds.apache.org/job/Mesos-Windows/ws/build\3rdparty\libprocess\src\tests\process_tests.vcxproj]>
         F:\jenkins\jenkins-slave\workspace\Mesos-Windows\3rdparty\stout\include\stout/os/windows/shell.hpp(119): warning C4244: 'return': conversion from 'intptr_t' to 'int', possible loss of data (compiling source file F:\jenkins\jenkins-slave\workspace\Mesos-Windows\3rdparty\libprocess\src\tests\shared_tests.cpp) [<https://builds.apache.org/job/Mesos-Windows/ws/build\3rdparty\libprocess\src\tests\process_tests.vcxproj]>
         F:\jenkins\jenkins-slave\workspace\Mesos-Windows\3rdparty\stout\include\stout/duration.hpp(99): warning C4244: '=': conversion from 'double' to 'long', possible loss of data (compiling source file F:\jenkins\jenkins-slave\workspace\Mesos-Windows\3rdparty\libprocess\src\tests\socket_tests.cpp) [<https://builds.apache.org/job/Mesos-Windows/ws/build\3rdparty\libprocess\src\tests\process_tests.vcxproj]>
         F:\jenkins\jenkins-slave\workspace\Mesos-Windows\3rdparty\stout\include\stout/duration.hpp(100): warning C4244: '=': conversion from 'double' to 'long', possible loss of data (compiling source file F:\jenkins\jenkins-slave\workspace\Mesos-Windows\3rdparty\libprocess\src\tests\socket_tests.cpp) [<https://builds.apache.org/job/Mesos-Windows/ws/build\3rdparty\libprocess\src\tests\process_tests.vcxproj]>
         F:\jenkins\jenkins-slave\workspace\Mesos-Windows\3rdparty\stout\include\stout/os/socket.hpp(34): warning C4244: '=': conversion from 'SOCKET' to 'int', possible loss of data (compiling source file F:\jenkins\jenkins-slave\workspace\Mesos-Windows\3rdparty\libprocess\src\tests\socket_tests.cpp) [<https://builds.apache.org/job/Mesos-Windows/ws/build\3rdparty\libprocess\src\tests\process_tests.vcxproj]>
         F:\jenkins\jenkins-slave\workspace\Mesos-Windows\3rdparty\stout\include\stout/os/windows/close.hpp(51): warning C4800: 'BOOL': forcing value to bool 'true' or 'false' (performance warning) (compiling source file F:\jenkins\jenkins-slave\workspace\Mesos-Windows\3rdparty\libprocess\src\tests\socket_tests.cpp) [<https://builds.apache.org/job/Mesos-Windows/ws/build\3rdparty\libprocess\src\tests\process_tests.vcxproj]>
         F:\jenkins\jenkins-slave\workspace\Mesos-Windows\3rdparty\stout\include\stout/windows/os.hpp(49): warning C4996: 'GetVersionExA': was declared deprecated (compiling source file F:\jenkins\jenkins-slave\workspace\Mesos-Windows\3rdparty\libprocess\src\tests\socket_tests.cpp) [<https://builds.apache.org/job/Mesos-Windows/ws/build\3rdparty\libprocess\src\tests\process_tests.vcxproj]>
         F:\jenkins\jenkins-slave\workspace\Mesos-Windows\3rdparty\stout\include\stout/windows/os.hpp(457): warning C4996: 'GetVersionExA': was declared deprecated (compiling source file F:\jenkins\jenkins-slave\workspace\Mesos-Windows\3rdparty\libprocess\src\tests\socket_tests.cpp) [<https://builds.apache.org/job/Mesos-Windows/ws/build\3rdparty\libprocess\src\tests\process_tests.vcxproj]>
         F:\jenkins\jenkins-slave\workspace\Mesos-Windows\3rdparty\stout\include\stout/os/windows/shell.hpp(119): warning C4244: 'return': conversion from 'intptr_t' to 'int', possible loss of data (compiling source file F:\jenkins\jenkins-slave\workspace\Mesos-Windows\3rdparty\libprocess\src\tests\socket_tests.cpp) [<https://builds.apache.org/job/Mesos-Windows/ws/build\3rdparty\libprocess\src\tests\process_tests.vcxproj]>
         F:\jenkins\jenkins-slave\workspace\Mesos-Windows\3rdparty\stout\include\stout/duration.hpp(99): warning C4244: '=': conversion from 'double' to 'long', possible loss of data (compiling source file F:\jenkins\jenkins-slave\workspace\Mesos-Windows\3rdparty\libprocess\src\tests\statistics_tests.cpp) [<https://builds.apache.org/job/Mesos-Windows/ws/build\3rdparty\libprocess\src\tests\process_tests.vcxproj]>
         F:\jenkins\jenkins-slave\workspace\Mesos-Windows\3rdparty\stout\include\stout/duration.hpp(100): warning C4244: '=': conversion from 'double' to 'long', possible loss of data (compiling source file F:\jenkins\jenkins-slave\workspace\Mesos-Windows\3rdparty\libprocess\src\tests\statistics_tests.cpp) [<https://builds.apache.org/job/Mesos-Windows/ws/build\3rdparty\libprocess\src\tests\process_tests.vcxproj]>
         F:\jenkins\jenkins-slave\workspace\Mesos-Windows\3rdparty\stout\include\stout/os/socket.hpp(34): warning C4244: '=': conversion from 'SOCKET' to 'int', possible loss of data (compiling source file F:\jenkins\jenkins-slave\workspace\Mesos-Windows\3rdparty\libprocess\src\tests\subprocess_tests.cpp) [<https://builds.apache.org/job/Mesos-Windows/ws/build\3rdparty\libprocess\src\tests\process_tests.vcxproj]>
         F:\jenkins\jenkins-slave\workspace\Mesos-Windows\3rdparty\stout\include\stout/os/windows/close.hpp(51): warning C4800: 'BOOL': forcing value to bool 'true' or 'false' (performance warning) (compiling source file F:\jenkins\jenkins-slave\workspace\Mesos-Windows\3rdparty\libprocess\src\tests\subprocess_tests.cpp) [<https://builds.apache.org/job/Mesos-Windows/ws/build\3rdparty\libprocess\src\tests\process_tests.vcxproj]>
         F:\jenkins\jenkins-slave\workspace\Mesos-Windows\3rdparty\stout\include\stout/duration.hpp(99): warning C4244: '=': conversion from 'double' to 'long', possible loss of data (compiling source file F:\jenkins\jenkins-slave\workspace\Mesos-Windows\3rdparty\libprocess\src\tests\subprocess_tests.cpp) [<https://builds.apache.org/job/Mesos-Windows/ws/build\3rdparty\libprocess\src\tests\process_tests.vcxproj]>
         F:\jenkins\jenkins-slave\workspace\Mesos-Windows\3rdparty\stout\include\stout/duration.hpp(100): warning C4244: '=': conversion from 'double' to 'long', possible loss of data (compiling source file F:\jenkins\jenkins-slave\workspace\Mesos-Windows\3rdparty\libprocess\src\tests\subprocess_tests.cpp) [<https://builds.apache.org/job/Mesos-Windows/ws/build\3rdparty\libprocess\src\tests\process_tests.vcxproj]>
         F:\jenkins\jenkins-slave\workspace\Mesos-Windows\3rdparty\stout\include\stout/windows/os.hpp(49): warning C4996: 'GetVersionExA': was declared deprecated (compiling source file F:\jenkins\jenkins-slave\workspace\Mesos-Windows\3rdparty\libprocess\src\tests\subprocess_tests.cpp) [<https://builds.apache.org/job/Mesos-Windows/ws/build\3rdparty\libprocess\src\tests\process_tests.vcxproj]>
         F:\jenkins\jenkins-slave\workspace\Mesos-Windows\3rdparty\stout\include\stout/windows/os.hpp(457): warning C4996: 'GetVersionExA': was declared deprecated (compiling source file F:\jenkins\jenkins-slave\workspace\Mesos-Windows\3rdparty\libprocess\src\tests\subprocess_tests.cpp) [<https://builds.apache.org/job/Mesos-Windows/ws/build\3rdparty\libprocess\src\tests\process_tests.vcxproj]>
         F:\jenkins\jenkins-slave\workspace\Mesos-Windows\3rdparty\stout\include\stout/os/windows/shell.hpp(119): warning C4244: 'return': conversion from 'intptr_t' to 'int', possible loss of data (compiling source file F:\jenkins\jenkins-slave\workspace\Mesos-Windows\3rdparty\libprocess\src\tests\subprocess_tests.cpp) [<https://builds.apache.org/job/Mesos-Windows/ws/build\3rdparty\libprocess\src\tests\process_tests.vcxproj]>
         F:\jenkins\jenkins-slave\workspace\Mesos-Windows\3rdparty\stout\include\stout/duration.hpp(99): warning C4244: '=': conversion from 'double' to 'long', possible loss of data (compiling source file F:\jenkins\jenkins-slave\workspace\Mesos-Windows\3rdparty\libprocess\src\tests\system_tests.cpp) [<https://builds.apache.org/job/Mesos-Windows/ws/build\3rdparty\libprocess\src\tests\process_tests.vcxproj]>
         F:\jenkins\jenkins-slave\workspace\Mesos-Windows\3rdparty\stout\include\stout/duration.hpp(100): warning C4244: '=': conversion from 'double' to 'long', possible loss of data (compiling source file F:\jenkins\jenkins-slave\workspace\Mesos-Windows\3rdparty\libprocess\src\tests\system_tests.cpp) [<https://builds.apache.org/job/Mesos-Windows/ws/build\3rdparty\libprocess\src\tests\process_tests.vcxproj]>
         F:\jenkins\jenkins-slave\workspace\Mesos-Windows\3rdparty\stout\include\stout/os/socket.hpp(34): warning C4244: '=': conversion from 'SOCKET' to 'int', possible loss of data (compiling source file F:\jenkins\jenkins-slave\workspace\Mesos-Windows\3rdparty\libprocess\src\tests\system_tests.cpp) [<https://builds.apache.org/job/Mesos-Windows/ws/build\3rdparty\libprocess\src\tests\process_tests.vcxproj]>
         F:\jenkins\jenkins-slave\workspace\Mesos-Windows\3rdparty\stout\include\stout/os/windows/close.hpp(51): warning C4800: 'BOOL': forcing value to bool 'true' or 'false' (performance warning) (compiling source file F:\jenkins\jenkins-slave\workspace\Mesos-Windows\3rdparty\libprocess\src\tests\system_tests.cpp) [<https://builds.apache.org/job/Mesos-Windows/ws/build\3rdparty\libprocess\src\tests\process_tests.vcxproj]>
         F:\jenkins\jenkins-slave\workspace\Mesos-Windows\3rdparty\stout\include\stout/duration.hpp(99): warning C4244: '=': conversion from 'double' to 'long', possible loss of data (compiling source file F:\jenkins\jenkins-slave\workspace\Mesos-Windows\3rdparty\libprocess\src\tests\time_tests.cpp) [<https://builds.apache.org/job/Mesos-Windows/ws/build\3rdparty\libprocess\src\tests\process_tests.vcxproj]>
         F:\jenkins\jenkins-slave\workspace\Mesos-Windows\3rdparty\stout\include\stout/duration.hpp(100): warning C4244: '=': conversion from 'double' to 'long', possible loss of data (compiling source file F:\jenkins\jenkins-slave\workspace\Mesos-Windows\3rdparty\libprocess\src\tests\time_tests.cpp) [<https://builds.apache.org/job/Mesos-Windows/ws/build\3rdparty\libprocess\src\tests\process_tests.vcxproj]>
         F:\jenkins\jenkins-slave\workspace\Mesos-Windows\3rdparty\stout\include\stout/os/socket.hpp(34): warning C4244: '=': conversion from 'SOCKET' to 'int', possible loss of data (compiling source file F:\jenkins\jenkins-slave\workspace\Mesos-Windows\3rdparty\libprocess\src\tests\time_tests.cpp) [<https://builds.apache.org/job/Mesos-Windows/ws/build\3rdparty\libprocess\src\tests\process_tests.vcxproj]>
         F:\jenkins\jenkins-slave\workspace\Mesos-Windows\3rdparty\stout\include\stout/windows/os.hpp(49): warning C4996: 'GetVersionExA': was declared deprecated (compiling source file F:\jenkins\jenkins-slave\workspace\Mesos-Windows\3rdparty\libprocess\src\tests\system_tests.cpp) [<https://builds.apache.org/job/Mesos-Windows/ws/build\3rdparty\libprocess\src\tests\process_tests.vcxproj]>
         F:\jenkins\jenkins-slave\workspace\Mesos-Windows\3rdparty\stout\include\stout/windows/os.hpp(49): warning C4996: 'GetVersionExA': was declared deprecated (compiling source file F:\jenkins\jenkins-slave\workspace\Mesos-Windows\3rdparty\libprocess\src\tests\time_tests.cpp) [<https://builds.apache.org/job/Mesos-Windows/ws/build\3rdparty\libprocess\src\tests\process_tests.vcxproj]>
         F:\jenkins\jenkins-slave\workspace\Mesos-Windows\3rdparty\stout\include\stout/windows/os.hpp(457): warning C4996: 'GetVersionExA': was declared deprecated (compiling source file F:\jenkins\jenkins-slave\workspace\Mesos-Windows\3rdparty\libprocess\src\tests\system_tests.cpp) [<https://builds.apache.org/job/Mesos-Windows/ws/build\3rdparty\libprocess\src\tests\process_tests.vcxproj]>
         F:\jenkins\jenkins-slave\workspace\Mesos-Windows\3rdparty\stout\include\stout/windows/os.hpp(457): warning C4996: 'GetVersionExA': was declared deprecated (compiling source file F:\jenkins\jenkins-slave\workspace\Mesos-Windows\3rdparty\libprocess\src\tests\time_tests.cpp) [<https://builds.apache.org/job/Mesos-Windows/ws/build\3rdparty\libprocess\src\tests\process_tests.vcxproj]>
         F:\jenkins\jenkins-slave\workspace\Mesos-Windows\3rdparty\stout\include\stout/os/windows/close.hpp(51): warning C4800: 'BOOL': forcing value to bool 'true' or 'false' (performance warning) (compiling source file F:\jenkins\jenkins-slave\workspace\Mesos-Windows\3rdparty\libprocess\src\tests\time_tests.cpp) [<https://builds.apache.org/job/Mesos-Windows/ws/build\3rdparty\libprocess\src\tests\process_tests.vcxproj]>
         F:\jenkins\jenkins-slave\workspace\Mesos-Windows\3rdparty\stout\include\stout/os/windows/shell.hpp(119): warning C4244: 'return': conversion from 'intptr_t' to 'int', possible loss of data (compiling source file F:\jenkins\jenkins-slave\workspace\Mesos-Windows\3rdparty\libprocess\src\tests\system_tests.cpp) [<https://builds.apache.org/job/Mesos-Windows/ws/build\3rdparty\libprocess\src\tests\process_tests.vcxproj]>
         F:\jenkins\jenkins-slave\workspace\Mesos-Windows\3rdparty\stout\include\stout/os/windows/shell.hpp(119): warning C4244: 'return': conversion from 'intptr_t' to 'int', possible loss of data (compiling source file F:\jenkins\jenkins-slave\workspace\Mesos-Windows\3rdparty\libprocess\src\tests\time_tests.cpp) [<https://builds.apache.org/job/Mesos-Windows/ws/build\3rdparty\libprocess\src\tests\process_tests.vcxproj]>
         F:\jenkins\jenkins-slave\workspace\Mesos-Windows\3rdparty\stout\include\stout/duration.hpp(99): warning C4244: '=': conversion from 'double' to 'long', possible loss of data (compiling source file F:\jenkins\jenkins-slave\workspace\Mesos-Windows\3rdparty\libprocess\src\tests\timeseries_tests.cpp) [<https://builds.apache.org/job/Mesos-Windows/ws/build\3rdparty\libprocess\src\tests\process_tests.vcxproj]>
         F:\jenkins\jenkins-slave\workspace\Mesos-Windows\3rdparty\stout\include\stout/duration.hpp(100): warning C4244: '=': conversion from 'double' to 'long', possible loss of data (compiling source file F:\jenkins\jenkins-slave\workspace\Mesos-Windows\3rdparty\libprocess\src\tests\timeseries_tests.cpp) [<https://builds.apache.org/job/Mesos-Windows/ws/build\3rdparty\libprocess\src\tests\process_tests.vcxproj]>


       "<https://builds.apache.org/job/Mesos-Windows/ws/build\Mesos.sln"> (process_tests target) (1) ->
       "<https://builds.apache.org/job/Mesos-Windows/ws/build\3rdparty\libprocess\src\tests\process_tests.vcxproj.metaproj"> (default target) (2) ->
       "<https://builds.apache.org/job/Mesos-Windows/ws/build\3rdparty\libprocess\src\tests\process_tests.vcxproj"> (default target) (30) ->
       (ClCompile target) -> 
         F:\jenkins\jenkins-slave\workspace\Mesos-Windows\3rdparty\libprocess\src\tests\http_tests.cpp(210): error C2121: '#': invalid character: possibly the result of a macro expansion [<https://builds.apache.org/job/Mesos-Windows/ws/build\3rdparty\libprocess\src\tests\process_tests.vcxproj]>
         F:\jenkins\jenkins-slave\workspace\Mesos-Windows\3rdparty\libprocess\src\tests\http_tests.cpp(210): error C2065: 'ifdef': undeclared identifier [<https://builds.apache.org/job/Mesos-Windows/ws/build\3rdparty\libprocess\src\tests\process_tests.vcxproj]>
         F:\jenkins\jenkins-slave\workspace\Mesos-Windows\3rdparty\libprocess\src\tests\http_tests.cpp(210): error C2146: syntax error: missing ')' before identifier 'USE_SSL_SOCKET' [<https://builds.apache.org/job/Mesos-Windows/ws/build\3rdparty\libprocess\src\tests\process_tests.vcxproj]>

    389 Warning(s)
    3 Error(s)

Time Elapsed 00:06:20.84

<https://builds.apache.org/job/Mesos-Windows/ws/build>if> 1 NEQ 0 exit /b 1 
Build step 'Execute Windows batch command' marked build as failure

Mime
View raw message