mesos-builds mailing list archives

Site index · List index
Message view « Date » · « Thread »
Top « Date » · « Thread »
From Apache Jenkins Server <jenk...@builds.apache.org>
Subject Build failed in Jenkins: Mesos-Windows #894
Date Thu, 01 Dec 2016 18:54:03 GMT
See <https://builds.apache.org/job/Mesos-Windows/894/changes>

Changes:

[yujie.jay] Updated 'io::redirect()' to take an optional vector of callback hooks.

[yujie.jay] Added a server side component for the IOSwitchboard.

[yujie.jay] Updated the io switchboard to launch an external io switchboard server.

[yujie.jay] Added `getContainerIOSwitchboardAddress` helper to containerizer paths.

[yujie.jay] Added implementation for containerizer 'attach()' call.

[yujie.jay] Added support to handle ATTACH_CONTAINER_OUPUT in the io switchbaord.

[yujie.jay] Enabled the IO switchboard server by default for tests.

------------------------------------------
[...truncated 7295 lines...]
W1201 10:53:52.853282  5924 fcntl.hpp:82] `os::isNonblock` has been called, but is a stub
on Windows
W1201 10:53:52.854279  4240 fcntl.hpp:82] `os::isNonblock` has been called, but is a stub
on Windows
W1201 10:53:52.858278  4652 fcntl.hpp:30] `os::cloexec` has been called, but is a no-op on
Windows
W1201 10:53:52.858278  5924 fcntl.hpp:30] `os::cloexec` has been called, but is a no-op on
Windows
W1201 10:53:52.859274  5924 fcntl.hpp:82] `os::isNonblock` has been called, but is a stub
on Windows
W1201 10:53:52.860277  4240 fcntl.hpp:82] `os::isNonblock` has been called, but is a stub
on Windows
W1201 10:53:52.861312  4652 fcntl.hpp:30] `os::cloexec` has been called, but is a no-op on
Windows
W1201 10:53:52.861312  5924 fcntl.hpp:30] `os::cloexec` has been called, but is a no-op on
Windows
W1201 10:53:52.862277  5924 fcntl.hpp:82] `os::isNonblock` has been called, but is a stub
on Windows
W1201 10:53:52.863314  2356 fcntl.hpp:82] `os::isNonblock` has been called, but is a stub
on Windows
W1201 10:53:52.866273  4652 fcntl.hpp:30] `os::cloexec` has been called, but is a no-op on
Windows
W1201 10:53:52.866273  5924 fcntl.hpp:30] `os::cloexec` has been called, but is a no-op on
Windows
W1201 10:53:52.867287  5924 fcntl.hpp:82] `os::isNonblock` has been called, but is a stub
on Windows
W1201 10:53:52.868285  4332 fcntl.hpp:82] `os::isNonblock` has been called, but is a[    
  OK ] HTTPConnectionTest.RequestStreaming (21 ms)
[----------] 8 tests from HTTPConnectionTest (179 ms total)

[----------] 2 tests from URLTest
[ RUN      ] URLTest.Stringification
[       OK ] URLTest.Stringification (1 ms)
[ RUN      ] URLTest.ParseUrls
[       OK ] URLTest.ParseUrls (1 ms)
[----------] 2 tests from URLTest (3 ms total)

[----------] 6 tests from HttpAuthenticationTest
[ RUN      ] HttpAuthenticationTest.NoAuthenticator
[       OK ] HttpAuthenticationTest.NoAuthenticator (16 ms)
[ RUN      ] HttpAuthenticationTest.Unauthorized
[       OK ] HttpAuthenticationTest.Unauthorized (20 ms)
[ RUN      ] HttpAuthenticationTest.Forbidden
[       OK ] HttpAuthenticationTest.Forbidden (16 ms)
[ RUN      ] HttpAuthenticationTest.Authenticated
[       OK ] HttpAuthenticationTest.Authenticated (18 ms)
[ RUN      ] HttpAuthenticationTest.Pipelining
[       OK ] HttpAuthenticationTest.Pipelining (28 ms)
[ RUN      ] HttpAuthenticationTest.Basic
 stub on Windows
W1201 10:53:52.872285  5924 fcntl.hpp:82] `os::isNonblock` has been called, but is a stub
on Windows
W1201 10:53:52.876271  5924 fcntl.hpp:82] `os::isNonblock` has been called, but is a stub
on Windows
W1201 10:53:52.877262  5924 fcntl.hpp:82] `os::isNonblock` has been called, but is a stub
on Windows
W1201 10:53:52.883275  2356 fcntl.hpp:82] `os::isNonblock` has been called, but is a stub
on Windows
W1201 10:53:52.891271  4652 fcntl.hpp:30] `os::cloexec` has been called, but is a no-op on
Windows
W1201 10:53:52.891271  5924 fcntl.hpp:30] `os::cloexec` has been called, but is a no-op on
Windows
W1201 10:53:52.892271  5924 fcntl.hpp:82] `os::isNonblock` has been called, but is a stub
on Windows
W1201 10:53:52.893265  2572 fcntl.hpp:82] `os::isNonblock` has been called, but is a stub
on Windows
W1201 10:53:52.895270  5924 fcntl.hpp:82] `os::isNonblock` has been called, but is a stub
on Windows
W1201 10:53:52.907281  4652 fcntl.hpp:30] `os::cloexec` has been called, but is a no-op on
Windows
W1201 10:53:52.908273  5924 fcntl.hpp:30] `os::cloexec` has been called, but is a no-op on
Windows
W1201 10:53:52.908273  5924 fcntl.hpp:82] `os::isNonblock` has been called, but is a stub
on Windows
W1201 10:53:52.910280  2572 fcntl.hpp:82] `os::isNonblock` has been called, but is a stub
on Windows
W1201 10:53:52.914271  5924 fcntl.hpp:82] `os::isNonblock` has been called, but is a stub
on Windows
W1201 10:53:52.927273  4652 fcntl.hpp:30] `os::cloexec` has been called, but is a no-op on
Windows
W1201 10:53:52.928272  5924 fcntl.hpp:30] `os::cloexec` has been called, but is a no-op on
Windows
W1201 10:53:52.928272  5924 fcntl.hpp:82] `os::isNonblock` has been called, but is a stub
on Windows
W1201 10:53:52.929277  5088 fcntl.hpp:82] `os::isNonblock` has been called, but is a stub
on Windows
W1201 10:53:52.932281  5924 fcntl.hpp:82] `os::isNonblock` has been called, but is a stub
on Windows
W1201 10:53:52.943276  4652 fcntl.hpp:30] `os::cloexec` has been called, but is a no-op on
Windows
W1201 10:53:52.944284  5924 fcntl.hpp:30] `os::cloexec` has been called, but is a no-op on
Windows
W1201 10:53:52.944284  5924 fcntl.hpp:82] `os::isNonblock` has been called, but is a stub
on Windows
W1201 10:53:52.946313  2616 fcntl.hpp:82] `os::isNonblock` has been called, but is a stub
on Windows
W1201 10:53:52.948273  5924 fcntl.hpp:82] `os::isNonblock` has been called, but is a stub
on Windows
W1201 10:53:52.962271  4652 fcntl.hpp:30] `os::cloexec` has been called, but is a no-op on
Windows
W1201 10:53:52.963270  5924 fcntl.hpp:30] `os::cloexec` has been called, but is a no-op on
Windows
W1201 10:53:52.964282  5924 fcntl.hpp:82] `os::isNonblock` has been called, but is a stub
on Windows
W1201 10:53:52.965278  2616 fcntl.hpp:82] `os::isNonblock` has been called, but is a stub
on Windows
W1201 10:53:52.968274  5924 fcntl.hpp:82] `os::isNonblock` has been called, but is a stub
on Windows
W1201 10:53:52.970271  5924 fcntl.hpp:82] `os::isNonblock` has been called, but is a stub
on Windows
W1201 10:53:52.979271  5088 fcntl.hpp:82] `os::isNonblock` has been called, but is a stub
on Windows
W1201 10:53:52.983269  5088 fcntl.hpp:82] `os::isNonblock` has been called, but is a stub
on Windows
W1201 10:53:52.990278  4652 fcntl.hpp:30] `os::cloexec` has been called, but is a no-op on
Windows
W1201 10:53:52.990278  5924 fcntl.hpp:30] `os::cloexec` has been called, but is a no-op on
Windows
W1201 10:53:52.991272  5924 fcntl.hpp:82] `os::isNonblock` has been called, but is a stub
on Windows
W1201 10:53:52.993290  2356 fcntl.hpp:82] `os::isNonblock` has been called, but is a stub
on Windows
W1201 10:53:52.996285  5924 fcntl.hpp:82] `os::isNonblock` has been called, but is a stub
on Windows
W1201 10:53:53.007271  4652 fcntl.hpp:30] `os::cloexec` has been called, but is a no-op on
Windows
W1201 10:53:53.008270  5924 fcntl.hpp:30] `os::cloexec` has been called, but is a no-op on
Windows
W1201 10:53:53.008270  5924 fcntl.hpp:82] `os::isNonblock` has been called, but is a stub
on Windows
W1201 10:53:53.010277  4788 fcntl.hpp:82] `os::isNonblock` has been[       OK ] HttpAuthenticationTest.Basic
(72 ms)
[----------] 6 tests from HttpAuthenticationTest (170 ms total)

[----------] 2 tests from HttpServeTest
[ RUN      ] HttpServeTest.Pipelining
F:\jenkins\jenkins-slave\workspace\Mesos-Windows\3rdparty\libprocess\src\tests\http_tests.cpp(1788):
error: (connect).failure(): Failed to connect to 0.0.0.0:57766: The requested address is not
valid in its context.


[  FAILED  ] HttpServeTest.Pipelining (5 ms)
[ RUN      ] HttpServeTest.Discard
F:\jenkins\jenkins-slave\workspace\Mesos-Windows\3rdparty\libprocess\src\tests\http_tests.cpp(1883):
error: (connect).failure(): Failed to connect to 0.0.0.0:57768: The requested address is not
valid in its context.


[  FAILED  ] HttpServeTest.Discard (4 ms)
[----------] 2 tests from HttpServeTest (9 ms total)

[----------] 5 tests from MetricsTest
[ RUN      ] MetricsTest.Counter
[       OK ] MetricsTest.Counter (6 ms)
[ RUN      ] MetricsTest.Statistics
[       OK ] MetricsTest.Statistics (2 ms)
[ RUN      ] MetricsTest.SnapshotStatistics
[       OK ] MetricsTest.SnapshotStatistics (31 ms)
[ RUN      ] MetricsTest.Timer
[       OK ] MetricsTest.Timer (1 ms)
[ RUN      ] MetricsTest.AsyncTimer
[       OK ] MetricsTest.AsyncTimer (2 ms)
[----------] 5 tests from MetricsTest (43 ms total)

[----------] 3 tests from MutexTest
[ RUN      ] MutexTest.Lock
[       OK ] MutexTest.Lock (0 ms)
[ RUN      ] MutexTest.Block
[       OK ] MutexTest.Block (0 ms)
[ RUN      ] MutexTest.Queue
[       OK ] MutexTest.Queue (0 ms)
[----------] 3 tests from MutexTest (1 ms total)

[----------] 4 tests from OwnedTest
[ RUN      ] OwnedTest.Access
[       OK ] OwnedTest.Access (1 ms)
[ RUN      ] OwnedTest.Null
[       OK ] OwnedTest.Null (0 ms)
[ RUN      ] OwnedTest.Share
[       OK ] OwnedTest.Share (0 ms)
[ RUN      ] OwnedTest.Release
[       OK ] OwnedTest.Release (0 ms)
[----------] 4 tests from OwnedTest (1 ms total)

[----------] 4 tests from ProcessTest
[ RUN      ] ProcessTest.Event
[       OK ] ProcessTest.Event (0 ms)
[ RUN      ] ProcessTest.Exited
[       OK ] ProcessTest.Exited (3 ms)
[ RUN      ] ProcessTest.InjectExited
[       OK ] ProcessTest.InjectExited (2 ms)
[ RUN      ] ProcessTest.PercentEncodedURLs
[       OK ] ProcessTest.PercentEncodedURLs (26 ms)
[----------] 4 tests from ProcessTest (31 ms total)

[----------] 3 tests from QueueTest
[ RUN      ] QueueTest.Block
[       OK ] QueueTest.Block (0 ms)
[ RUN      ] QueueTest.Noblock
[       OK ] QueueTest.Noblock (0 ms)
[ RUN      ] QueueTest.Queue
[       OK ] QueueTest.Queue (0 ms)
[----------] 3 tests from QueueTest (1 ms total)

[----------] 4 tests from SequenceTest
[ RUN      ] SequenceTest.Serialize
[       OK ] SequenceTest.Serialize (4 ms)
[ RUN      ] SequenceTest.DiscardOne
[       OK ] SequenceTest.DiscardOne (4 ms)
[ RUN      ] SequenceTest.DiscardAll
[       OK ] SequenceTest.DiscardAll (6 ms)
[ RUN      ] SequenceTest.Random
[       OK ] SequenceTest.Random (31 ms)
[----------] 4 tests from SequenceTest (46 ms total)

[----------] 4 tests from SharedTest
[ RUN      ] SharedTest.ConstAccess
[       OK ] SharedTest.ConstAccess (0 ms)
[ RUN      ] SharedTest.Null
[       OK ] SharedTest.Null (0 ms)
[ RUN      ] SharedTest.Reset
[       OK ] SharedTest.Reset (0 ms)
[ RUN      ] SharedTest.Own
[       OK ] SharedTest.Own (2 ms)
[----------] 4 tests from SharedTest (2 ms total)

[----------] 3 tests from StatisticsTest
[ RUN      ] StatisticsTest.Empty
[       OK ] StatisticsTest.Empty (0 ms)
[ RUN      ] StatisticsTest.Single
[       OK ] StatisticsTest.Single (0 ms)
[ RUN      ] StatisticsTest.Statistics
[       OK ] StatisticsTest.Statistics (1 ms)
[----------] 3 tests from StatisticsTest (1 ms total)

[----------] 3 tests from SubprocessTest
[ RUN      ] SubprocessTest.PipeOutputToFileDescriptor
[       OK ] SubprocessTest.PipeOutputToFileDescriptor (18 ms)
[ RUN      ] SubprocessTest.PipeOutputToPath
[       OK ] SubprocessTest.PipeOutputToPath (16 ms)
[ RUN      ] SubprocessTest.EnvironmentEcho
[       OK ] SubprocessTest.EnvironmentEcho (13 ms)
[----------] 3 tests from SubprocessTest (48 ms total)

[----------] 4 tests from TimeTest
[ RUN      ] TimeTest.Arithmetic
[       OK ] TimeTest.Arithmetic (0 ms)
[ RUN      ] TimeTest.RFC1123Output
[       OK ] TimeTest.RFC1123Output (0 ms)
[ RUN      ] TimeTest.RFC3339Output
[       OK ] TimeTest.RFC3339Output (0 ms)
[ RUN      ] TimeTest.Output
[       OK ] TimeTest.Output (0 ms)
[----------] 4 tests from TimeTest (1 ms total)

[----------] 3 tests from TimeSeriesTest
[ RUN      ] TimeSeriesTest.Set
[       OK ] TimeSeriesTest.Set (1 ms)
[ RUN      ] TimeSeriesTest.Sparsify
[       OK ] TimeSeriesTest.Sparsify (1 ms)
[ RUN      ] TimeSeriesTest.Truncate
[       OK ] TimeSeriesTest.Truncate (2 ms)
[----------] 3 tests from TimeSeriesTest (5 ms total)

[----------] Global test environment tear-down
[==========] 105 tests from 23 test cases ran. (829 ms total)
[  PASSED  ] 103 tests.
[  FAILED  ] 2 tests, listed below:
[  FAILED  ] HttpServeTest.Pipelining
[  FAILED  ] HttpServeTest.Discard

 2 FAILED TESTS
  YOU HAVE 44 DISABLED TESTS

 called, but is a stub on Windows
W1201 10:53:53.015276  5924 fcntl.hpp:82] `os::isNonblock` has been called, but is a stub
on Windows
W1201 10:53:53.027285  4652 fcntl.hpp:30] `os::cloexec` has been called, but is a no-op on
Windows
W1201 10:53:53.027285  5924 fcntl.hpp:30] `os::cloexec` has been called, but is a no-op on
Windows
W1201 10:53:53.028280  5924 fcntl.hpp:82] `os::isNonblock` has been called, but is a stub
on Windows
W1201 10:53:53.029280  6004 fcntl.hpp:82] `os::isNonblock` has been called, but is a stub
on Windows
W1201 10:53:53.032286  5924 fcntl.hpp:82] `os::isNonblock` has been called, but is a stub
on Windows
W1201 10:53:53.043268  4652 fcntl.hpp:30] `os::cloexec` has been called, but is a no-op on
Windows
W1201 10:53:53.043268  5924 fcntl.hpp:30] `os::cloexec` has been called, but is a no-op on
Windows
W1201 10:53:53.044271  5924 fcntl.hpp:82] `os::isNonblock` has been called, but is a stub
on Windows
W1201 10:53:53.045272  4332 fcntl.hpp:82] `os::isNonblock` has been called, but is a stub
on Windows
W1201 10:53:53.048271  5924 fcntl.hpp:82] `os::isNonblock` has been called, but is a stub
on Windows
W1201 10:53:53.062278  4652 fcntl.hpp:30] `os::cloexec` has been called, but is a no-op on
Windows
W1201 10:53:53.062278  4652 fcntl.hpp:30] `os::cloexec` has been called, but is a no-op on
Windows
W1201 10:53:53.067276  4652 fcntl.hpp:30] `os::cloexec` has been called, but is a no-op on
Windows
W1201 10:53:53.067276  4652 fcntl.hpp:30] `os::cloexec` has been called, but is a no-op on
Windows
W1201 10:53:53.081284  4652 fcntl.hpp:30] `os::cloexec` has been called, but is a no-op on
Windows
W1201 10:53:53.082285  5924 fcntl.hpp:30] `os::cloexec` has been called, but is a no-op on
Windows
W1201 10:53:53.082285  5924 fcntl.hpp:82] `os::isNonblock` has been called, but is a stub
on Windows
W1201 10:53:53.084280  2616 fcntl.hpp:82] `os::isNonblock` has been called, but is a stub
on Windows
W1201 10:53:53.087275  5924 fcntl.hpp:82] `os::isNonblock` has been called, but is a stub
on Windows
W1201 10:53:53.121289  4652 fcntl.hpp:30] `os::cloexec` has been called, but is a no-op on
Windows
W1201 10:53:53.122287  5924 fcntl.hpp:30] `os::cloexec` has been called, but is a no-op on
Windows
W1201 10:53:53.123289  5924 fcntl.hpp:82] `os::isNonblock` has been called, but is a stub
on Windows
W1201 10:53:53.124279  5088 fcntl.hpp:82] `os::isNonblock` has been called, but is a stub
on Windows
W1201 10:53:53.128273  5924 fcntl.hpp:82] `os::isNonblock` has been called, but is a stub
on Windows
W1201 10:53:53.132283  4652 fcntl.hpp:30] `os::cloexec` has been called, but is a no-op on
Windows
W1201 10:53:53.133273  5924 fcntl.hpp:30] `os::cloexec` has been called, but is a no-op on
Windows
W1201 10:53:53.133273  5924 fcntl.hpp:82] `os::isNonblock` has been called, but is a stub
on Windows
W1201 10:53:53.134284  2616 fcntl.hpp:82] `os::isNonblock` has been called, but is a stub
on Windows
W1201 10:53:53.137279  5924 fcntl.hpp:82] `os::isNonblock` has been called, but is a stub
on Windows

<https://builds.apache.org/job/Mesos-Windows/ws/build>if> 1 NEQ 0 exit /b 1 
Build step 'Execute Windows batch command' marked build as failure

Mime
View raw message