mesos-builds mailing list archives

Site index · List index
Message view « Date » · « Thread »
Top « Date » · « Thread »
From Apache Jenkins Server <jenk...@builds.apache.org>
Subject Build failed in Jenkins: Mesos » cmake,gcc,--verbose --enable-libevent --enable-ssl,GLOG_v=1 MESOS_VERBOSE=1,ubuntu:14.04,(docker||Hadoop)&&(!ubuntu-us1)&&(!ubuntu-6)&&(!ubuntu-eu2) #3078
Date Wed, 21 Dec 2016 05:12:06 GMT
See <https://builds.apache.org/job/Mesos/BUILDTOOL=cmake,COMPILER=gcc,CONFIGURATION=--verbose%20--enable-libevent%20--enable-ssl,ENVIRONMENT=GLOG_v=1%20MESOS_VERBOSE=1,OS=ubuntu%3A14.04,label_exp=(docker%7C%7CHadoop)&&(!ubuntu-us1)&&(!ubuntu-6)&&(!ubuntu-eu2)/3078/changes>

Changes:

[anand] Added some missing log statements for scheduler calls.

[anand] Fixed target version for the 1.1.0 release.

[anand] Updated releases.yml for Mesos 0.28.3.

[anand] Added blog post for the 0.28.3 release.

[mpark] Added hardening compilation flags for stout.

[mpark] Added hardening compilation flags for libprocess.

[mpark] Added hardening compilation flags for mesos.

------------------------------------------
[...truncated 175209 lines...]
I1221 05:09:25.148555 27079 http.cpp:874] Authorizing principal 'test-principal' to GET the
'/monitor/statistics' endpoint
I1221 05:09:25.149616 27074 slave.cpp:796] Agent terminating
[       OK ] Endpoint/SlaveEndpointTest.AuthorizedRequest/0 (12 ms)
[ RUN      ] Endpoint/SlaveEndpointTest.AuthorizedRequest/1
I1221 05:09:25.154644 27070 containerizer.cpp:220] Using isolation: posix/cpu,posix/mem,filesystem/posix,network/cni
W1221 05:09:25.154911 27070 backend.cpp:76] Failed to create 'aufs' backend: AufsBackend requires
root privileges, but is running as user mesos
W1221 05:09:25.154986 27070 backend.cpp:76] Failed to create 'bind' backend: BindBackend requires
root privileges
I1221 05:09:25.156000 27075 slave.cpp:209] Mesos agent started on (672)@172.17.0.2:35219
I1221 05:09:25.156023 27075 slave.cpp:210] Flags at startup: --acls="" --appc_simple_discovery_uri_prefix="http://"
--appc_store_dir="/tmp/mesos/store/appc" --authenticate_http_readonly="true" --authenticate_http_readwrite="true"
--authenticatee="crammd5" --authentication_backoff_factor="1secs" --authorizer="local" --cgroups_cpu_enable_pids_and_tids_count="false"
--cgroups_enable_cfs="false" --cgroups_hierarchy="/sys/fs/cgroup" --cgroups_limit_swap="false"
--cgroups_root="mesos" --container_disk_watch_interval="15secs" --containerizers="mesos" --credential="/tmp/Endpoint_SlaveEndpointTest_AuthorizedRequest_1_m1VuTY/credential"
--default_role="*" --disk_watch_interval="1mins" --docker="docker" --docker_kill_orphans="true"
--docker_registry="https://registry-1.docker.io" --docker_remove_delay="6hrs" --docker_socket="/var/run/docker.sock"
--docker_stop_timeout="0ns" --docker_store_dir="/tmp/mesos/store/docker" --docker_volume_checkpoint_dir="/var/run/mesos/isolators/docker/volume"
--enforce_container_disk_quota="false" --executor_registration_timeout="1mins" --executor_shutdown_grace_period="5secs"
--fetcher_cache_dir="/tmp/Endpoint_SlaveEndpointTest_AuthorizedRequest_1_m1VuTY/fetch" --fetcher_cache_size="2GB"
--frameworks_home="" --gc_delay="1weeks" --gc_disk_headroom="0.1" --hadoop_home="" --help="false"
--hostname_lookup="true" --http_authenticators="basic" --http_command_executor="false" --http_credentials="/tmp/Endpoint_SlaveEndpointTest_AuthorizedRequest_1_m1VuTY/http_credentials"
--http_heartbeat_interval="30secs" --image_provisioner_backend="copy" --initialize_driver_logging="true"
--isolation="posix/cpu,posix/mem" --launcher="posix" --launcher_dir="/mesos/build/src" --logbufsecs="0"
--logging_level="INFO" --max_completed_executors_per_framework="150" --oversubscribed_resources_interval="15secs"
--perf_duration="10secs" --perf_interval="1mins" --qos_correction_interval_min="0ns" --quiet="false"
--recover="reconnect" --recovery_timeout="15mins" --registration_backoff_factor="10ms" --resources="cpus:2;gpus:0;mem:1024;disk:1024;ports:[31000-32000]"
--revocable_cpu_low_priority="true" --runtime_dir="/tmp/Endpoint_SlaveEndpointTest_AuthorizedRequest_1_m1VuTY"
--sandbox_directory="/mnt/mesos/sandbox" --strict="true" --switch_user="true" --systemd_enable_support="true"
--systemd_runtime_directory="/run/systemd/system" --version="false" --work_dir="/tmp/Endpoint_SlaveEndpointTest_AuthorizedRequest_1_A2DMvV"
I1221 05:09:25.156402 27075 credentials.hpp:86] Loading credential for authentication from
'/tmp/Endpoint_SlaveEndpointTest_AuthorizedRequest_1_m1VuTY/credential'
I1221 05:09:25.156535 27075 slave.cpp:352] Agent using credential for: test-principal
I1221 05:09:25.156548 27075 credentials.hpp:37] Loading credentials for authentication from
'/tmp/Endpoint_SlaveEndpointTest_AuthorizedRequest_1_m1VuTY/http_credentials'
I1221 05:09:25.156677 27075 http.cpp:922] Using default 'basic' HTTP authenticator for realm
'mesos-agent-readonly'
I1221 05:09:25.156757 27075 http.cpp:922] Using default 'basic' HTTP authenticator for realm
'mesos-agent-readwrite'
I1221 05:09:25.157222 27075 slave.cpp:539] Agent resources: cpus(*):2; mem(*):1024; disk(*):1024;
ports(*):[31000-32000]
I1221 05:09:25.157256 27075 slave.cpp:547] Agent attributes: [  ]
I1221 05:09:25.157263 27075 slave.cpp:552] Agent hostname: 76df9a43f0a8
I1221 05:09:25.157660 27083 state.cpp:57] Recovering state from '/tmp/Endpoint_SlaveEndpointTest_AuthorizedRequest_1_A2DMvV/meta'
I1221 05:09:25.157816 27085 status_update_manager.cpp:203] Recovering status update manager
I1221 05:09:25.157966 27083 containerizer.cpp:599] Recovering containerizer
I1221 05:09:25.158491 27071 provisioner.cpp:253] Provisioner recovery complete
I1221 05:09:25.158715 27081 slave.cpp:5407] Finished recovery
I1221 05:09:25.159039 27081 slave.cpp:5581] Querying resource estimator for oversubscribable
resources
I1221 05:09:25.159160 27073 slave.cpp:5595] Received oversubscribable resources {} from the
resource estimator
I1221 05:09:25.159811 27074 process.cpp:3679] Handling HTTP event for process 'slave(672)'
with path: '/slave(672)/monitor/statistics.json'
I1221 05:09:25.160269 27074 http.cpp:874] Authorizing principal 'test-principal' to GET the
'/monitor/statistics.json' endpoint
I1221 05:09:25.161617 27078 slave.cpp:796] Agent terminating
[       OK ] Endpoint/SlaveEndpointTest.AuthorizedRequest/1 (11 ms)
[ RUN      ] Endpoint/SlaveEndpointTest.AuthorizedRequest/2
I1221 05:09:25.166257 27070 containerizer.cpp:220] Using isolation: posix/cpu,posix/mem,filesystem/posix,network/cni
W1221 05:09:25.166543 27070 backend.cpp:76] Failed to create 'aufs' backend: AufsBackend requires
root privileges, but is running as user mesos
W1221 05:09:25.166611 27070 backend.cpp:76] Failed to create 'bind' backend: BindBackend requires
root privileges
I1221 05:09:25.167708 27079 slave.cpp:209] Mesos agent started on (673)@172.17.0.2:35219
I1221 05:09:25.167724 27079 slave.cpp:210] Flags at startup: --acls="" --appc_simple_discovery_uri_prefix="http://"
--appc_store_dir="/tmp/mesos/store/appc" --authenticate_http_readonly="true" --authenticate_http_readwrite="true"
--authenticatee="crammd5" --authentication_backoff_factor="1secs" --authorizer="local" --cgroups_cpu_enable_pids_and_tids_count="false"
--cgroups_enable_cfs="false" --cgroups_hierarchy="/sys/fs/cgroup" --cgroups_limit_swap="false"
--cgroups_root="mesos" --container_disk_watch_interval="15secs" --containerizers="mesos" --credential="/tmp/Endpoint_SlaveEndpointTest_AuthorizedRequest_2_2HrMwc/credential"
--default_role="*" --disk_watch_interval="1mins" --docker="docker" --docker_kill_orphans="true"
--docker_registry="https://registry-1.docker.io" --docker_remove_delay="6hrs" --docker_socket="/var/run/docker.sock"
--docker_stop_timeout="0ns" --docker_store_dir="/tmp/mesos/store/docker" --docker_volume_checkpoint_dir="/var/run/mesos/isolators/docker/volume"
--enforce_container_disk_quota="false" --executor_registration_timeout="1mins" --executor_shutdown_grace_period="5secs"
--fetcher_cache_dir="/tmp/Endpoint_SlaveEndpointTest_AuthorizedRequest_2_2HrMwc/fetch" --fetcher_cache_size="2GB"
--frameworks_home="" --gc_delay="1weeks" --gc_disk_headroom="0.1" --hadoop_home="" --help="false"
--hostname_lookup="true" --http_authenticators="basic" --http_command_executor="false" --http_credentials="/tmp/Endpoint_SlaveEndpointTest_AuthorizedRequest_2_2HrMwc/http_credentials"
--http_heartbeat_interval="30secs" --image_provisioner_backend="copy" --initialize_driver_logging="true"
--isolation="posix/cpu,posix/mem" --launcher="posix" --launcher_dir="/mesos/build/src" --logbufsecs="0"
--logging_level="INFO" --max_completed_executors_per_framework="150" --oversubscribed_resources_interval="15secs"
--perf_duration="10secs" --perf_interval="1mins" --qos_correction_interval_min="0ns" --quiet="false"
--recover="reconnect" --recovery_timeout="15mins" --registration_backoff_factor="10ms" --resources="cpus:2;gpus:0;mem:1024;disk:1024;ports:[31000-32000]"
--revocable_cpu_low_priority="true" --runtime_dir="/tmp/Endpoint_SlaveEndpointTest_AuthorizedRequest_2_2HrMwc"
--sandbox_directory="/mnt/mesos/sandbox" --strict="true" --switch_user="true" --systemd_enable_support="true"
--systemd_runtime_directory="/run/systemd/system" --version="false" --work_dir="/tmp/Endpoint_SlaveEndpointTest_AuthorizedRequest_2_uPua78"
I1221 05:09:25.168157 27079 credentials.hpp:86] Loading credential for authentication from
'/tmp/Endpoint_SlaveEndpointTest_AuthorizedRequest_2_2HrMwc/credential'
I1221 05:09:25.168267 27079 slave.cpp:352] Agent using credential for: test-principal
I1221 05:09:25.168282 27079 credentials.hpp:37] Loading credentials for authentication from
'/tmp/Endpoint_SlaveEndpointTest_AuthorizedRequest_2_2HrMwc/http_credentials'
I1221 05:09:25.168378 27079 http.cpp:922] Using default 'basic' HTTP authenticator for realm
'mesos-agent-readonly'
I1221 05:09:25.168416 27079 http.cpp:922] Using default 'basic' HTTP authenticator for realm
'mesos-agent-readwrite'
I1221 05:09:25.168683 27079 slave.cpp:539] Agent resources: cpus(*):2; mem(*):1024; disk(*):1024;
ports(*):[31000-32000]
I1221 05:09:25.168712 27079 slave.cpp:547] Agent attributes: [  ]
I1221 05:09:25.168717 27079 slave.cpp:552] Agent hostname: 76df9a43f0a8
I1221 05:09:25.169059 27085 state.cpp:57] Recovering state from '/tmp/Endpoint_SlaveEndpointTest_AuthorizedRequest_2_uPua78/meta'
I1221 05:09:25.169185 27076 status_update_manager.cpp:203] Recovering status update manager
I1221 05:09:25.169303 27080 containerizer.cpp:599] Recovering containerizer
I1221 05:09:25.169805 27081 provisioner.cpp:253] Provisioner recovery complete
I1221 05:09:25.169946 27084 slave.cpp:5407] Finished recovery
I1221 05:09:25.170388 27084 slave.cpp:5581] Querying resource estimator for oversubscribable
resources
I1221 05:09:25.170500 27079 slave.cpp:5595] Received oversubscribable resources {} from the
resource estimator
I1221 05:09:25.171135 27073 process.cpp:3679] Handling HTTP event for process 'slave(673)'
with path: '/slave(673)/containers'
I1221 05:09:25.171591 27076 http.cpp:874] Authorizing principal 'test-principal' to GET the
'/containers' endpoint
I1221 05:09:25.172947 27076 slave.cpp:796] Agent terminating
[       OK ] Endpoint/SlaveEndpointTest.AuthorizedRequest/2 (11 ms)
[ RUN      ] Endpoint/SlaveEndpointTest.UnauthorizedRequest/0
I1221 05:09:25.177454 27070 containerizer.cpp:220] Using isolation: posix/cpu,posix/mem,filesystem/posix,network/cni
W1221 05:09:25.177731 27070 backend.cpp:76] Failed to create 'aufs' backend: AufsBackend requires
root privileges, but is running as user mesos
W1221 05:09:25.177796 27070 backend.cpp:76] Failed to create 'bind' backend: BindBackend requires
root privileges
I1221 05:09:25.178835 27073 slave.cpp:209] Mesos agent started on (674)@172.17.0.2:35219
I1221 05:09:25.178856 27073 slave.cpp:210] Flags at startup: --acls="" --appc_simple_discovery_uri_prefix="http://"
--appc_store_dir="/tmp/mesos/store/appc" --authenticate_http_readonly="true" --authenticate_http_readwrite="true"
--authenticatee="crammd5" --authentication_backoff_factor="1secs" --authorizer="local" --cgroups_cpu_enable_pids_and_tids_count="false"
--cgroups_enable_cfs="false" --cgroups_hierarchy="/sys/fs/cgroup" --cgroups_limit_swap="false"
--cgroups_root="mesos" --container_disk_watch_interval="15secs" --containerizers="mesos" --credential="/tmp/Endpoint_SlaveEndpointTest_UnauthorizedRequest_0_yUNohq/credential"
--default_role="*" --disk_watch_interval="1mins" --docker="docker" --docker_kill_orphans="true"
--docker_registry="https://registry-1.docker.io" --docker_remove_delay="6hrs" --docker_socket="/var/run/docker.sock"
--docker_stop_timeout="0ns" --docker_store_dir="/tmp/mesos/store/docker" --docker_volume_checkpoint_dir="/var/run/mesos/isolators/docker/volume"
--enforce_container_disk_quota="false" --executor_registration_timeout="1mins" --executor_shutdown_grace_period="5secs"
--fetcher_cache_dir="/tmp/Endpoint_SlaveEndpointTest_UnauthorizedRequest_0_yUNohq/fetch" --fetcher_cache_size="2GB"
--frameworks_home="" --gc_delay="1weeks" --gc_disk_headroom="0.1" --hadoop_home="" --help="false"
--hostname_lookup="true" --http_authenticators="basic" --http_command_executor="false" --http_credentials="/tmp/Endpoint_SlaveEndpointTest_UnauthorizedRequest_0_yUNohq/http_credentials"
--http_heartbeat_interval="30secs" --image_provisioner_backend="copy" --initialize_driver_logging="true"
--isolation="posix/cpu,posix/mem" --launcher="posix" --launcher_dir="/mesos/build/src" --logbufsecs="0"
--logging_level="INFO" --max_completed_executors_per_framework="150" --oversubscribed_resources_interval="15secs"
--perf_duration="10secs" --perf_interval="1mins" --qos_correction_interval_min="0ns" --quiet="false"
--recover="reconnect" --recovery_timeout="15mins" --registration_backoff_factor="10ms" --resources="cpus:2;gpus:0;mem:1024;disk:1024;ports:[31000-32000]"
--revocable_cpu_low_priority="true" --runtime_dir="/tmp/Endpoint_SlaveEndpointTest_UnauthorizedRequest_0_yUNohq"
--sandbox_directory="/mnt/mesos/sandbox" --strict="true" --switch_user="true" --systemd_enable_support="true"
--systemd_runtime_directory="/run/systemd/system" --version="false" --work_dir="/tmp/Endpoint_SlaveEndpointTest_UnauthorizedRequest_0_4tvXPm"
I1221 05:09:25.179313 27073 credentials.hpp:86] Loading credential for authentication from
'/tmp/Endpoint_SlaveEndpointTest_UnauthorizedRequest_0_yUNohq/credential'
I1221 05:09:25.179410 27073 slave.cpp:352] Agent using credential for: test-principal
I1221 05:09:25.179425 27073 credentials.hpp:37] Loading credentials for authentication from
'/tmp/Endpoint_SlaveEndpointTest_UnauthorizedRequest_0_yUNohq/http_credentials'
I1221 05:09:25.179554 27073 http.cpp:922] Using default 'basic' HTTP authenticator for realm
'mesos-agent-readonly'
I1221 05:09:25.179603 27073 http.cpp:922] Using default 'basic' HTTP authenticator for realm
'mesos-agent-readwrite'
I1221 05:09:25.180027 27073 slave.cpp:539] Agent resources: cpus(*):2; mem(*):1024; disk(*):1024;
ports(*):[31000-32000]
I1221 05:09:25.180068 27073 slave.cpp:547] Agent attributes: [  ]
I1221 05:09:25.180078 27073 slave.cpp:552] Agent hostname: 76df9a43f0a8
I1221 05:09:25.180610 27085 state.cpp:57] Recovering state from '/tmp/Endpoint_SlaveEndpointTest_UnauthorizedRequest_0_4tvXPm/meta'
I1221 05:09:25.180773 27072 status_update_manager.cpp:203] Recovering status update manager
I1221 05:09:25.180923 27076 containerizer.cpp:599] Recovering containerizer
I1221 05:09:25.181576 27082 provisioner.cpp:253] Provisioner recovery complete
I1221 05:09:25.181809 27086 slave.cpp:5407] Finished recovery
I1221 05:09:25.182250 27086 slave.cpp:5581] Querying resource estimator for oversubscribable
resources
I1221 05:09:25.182400 27082 slave.cpp:5595] Received oversubscribable resources {} from the
resource estimator
I1221 05:09:25.183027 27082 process.cpp:3679] Handling HTTP event for process 'slave(674)'
with path: '/slave(674)/monitor/statistics'
I1221 05:09:25.183538 27079 http.cpp:874] Authorizing principal 'test-principal' to GET the
'/monitor/statistics' endpoint
I1221 05:09:25.184826 27083 slave.cpp:796] Agent terminating
[       OK ] Endpoint/SlaveEndpointTest.UnauthorizedRequest/0 (12 ms)
[ RUN      ] Endpoint/SlaveEndpointTest.UnauthorizedRequest/1
I1221 05:09:25.189571 27070 containerizer.cpp:220] Using isolation: posix/cpu,posix/mem,filesystem/posix,network/cni
W1221 05:09:25.189847 27070 backend.cpp:76] Failed to create 'aufs' backend: AufsBackend requires
root privileges, but is running as user mesos
W1221 05:09:25.189926 27070 backend.cpp:76] Failed to create 'bind' backend: BindBackend requires
root privileges
I1221 05:09:25.190897 27076 slave.cpp:209] Mesos agent started on (675)@172.17.0.2:35219
I1221 05:09:25.190943 27076 slave.cpp:210] Flags at startup: --acls="" --appc_simple_discovery_uri_prefix="http://"
--appc_store_dir="/tmp/mesos/store/appc" --authenticate_http_readonly="true" --authenticate_http_readwrite="true"
--authenticatee="crammd5" --authentication_backoff_factor="1secs" --authorizer="local" --cgroups_cpu_enable_pids_and_tids_count="false"
--cgroups_enable_cfs="false" --cgroups_hierarchy="/sys/fs/cgroup" --cgroups_limit_swap="false"
--cgroups_root="mesos" --container_disk_watch_interval="15secs" --containerizers="mesos" --credential="/tmp/Endpoint_SlaveEndpointTest_UnauthorizedRequest_1_CbgQ9D/credential"
--default_role="*" --disk_watch_interval="1mins" --docker="docker" --docker_kill_orphans="true"
--docker_registry="https://registry-1.docker.io" --docker_remove_delay="6hrs" --docker_socket="/var/run/docker.sock"
--docker_stop_timeout="0ns" --docker_store_dir="/tmp/mesos/store/docker" --docker_volume_checkpoint_dir="/var/run/mesos/isolators/docker/volume"
--enforce_container_disk_quota="false" --executor_registration_timeout="1mins" --executor_shutdown_grace_period="5secs"
--fetcher_cache_dir="/tmp/Endpoint_SlaveEndpointTest_UnauthorizedRequest_1_CbgQ9D/fetch" --fetcher_cache_size="2GB"
--frameworks_home="" --gc_delay="1weeks" --gc_disk_headroom="0.1" --hadoop_home="" --help="false"
--hostname_lookup="true" --http_authenticators="basic" --http_command_executor="false" --http_credentials="/tmp/Endpoint_SlaveEndpointTest_UnauthorizedRequest_1_CbgQ9D/http_credentials"
--http_heartbeat_interval="30secs" --image_provisioner_backend="copy" --initialize_driver_logging="true"
--isolation="posix/cpu,posix/mem" --launcher="posix" --launcher_dir="/mesos/build/src" --logbufsecs="0"
--logging_level="INFO" --max_completed_executors_per_framework="150" --oversubscribed_resources_interval="15secs"
--perf_duration="10secs" --perf_interval="1mins" --qos_correction_interval_min="0ns" --quiet="false"
--recover="reconnect" --recovery_timeout="15mins" --registration_backoff_factor="10ms" --resources="cpus:2;gpus:0;mem:1024;disk:1024;ports:[31000-32000]"
--revocable_cpu_low_priority="true" --runtime_dir="/tmp/Endpoint_SlaveEndpointTest_UnauthorizedRequest_1_CbgQ9D"
--sandbox_directory="/mnt/mesos/sandbox" --strict="true" --switch_user="true" --systemd_enable_support="true"
--systemd_runtime_directory="/run/systemd/system" --version="false" --work_dir="/tmp/Endpoint_SlaveEndpointTest_UnauthorizedRequest_1_C7LqGA"
I1221 05:09:25.191262 27076 credentials.hpp:86] Loading credential for authentication from
'/tmp/Endpoint_SlaveEndpointTest_UnauthorizedRequest_1_CbgQ9D/credential'
I1221 05:09:25.191355 27076 slave.cpp:352] Agent using credential for: test-principal
I1221 05:09:25.191373 27076 credentials.hpp:37] Loading credentials for authentication from
'/tmp/Endpoint_SlaveEndpointTest_UnauthorizedRequest_1_CbgQ9D/http_credentials'
I1221 05:09:25.191484 27076 http.cpp:922] Using default 'basic' HTTP authenticator for realm
'mesos-agent-readonly'
I1221 05:09:25.191539 27076 http.cpp:922] Using default 'basic' HTTP authenticator for realm
'mesos-agent-readwrite'
I1221 05:09:25.191901 27076 slave.cpp:539] Agent resources: cpus(*):2; mem(*):1024; disk(*):1024;
ports(*):[31000-32000]
I1221 05:09:25.191936 27076 slave.cpp:547] Agent attributes: [  ]
I1221 05:09:25.191942 27076 slave.cpp:552] Agent hostname: 76df9a43f0a8
I1221 05:09:25.192358 27074 state.cpp:57] Recovering state from '/tmp/Endpoint_SlaveEndpointTest_UnauthorizedRequest_1_C7LqGA/meta'
I1221 05:09:25.192580 27084 status_update_manager.cpp:203] Recovering status update manager
I1221 05:09:25.192718 27075 containerizer.cpp:599] Recovering containerizer
I1221 05:09:25.193423 27071 provisioner.cpp:253] Provisioner recovery complete
I1221 05:09:25.193684 27085 slave.cpp:5407] Finished recovery
I1221 05:09:25.194082 27085 slave.cpp:5581] Querying resource estimator for oversubscribable
resources
I1221 05:09:25.194407 27073 slave.cpp:5595] Received oversubscribable resources {} from the
resource estimator
I1221 05:09:25.195034 27071 process.cpp:3679] Handling HTTP event for process 'slave(675)'
with path: '/slave(675)/monitor/statistics.json'
I1221 05:09:25.195543 27077 http.cpp:874] Authorizing principal 'test-principal' to GET the
'/monitor/statistics.json' endpoint
I1221 05:09:25.196594 27077 slave.cpp:796] Agent terminating
[       OK ] Endpoint/SlaveEndpointTest.UnauthorizedRequest/1 (12 ms)
[ RUN      ] Endpoint/SlaveEndpointTest.UnauthorizedRequest/2
I1221 05:09:25.201287 27070 containerizer.cpp:220] Using isolation: posix/cpu,posix/mem,filesystem/posix,network/cni
W1221 05:09:25.201561 27070 backend.cpp:76] Failed to create 'aufs' backend: AufsBackend requires
root privileges, but is running as user mesos
W1221 05:09:25.201632 27070 backend.cpp:76] Failed to create 'bind' backend: BindBackend requires
root privileges
I1221 05:09:25.202558 27085 slave.cpp:209] Mesos agent started on (676)@172.17.0.2:35219
I1221 05:09:25.202575 27085 slave.cpp:210] Flags at startup: --acls="" --appc_simple_discovery_uri_prefix="http://"
--appc_store_dir="/tmp/mesos/store/appc" --authenticate_http_readonly="true" --authenticate_http_readwrite="true"
--authenticatee="crammd5" --authentication_backoff_factor="1secs" --authorizer="local" --cgroups_cpu_enable_pids_and_tids_count="false"
--cgroups_enable_cfs="false" --cgroups_hierarchy="/sys/fs/cgroup" --cgroups_limit_swap="false"
--cgroups_root="mesos" --container_disk_watch_interval="15secs" --containerizers="mesos" --credential="/tmp/Endpoint_SlaveEndpointTest_UnauthorizedRequest_2_cRTV9R/credential"
--default_role="*" --disk_watch_interval="1mins" --docker="docker" --docker_kill_orphans="true"
--docker_registry="https://registry-1.docker.io" --docker_remove_delay="6hrs" --docker_socket="/var/run/docker.sock"
--docker_stop_timeout="0ns" --docker_store_dir="/tmp/mesos/store/docker" --docker_volume_checkpoint_dir="/var/run/mesos/isolators/docker/volume"
--enforce_container_disk_quota="false" --executor_registration_timeout="1mins" --executor_shutdown_grace_period="5secs"
--fetcher_cache_dir="/tmp/Endpoint_SlaveEndpointTest_UnauthorizedRequest_2_cRTV9R/fetch" --fetcher_cache_size="2GB"
--frameworks_home="" --gc_delay="1weeks" --gc_disk_headroom="0.1" --hadoop_home="" --help="false"
--hostname_lookup="true" --http_authenticators="basic" --http_command_executor="false" --http_credentials="/tmp/Endpoint_SlaveEndpointTest_UnauthorizedRequest_2_cRTV9R/http_credentials"
--http_heartbeat_interval="30secs" --image_provisioner_backend="copy" --initialize_driver_logging="true"
--isolation="posix/cpu,posix/mem" --launcher="posix" --launcher_dir="/mesos/build/src" --logbufsecs="0"
--logging_level="INFO" --max_completed_executors_per_framework="150" --oversubscribed_resources_interval="15secs"
--perf_duration="10secs" --perf_interval="1mins" --qos_correction_interval_min="0ns" --quiet="false"
--recover="reconnect" --recovery_timeout="15mins" --registration_backoff_factor="10ms" --resources="cpus:2;gpus:0;mem:1024;disk:1024;ports:[31000-32000]"
--revocable_cpu_low_priority="true" --runtime_dir="/tmp/Endpoint_SlaveEndpointTest_UnauthorizedRequest_2_cRTV9R"
--sandbox_directory="/mnt/mesos/sandbox" --strict="true" --switch_user="true" --systemd_enable_support="true"
--systemd_runtime_directory="/run/systemd/system" --version="false" --work_dir="/tmp/Endpoint_SlaveEndpointTest_UnauthorizedRequest_2_U6lCEO"
I1221 05:09:25.202975 27085 credentials.hpp:86] Loading credential for authentication from
'/tmp/Endpoint_SlaveEndpointTest_UnauthorizedRequest_2_cRTV9R/credential'
I1221 05:09:25.203074 27085 slave.cpp:352] Agent using credential for: test-principal
I1221 05:09:25.203089 27085 credentials.hpp:37] Loading credentials for authentication from
'/tmp/Endpoint_SlaveEndpointTest_UnauthorizedRequest_2_cRTV9R/http_credentials'
I1221 05:09:25.203200 27085 http.cpp:922] Using default 'basic' HTTP authenticator for realm
'mesos-agent-readonly'
I1221 05:09:25.203251 27085 http.cpp:922] Using default 'basic' HTTP authenticator for realm
'mesos-agent-readwrite'
I1221 05:09:25.203739 27085 slave.cpp:539] Agent resources: cpus(*):2; mem(*):1024; disk(*):1024;
ports(*):[31000-32000]
I1221 05:09:25.203781 27085 slave.cpp:547] Agent attributes: [  ]
I1221 05:09:25.203791 27085 slave.cpp:552] Agent hostname: 76df9a43f0a8
I1221 05:09:25.204167 27071 state.cpp:57] Recovering state from '/tmp/Endpoint_SlaveEndpointTest_UnauthorizedRequest_2_U6lCEO/meta'
I1221 05:09:25.204439 27078 status_update_manager.cpp:203] Recovering status update manager
I1221 05:09:25.204629 27080 containerizer.cpp:599] Recovering containerizer
I1221 05:09:25.205314 27082 provisioner.cpp:253] Provisioner recovery complete
I1221 05:09:25.205534 27083 slave.cpp:5407] Finished recovery
I1221 05:09:25.205953 27083 slave.cpp:5581] Querying resource estimator for oversubscribable
resources
I1221 05:09:25.206146 27076 slave.cpp:5595] Received oversubscribable resources {} from the
resource estimator
I1221 05:09:25.207741 27078 process.cpp:3679] Handling HTTP event for process 'slave(676)'
with path: '/slave(676)/containers'
I1221 05:09:25.208343 27084 http.cpp:874] Authorizing principal 'test-principal' to GET the
'/containers' endpoint
I1221 05:09:25.209547 27070 slave.cpp:796] Agent terminating
[       OK ] Endpoint/SlaveEndpointTest.UnauthorizedRequest/2 (13 ms)
[ RUN      ] Endpoint/SlaveEndpointTest.NoAuthorizer/0
I1221 05:09:25.215463 27070 containerizer.cpp:220] Using isolation: posix/cpu,posix/mem,filesystem/posix,network/cni
W1221 05:09:25.215883 27070 backend.cpp:76] Failed to create 'aufs' backend: AufsBackend requires
root privileges, but is running as user mesos
W1221 05:09:25.215977 27070 backend.cpp:76] Failed to create 'bind' backend: BindBackend requires
root privileges
I1221 05:09:25.216795 27070 cluster.cpp:446] Creating default 'local' authorizer
I1221 05:09:25.217375 27085 slave.cpp:209] Mesos agent started on (677)@172.17.0.2:35219
I1221 05:09:25.217396 27085 slave.cpp:210] Flags at startup: --acls="" --appc_simple_discovery_uri_prefix="http://"
--appc_store_dir="/tmp/mesos/store/appc" --authenticate_http_readonly="true" --authenticate_http_readwrite="true"
--authenticatee="crammd5" --authentication_backoff_factor="1secs" --authorizer="local" --cgroups_cpu_enable_pids_and_tids_count="false"
--cgroups_enable_cfs="false" --cgroups_hierarchy="/sys/fs/cgroup" --cgroups_limit_swap="false"
--cgroups_root="mesos" --container_disk_watch_interval="15secs" --containerizers="mesos" --credential="/tmp/Endpoint_SlaveEndpointTest_NoAuthorizer_0_omzsi6/credential"
--default_role="*" --disk_watch_interval="1mins" --docker="docker" --docker_kill_orphans="true"
--docker_registry="https://registry-1.docker.io" --docker_remove_delay="6hrs" --docker_socket="/var/run/docker.sock"
--docker_stop_timeout="0ns" --docker_store_dir="/tmp/mesos/store/docker" --docker_volume_checkpoint_dir="/var/run/mesos/isolators/docker/volume"
--enforce_container_disk_quota="false" --executor_registration_timeout="1mins" --executor_shutdown_grace_period="5secs"
--fetcher_cache_dir="/tmp/Endpoint_SlaveEndpointTest_NoAuthorizer_0_omzsi6/fetch" --fetcher_cache_size="2GB"
--frameworks_home="" --gc_delay="1weeks" --gc_disk_headroom="0.1" --hadoop_home="" --help="false"
--hostname_lookup="true" --http_authenticators="basic" --http_command_executor="false" --http_credentials="/tmp/Endpoint_SlaveEndpointTest_NoAuthorizer_0_omzsi6/http_credentials"
--http_heartbeat_interval="30secs" --image_provisioner_backend="copy" --initialize_driver_logging="true"
--isolation="posix/cpu,posix/mem" --launcher="posix" --launcher_dir="/mesos/build/src" --logbufsecs="0"
--logging_level="INFO" --max_completed_executors_per_framework="150" --oversubscribed_resources_interval="15secs"
--perf_duration="10secs" --perf_interval="1mins" --qos_correction_interval_min="0ns" --quiet="false"
--recover="reconnect" --recovery_timeout="15mins" --registration_backoff_factor="10ms" --resources="cpus:2;gpus:0;mem:1024;disk:1024;ports:[31000-32000]"
--revocable_cpu_low_priority="true" --runtime_dir="/tmp/Endpoint_SlaveEndpointTest_NoAuthorizer_0_omzsi6"
--sandbox_directory="/mnt/mesos/sandbox" --strict="true" --switch_user="true" --systemd_enable_support="true"
--systemd_runtime_directory="/run/systemd/system" --version="false" --work_dir="/tmp/Endpoint_SlaveEndpointTest_NoAuthorizer_0_0CxXK2"
I1221 05:09:25.217763 27085 credentials.hpp:86] Loading credential for authentication from
'/tmp/Endpoint_SlaveEndpointTest_NoAuthorizer_0_omzsi6/credential'
I1221 05:09:25.217854 27085 slave.cpp:352] Agent using credential for: test-principal
I1221 05:09:25.217870 27085 credentials.hpp:37] Loading credentials for authentication from
'/tmp/Endpoint_SlaveEndpointTest_NoAuthorizer_0_omzsi6/http_credentials'
I1221 05:09:25.217979 27085 http.cpp:922] Using default 'basic' HTTP authenticator for realm
'mesos-agent-readonly'
I1221 05:09:25.218034 27085 http.cpp:922] Using default 'basic' HTTP authenticator for realm
'mesos-agent-readwrite'
I1221 05:09:25.218624 27085 slave.cpp:539] Agent resources: cpus(*):2; mem(*):1024; disk(*):1024;
ports(*):[31000-32000]
I1221 05:09:25.218668 27085 slave.cpp:547] Agent attributes: [  ]
I1221 05:09:25.218678 27085 slave.cpp:552] Agent hostname: 76df9a43f0a8
I1221 05:09:25.219149 27075 state.cpp:57] Recovering state from '/tmp/Endpoint_SlaveEndpointTest_NoAuthorizer_0_0CxXK2/meta'
I1221 05:09:25.219388 27074 status_update_manager.cpp:203] Recovering status update manager
I1221 05:09:25.219585 27081 containerizer.cpp:599] Recovering containerizer
I1221 05:09:25.220273 27075 provisioner.cpp:253] Provisioner recovery complete
I1221 05:09:25.220484 27085 slave.cpp:5407] Finished recovery
I1221 05:09:25.220890 27085 slave.cpp:5581] Querying resource estimator for oversubscribable
resources
I1221 05:09:25.221057 27078 slave.cpp:5595] Received oversubscribable resources {} from the
resource estimator
I1221 05:09:25.221716 27084 process.cpp:3679] Handling HTTP event for process 'slave(677)'
with path: '/slave(677)/monitor/statistics'
I1221 05:09:25.222162 27080 http.cpp:874] Authorizing principal 'test-principal' to GET the
'/monitor/statistics' endpoint
I1221 05:09:25.223940 27078 slave.cpp:796] Agent terminating
[       OK ] Endpoint/SlaveEndpointTest.NoAuthorizer/0 (14 ms)
[ RUN      ] Endpoint/SlaveEndpointTest.NoAuthorizer/1
I1221 05:09:25.229892 27070 containerizer.cpp:220] Using isolation: posix/cpu,posix/mem,filesystem/posix,network/cni
W1221 05:09:25.230304 27070 backend.cpp:76] Failed to create 'aufs' backend: AufsBackend requires
root privileges, but is running as user mesos
W1221 05:09:25.230396 27070 backend.cpp:76] Failed to create 'bind' backend: BindBackend requires
root privileges
I1221 05:09:25.231081 27070 cluster.cpp:446] Creating default 'local' authorizer
I1221 05:09:25.231689 27079 slave.cpp:209] Mesos agent started on (678)@172.17.0.2:35219
I1221 05:09:25.231719 27079 slave.cpp:210] Flags at startup: --acls="" --appc_simple_discovery_uri_prefix="http://"
--appc_store_dir="/tmp/mesos/store/appc" --authenticate_http_readonly="true" --authenticate_http_readwrite="true"
--authenticatee="crammd5" --authentication_backoff_factor="1secs" --authorizer="local" --cgroups_cpu_enable_pids_and_tids_count="false"
--cgroups_enable_cfs="false" --cgroups_hierarchy="/sys/fs/cgroup" --cgroups_limit_swap="false"
--cgroups_root="mesos" --container_disk_watch_interval="15secs" --containerizers="mesos" --credential="/tmp/Endpoint_SlaveEndpointTest_NoAuthorizer_1_cyVmAk/credential"
--default_role="*" --disk_watch_interval="1mins" --docker="docker" --docker_kill_orphans="true"
--docker_registry="https://registry-1.docker.io" --docker_remove_delay="6hrs" --docker_socket="/var/run/docker.sock"
--docker_stop_timeout="0ns" --docker_store_dir="/tmp/mesos/store/docker" --docker_volume_checkpoint_dir="/var/run/mesos/isolators/docker/volume"
--enforce_container_disk_quota="false" --executor_registration_timeout="1mins" --executor_shutdown_grace_period="5secs"
--fetcher_cache_dir="/tmp/Endpoint_SlaveEndpointTest_NoAuthorizer_1_cyVmAk/fetch" --fetcher_cache_size="2GB"
--frameworks_home="" --gc_delay="1weeks" --gc_disk_headroom="0.1" --hadoop_home="" --help="false"
--hostname_lookup="true" --http_authenticators="basic" --http_command_executor="false" --http_credentials="/tmp/Endpoint_SlaveEndpointTest_NoAuthorizer_1_cyVmAk/http_credentials"
--http_heartbeat_interval="30secs" --image_provisioner_backend="copy" --initialize_driver_logging="true"
--isolation="posix/cpu,posix/mem" --launcher="posix" --launcher_dir="/mesos/build/src" --logbufsecs="0"
--logging_level="INFO" --max_completed_executors_per_framework="150" --oversubscribed_resources_interval="15secs"
--perf_duration="10secs" --perf_interval="1mins" --qos_correction_interval_min="0ns" --quiet="false"
--recover="reconnect" --recovery_timeout="15mins" --registration_backoff_factor="10ms" --resources="cpus:2;gpus:0;mem:1024;disk:1024;ports:[31000-32000]"
--revocable_cpu_low_priority="true" --runtime_dir="/tmp/Endpoint_SlaveEndpointTest_NoAuthorizer_1_cyVmAk"
--sandbox_directory="/mnt/mesos/sandbox" --strict="true" --switch_user="true" --systemd_enable_support="true"
--systemd_runtime_directory="/run/systemd/system" --version="false" --work_dir="/tmp/Endpoint_SlaveEndpointTest_NoAuthorizer_1_GZOx0g"
I1221 05:09:25.232085 27079 credentials.hpp:86] Loading credential for authentication from
'/tmp/Endpoint_SlaveEndpointTest_NoAuthorizer_1_cyVmAk/credential'
I1221 05:09:25.232231 27079 slave.cpp:352] Agent using credential for: test-principal
I1221 05:09:25.232242 27079 credentials.hpp:37] Loading credentials for authentication from
'/tmp/Endpoint_SlaveEndpointTest_NoAuthorizer_1_cyVmAk/http_credentials'
I1221 05:09:25.232336 27079 http.cpp:922] Using default 'basic' HTTP authenticator for realm
'mesos-agent-readonly'
I1221 05:09:25.232398 27079 http.cpp:922] Using default 'basic' HTTP authenticator for realm
'mesos-agent-readwrite'
I1221 05:09:25.232787 27079 slave.cpp:539] Agent resources: cpus(*):2; mem(*):1024; disk(*):1024;
ports(*):[31000-32000]
I1221 05:09:25.232821 27079 slave.cpp:547] Agent attributes: [  ]
I1221 05:09:25.232827 27079 slave.cpp:552] Agent hostname: 76df9a43f0a8
I1221 05:09:25.233208 27075 state.cpp:57] Recovering state from '/tmp/Endpoint_SlaveEndpointTest_NoAuthorizer_1_GZOx0g/meta'
I1221 05:09:25.233347 27084 status_update_manager.cpp:203] Recovering status update manager
I1221 05:09:25.233491 27083 containerizer.cpp:599] Recovering containerizer
I1221 05:09:25.234135 27080 provisioner.cpp:253] Provisioner recovery complete
I1221 05:09:25.234354 27076 slave.cpp:5407] Finished recovery
I1221 05:09:25.234807 27076 slave.cpp:5581] Querying resource estimator for oversubscribable
resources
I1221 05:09:25.234923 27086 slave.cpp:5595] Received oversubscribable resources {} from the
resource estimator
I1221 05:09:25.235642 27082 process.cpp:3679] Handling HTTP event for process 'slave(678)'
with path: '/slave(678)/monitor/statistics.json'
I1221 05:09:25.236048 27071 http.cpp:874] Authorizing principal 'test-principal' to GET the
'/monitor/statistics.json' endpoint
I1221 05:09:25.237603 27084 slave.cpp:796] Agent terminating
[       OK ] Endpoint/SlaveEndpointTest.NoAuthorizer/1 (13 ms)
[ RUN      ] Endpoint/SlaveEndpointTest.NoAuthorizer/2
I1221 05:09:25.243567 27070 containerizer.cpp:220] Using isolation: posix/cpu,posix/mem,filesystem/posix,network/cni
W1221 05:09:25.243940 27070 backend.cpp:76] Failed to create 'aufs' backend: AufsBackend requires
root privileges, but is running as user mesos
W1221 05:09:25.244045 27070 backend.cpp:76] Failed to create 'bind' backend: BindBackend requires
root privileges
I1221 05:09:25.245168 27070 cluster.cpp:446] Creating default 'local' authorizer
I1221 05:09:25.245669 27074 slave.cpp:209] Mesos agent started on (679)@172.17.0.2:35219
I1221 05:09:25.245692 27074 slave.cpp:210] Flags at startup: --acls="" --appc_simple_discovery_uri_prefix="http://"
--appc_store_dir="/tmp/mesos/store/appc" --authenticate_http_readonly="true" --authenticate_http_readwrite="true"
--authenticatee="crammd5" --authentication_backoff_factor="1secs" --authorizer="local" --cgroups_cpu_enable_pids_and_tids_count="false"
--cgroups_enable_cfs="false" --cgroups_hierarchy="/sys/fs/cgroup" --cgroups_limit_swap="false"
--cgroups_root="mesos" --container_disk_watch_interval="15secs" --containerizers="mesos" --credential="/tmp/Endpoint_SlaveEndpointTest_NoAuthorizer_2_6pJn1y/credential"
--default_role="*" --disk_watch_interval="1mins" --docker="docker" --docker_kill_orphans="true"
--docker_registry="https://registry-1.docker.io" --docker_remove_delay="6hrs" --docker_socket="/var/run/docker.sock"
--docker_stop_timeout="0ns" --docker_store_dir="/tmp/mesos/store/docker" --docker_volume_checkpoint_dir="/var/run/mesos/isolators/docker/volume"
--enforce_container_disk_quota="false" --executor_registration_timeout="1mins" --executor_shutdown_grace_period="5secs"
--fetcher_cache_dir="/tmp/Endpoint_SlaveEndpointTest_NoAuthorizer_2_6pJn1y/fetch" --fetcher_cache_size="2GB"
--frameworks_home="" --gc_delay="1weeks" --gc_disk_headroom="0.1" --hadoop_home="" --help="false"
--hostname_lookup="true" --http_authenticators="basic" --http_command_executor="false" --http_credentials="/tmp/Endpoint_SlaveEndpointTest_NoAuthorizer_2_6pJn1y/http_credentials"
--http_heartbeat_interval="30secs" --image_provisioner_backend="copy" --initialize_driver_logging="true"
--isolation="posix/cpu,posix/mem" --launcher="posix" --launcher_dir="/mesos/build/src" --logbufsecs="0"
--logging_level="INFO" --max_completed_executors_per_framework="150" --oversubscribed_resources_interval="15secs"
--perf_duration="10secs" --perf_interval="1mins" --qos_correction_interval_min="0ns" --quiet="false"
--recover="reconnect" --recovery_timeout="15mins" --registration_backoff_factor="10ms" --resources="cpus:2;gpus:0;mem:1024;disk:1024;ports:[31000-32000]"
--revocable_cpu_low_priority="true" --runtime_dir="/tmp/Endpoint_SlaveEndpointTest_NoAuthorizer_2_6pJn1y"
--sandbox_directory="/mnt/mesos/sandbox" --strict="true" --switch_user="true" --systemd_enable_support="true"
--systemd_runtime_directory="/run/systemd/system" --version="false" --work_dir="/tmp/Endpoint_SlaveEndpointTest_NoAuthorizer_2_IyJhpv"
I1221 05:09:25.246104 27074 credentials.hpp:86] Loading credential for authentication from
'/tmp/Endpoint_SlaveEndpointTest_NoAuthorizer_2_6pJn1y/credential'
I1221 05:09:25.246217 27074 slave.cpp:352] Agent using credential for: test-principal
I1221 05:09:25.246232 27074 credentials.hpp:37] Loading credentials for authentication from
'/tmp/Endpoint_SlaveEndpointTest_NoAuthorizer_2_6pJn1y/http_credentials'
I1221 05:09:25.246343 27074 http.cpp:922] Using default 'basic' HTTP authenticator for realm
'mesos-agent-readonly'
I1221 05:09:25.246393 27074 http.cpp:922] Using default 'basic' HTTP authenticator for realm
'mesos-agent-readwrite'
I1221 05:09:25.246732 27074 slave.cpp:539] Agent resources: cpus(*):2; mem(*):1024; disk(*):1024;
ports(*):[31000-32000]
I1221 05:09:25.246773 27074 slave.cpp:547] Agent attributes: [  ]
I1221 05:09:25.246783 27074 slave.cpp:552] Agent hostname: 76df9a43f0a8
I1221 05:09:25.247149 27072 state.cpp:57] Recovering state from '/tmp/Endpoint_SlaveEndpointTest_NoAuthorizer_2_IyJhpv/meta'
I1221 05:09:25.247380 27082 status_update_manager.cpp:203] Recovering status update manager
I1221 05:09:25.247700 27083 containerizer.cpp:599] Recovering containerizer
I1221 05:09:25.248350 27077 provisioner.cpp:253] Provisioner recovery complete
I1221 05:09:25.248714 27073 slave.cpp:5407] Finished recovery
I1221 05:09:25.249204 27073 slave.cpp:5581] Querying resource estimator for oversubscribable
resources
I1221 05:09:25.249306 27072 slave.cpp:5595] Received oversubscribable resources {} from the
resource estimator
I1221 05:09:25.250007 27083 process.cpp:3679] Handling HTTP event for process 'slave(679)'
with path: '/slave(679)/containers'
I1221 05:09:25.250488 27084 http.cpp:874] Authorizing principal 'test-principal' to GET the
'/containers' endpoint
I1221 05:09:25.252055 27083 slave.cpp:796] Agent terminating
[       OK ] Endpoint/SlaveEndpointTest.NoAuthorizer/2 (14 ms)
[----------] 9 tests from Endpoint/SlaveEndpointTest (115 ms total)

[----------] Global test environment tear-down
[==========] 1399 tests from 158 test cases ran. (177613 ms total)
[  PASSED  ] 1399 tests.

  YOU HAVE 9 DISABLED TESTS

Inconsistency detected by ld.so: dl-close.c: 762: _dl_close: Assertion `map->l_init_called'
failed!
make[3]: *** [CMakeFiles/check] Error 127
make[3]: Leaving directory `/mesos/build'
make[2]: *** [CMakeFiles/check.dir/all] Error 2
make[2]: Leaving directory `/mesos/build'
make[1]: *** [CMakeFiles/check.dir/rule] Error 2
make[1]: Leaving directory `/mesos/build'
make: *** [check] Error 2
+ docker rmi mesos-1482294235-15005
Untagged: mesos-1482294235-15005:latest
Deleted: sha256:5616d8297ad9aba8b3b0f7904e7454ec6cd4459a34af7af64e7f88cd67d27079
Deleted: sha256:89dc6ef206dc7815a02a2b094c519adc7044d50bcb40bd776e41a0867efa21fe
Deleted: sha256:6f697dbd1788639db7af7b46929f881f25d5e2135e231fe9b82df02d8fd2bee9
Deleted: sha256:c7f67e95d04f21153faf60991ceb56174b1938cc2060ebe4b44025c91531ff6b
Deleted: sha256:cf8695d5030d10312decdffd1fb93a118933411d755f4c8da084bec2482e0739
Deleted: sha256:6a7d103f4cf44fcafac241ccfdfb11798e44a4f4c6cdc86dde75439aa35482b7
Deleted: sha256:71ebadf6d43feda62eb42977dcee9c8b8b1790e0213d3de3d3a4a734d3beac06
Deleted: sha256:cb66715f58a6887407b2f60f2c3bee799326c1fece9e183033aec03f653acf5d
Deleted: sha256:05dfbda3c616d2303db3574d6642fe3aa0c479aba30f55ff52cdc8d88909a320
Deleted: sha256:978d5091e9f6283dd7d54423613d8dcaa20eb463cdec38aba96cbadc4924a1e3
Deleted: sha256:5bc4b168794192c1ad3ad5c29646311cd806c38ef796ff8e105a47c4f55a65c1
Deleted: sha256:02dd488265080df820e2a4a3baae335c5da22862cb1ac9ef61aa309737aae6b2
Deleted: sha256:59d65db5b07425ba534c8b6947adc8708b6df0d608d03dd93d0b51985cdb8c3d
Deleted: sha256:efaaa057e4ae8c41751db5df514e5c5cc8db68b33b13beba526f8a6c3d292285
Deleted: sha256:531428f90ac8a4af9c0c7a22e3806eab24f0f125d4d9e8789c22f56a68aa7240
Deleted: sha256:3a2a3a3f234b5f4d93842a182bf12e83bd8ed0a7c36a99ec1294f5f045ed0578
Deleted: sha256:704b318fbe6b0e0ccf09be297d4395d2e05f241751f12e146c72aed35814cce0
Deleted: sha256:efdf8da0f18f13982e3a50834b9b33997b6c49a178e1793b5fc307a8a31bb444
Deleted: sha256:7cb3dd9bc7d60250099219e9bc44f35ee7fc09abba96f6b33e812428a1285115
Deleted: sha256:51df0d8cb5da2a03b137dc1dea59bdf753a3720060d99e4215ca6d7b77366fcd
Deleted: sha256:18940bfda24d3032ef5e52b8d3bec7cb51084c5005053300e2841f016b087d12
Deleted: sha256:a8f48af36e99232ffdb8f279af7d2900e907919f6e1f74e5ea34776560037045
Deleted: sha256:91d50d1391f299696167a7b6d986fd0a2a32538d7c25622f7e8760c4d3f72e3b
Deleted: sha256:83171a98e09a0493f5c7fca58e1e55d83556f2d8694aea2abb3cc22c6942153a
Build step 'Execute shell' marked build as failure

Mime
View raw message