mesos-builds mailing list archives

Site index · List index
Message view « Date » · « Thread »
Top « Date » · « Thread »
From Apache Jenkins Server <jenk...@builds.apache.org>
Subject Build failed in Jenkins: Mesos » cmake,gcc,--verbose,GLOG_v=1 MESOS_VERBOSE=1,ubuntu:14.04,(docker||Hadoop)&&(!ubuntu-us1)&&(!ubuntu-6)&&(!ubuntu-eu2) #3002
Date Fri, 02 Dec 2016 07:18:01 GMT
See <https://builds.apache.org/job/Mesos/BUILDTOOL=cmake,COMPILER=gcc,CONFIGURATION=--verbose,ENVIRONMENT=GLOG_v=1%20MESOS_VERBOSE=1,OS=ubuntu%3A14.04,label_exp=(docker%7C%7CHadoop)&&(!ubuntu-us1)&&(!ubuntu-6)&&(!ubuntu-eu2)/3002/changes>

Changes:

[bmahler] Overrided the webui navbar color to match project website.

[bmahler] Show the Mesos logo in the webui navbar.

[yujie.jay] Updated IOSwitchboard to block IO until connected for DEBUG containers.

[yujie.jay] Fixed a warning reported by clang.

[yujie.jay] Silenced a warning from clang.

[josephwu] CMake: Added loop_tests.cpp to the build.

[josephwu] CMake: Added IO Switchboard to the build.

[benjamin.hindman] Fixed bug on OSX with socket shutdown.

[xujyan] Added additional unit tests for shared resources.

[bmahler] Introduced Resource.AllocationInfo.

[josephwu] Disambiguated return type of lambda passed to `Future<T>::then`.

[vinodkone] Updated signatures of v1 agent API handlers.

[vinodkone] Refactored `Slave::Http::launchNestedContainer()`.

[vinodkone] Added `devolve` helper for `ContainerID`.

[vinodkone] Added API handler for LAUNCH_NESTED_CONTAINER_SESSION.

------------------------------------------
[...truncated 215577 lines...]
I1202 07:15:11.081347 26727 http.cpp:874] Authorizing principal 'test-principal' to GET the
'/monitor/statistics' endpoint
I1202 07:15:11.082337 26714 slave.cpp:790] Agent terminating
[       OK ] Endpoint/SlaveEndpointTest.AuthorizedRequest/0 (10 ms)
[ RUN      ] Endpoint/SlaveEndpointTest.AuthorizedRequest/1
I1202 07:15:11.088610 26714 containerizer.cpp:206] Using isolation: posix/cpu,posix/mem,filesystem/posix,network/cni
W1202 07:15:11.088887 26714 backend.cpp:76] Failed to create 'aufs' backend: AufsBackend requires
root privileges, but is running as user mesos
W1202 07:15:11.088969 26714 backend.cpp:76] Failed to create 'bind' backend: BindBackend requires
root privileges
I1202 07:15:11.090217 26716 slave.cpp:208] Mesos agent started on (649)@172.17.0.2:55828
I1202 07:15:11.090230 26716 slave.cpp:209] Flags at startup: --acls="" --appc_simple_discovery_uri_prefix="http://"
--appc_store_dir="/tmp/mesos/store/appc" --authenticate_http_readonly="true" --authenticate_http_readwrite="true"
--authenticatee="crammd5" --authentication_backoff_factor="1secs" --authorizer="local" --cgroups_cpu_enable_pids_and_tids_count="false"
--cgroups_enable_cfs="false" --cgroups_hierarchy="/sys/fs/cgroup" --cgroups_limit_swap="false"
--cgroups_root="mesos" --container_disk_watch_interval="15secs" --containerizers="mesos" --credential="/tmp/Endpoint_SlaveEndpointTest_AuthorizedRequest_1_aYF6rr/credential"
--default_role="*" --disk_watch_interval="1mins" --docker="docker" --docker_kill_orphans="true"
--docker_registry="https://registry-1.docker.io" --docker_remove_delay="6hrs" --docker_socket="/var/run/docker.sock"
--docker_stop_timeout="0ns" --docker_store_dir="/tmp/mesos/store/docker" --docker_volume_checkpoint_dir="/var/run/mesos/isolators/docker/volume"
--enforce_container_disk_quota="false" --executor_registration_timeout="1mins" --executor_shutdown_grace_period="5secs"
--fetcher_cache_dir="/tmp/Endpoint_SlaveEndpointTest_AuthorizedRequest_1_aYF6rr/fetch" --fetcher_cache_size="2GB"
--frameworks_home="" --gc_delay="1weeks" --gc_disk_headroom="0.1" --hadoop_home="" --help="false"
--hostname_lookup="true" --http_authenticators="basic" --http_command_executor="false" --http_credentials="/tmp/Endpoint_SlaveEndpointTest_AuthorizedRequest_1_aYF6rr/http_credentials"
--image_provisioner_backend="copy" --initialize_driver_logging="true" --io_switchboard_enable_server="true"
--isolation="posix/cpu,posix/mem" --launcher="posix" --launcher_dir="/mesos/build/src" --logbufsecs="0"
--logging_level="INFO" --max_completed_executors_per_framework="150" --oversubscribed_resources_interval="15secs"
--perf_duration="10secs" --perf_interval="1mins" --qos_correction_interval_min="0ns" --quiet="false"
--recover="reconnect" --recovery_timeout="15mins" --registration_backoff_factor="10ms" --resources="cpus:2;gpus:0;mem:1024;disk:1024;ports:[31000-32000]"
--revocable_cpu_low_priority="true" --runtime_dir="/tmp/Endpoint_SlaveEndpointTest_AuthorizedRequest_1_aYF6rr"
--sandbox_directory="/mnt/mesos/sandbox" --strict="true" --switch_user="true" --systemd_enable_support="true"
--systemd_runtime_directory="/run/systemd/system" --version="false" --work_dir="/tmp/Endpoint_SlaveEndpointTest_AuthorizedRequest_1_myQYWa"
I1202 07:15:11.090503 26716 credentials.hpp:86] Loading credential for authentication from
'/tmp/Endpoint_SlaveEndpointTest_AuthorizedRequest_1_aYF6rr/credential'
I1202 07:15:11.090637 26716 slave.cpp:346] Agent using credential for: test-principal
I1202 07:15:11.090652 26716 credentials.hpp:37] Loading credentials for authentication from
'/tmp/Endpoint_SlaveEndpointTest_AuthorizedRequest_1_aYF6rr/http_credentials'
I1202 07:15:11.090768 26716 http.cpp:922] Using default 'basic' HTTP authenticator for realm
'mesos-agent-readonly'
I1202 07:15:11.090811 26716 http.cpp:922] Using default 'basic' HTTP authenticator for realm
'mesos-agent-readwrite'
I1202 07:15:11.091100 26716 slave.cpp:533] Agent resources: cpus(*):2; mem(*):1024; disk(*):1024;
ports(*):[31000-32000]
I1202 07:15:11.091135 26716 slave.cpp:541] Agent attributes: [  ]
I1202 07:15:11.091146 26716 slave.cpp:546] Agent hostname: 1b9193698323
I1202 07:15:11.091450 26728 state.cpp:57] Recovering state from '/tmp/Endpoint_SlaveEndpointTest_AuthorizedRequest_1_myQYWa/meta'
I1202 07:15:11.091610 26720 status_update_manager.cpp:203] Recovering status update manager
I1202 07:15:11.091718 26718 containerizer.cpp:579] Recovering containerizer
I1202 07:15:11.092157 26718 provisioner.cpp:253] Provisioner recovery complete
I1202 07:15:11.092326 26718 slave.cpp:5414] Finished recovery
I1202 07:15:11.092687 26718 slave.cpp:5588] Querying resource estimator for oversubscribable
resources
I1202 07:15:11.092777 26724 slave.cpp:5602] Received oversubscribable resources {} from the
resource estimator
I1202 07:15:11.093267 26717 process.cpp:3679] Handling HTTP event for process 'slave(649)'
with path: '/slave(649)/monitor/statistics.json'
I1202 07:15:11.093616 26722 http.cpp:874] Authorizing principal 'test-principal' to GET the
'/monitor/statistics.json' endpoint
I1202 07:15:11.094698 26719 slave.cpp:790] Agent terminating
[       OK ] Endpoint/SlaveEndpointTest.AuthorizedRequest/1 (10 ms)
[ RUN      ] Endpoint/SlaveEndpointTest.AuthorizedRequest/2
I1202 07:15:11.100853 26714 containerizer.cpp:206] Using isolation: posix/cpu,posix/mem,filesystem/posix,network/cni
W1202 07:15:11.101196 26714 backend.cpp:76] Failed to create 'aufs' backend: AufsBackend requires
root privileges, but is running as user mesos
W1202 07:15:11.101280 26714 backend.cpp:76] Failed to create 'bind' backend: BindBackend requires
root privileges
I1202 07:15:11.102134 26722 slave.cpp:208] Mesos agent started on (650)@172.17.0.2:55828
I1202 07:15:11.102150 26722 slave.cpp:209] Flags at startup: --acls="" --appc_simple_discovery_uri_prefix="http://"
--appc_store_dir="/tmp/mesos/store/appc" --authenticate_http_readonly="true" --authenticate_http_readwrite="true"
--authenticatee="crammd5" --authentication_backoff_factor="1secs" --authorizer="local" --cgroups_cpu_enable_pids_and_tids_count="false"
--cgroups_enable_cfs="false" --cgroups_hierarchy="/sys/fs/cgroup" --cgroups_limit_swap="false"
--cgroups_root="mesos" --container_disk_watch_interval="15secs" --containerizers="mesos" --credential="/tmp/Endpoint_SlaveEndpointTest_AuthorizedRequest_2_Yxbjzv/credential"
--default_role="*" --disk_watch_interval="1mins" --docker="docker" --docker_kill_orphans="true"
--docker_registry="https://registry-1.docker.io" --docker_remove_delay="6hrs" --docker_socket="/var/run/docker.sock"
--docker_stop_timeout="0ns" --docker_store_dir="/tmp/mesos/store/docker" --docker_volume_checkpoint_dir="/var/run/mesos/isolators/docker/volume"
--enforce_container_disk_quota="false" --executor_registration_timeout="1mins" --executor_shutdown_grace_period="5secs"
--fetcher_cache_dir="/tmp/Endpoint_SlaveEndpointTest_AuthorizedRequest_2_Yxbjzv/fetch" --fetcher_cache_size="2GB"
--frameworks_home="" --gc_delay="1weeks" --gc_disk_headroom="0.1" --hadoop_home="" --help="false"
--hostname_lookup="true" --http_authenticators="basic" --http_command_executor="false" --http_credentials="/tmp/Endpoint_SlaveEndpointTest_AuthorizedRequest_2_Yxbjzv/http_credentials"
--image_provisioner_backend="copy" --initialize_driver_logging="true" --io_switchboard_enable_server="true"
--isolation="posix/cpu,posix/mem" --launcher="posix" --launcher_dir="/mesos/build/src" --logbufsecs="0"
--logging_level="INFO" --max_completed_executors_per_framework="150" --oversubscribed_resources_interval="15secs"
--perf_duration="10secs" --perf_interval="1mins" --qos_correction_interval_min="0ns" --quiet="false"
--recover="reconnect" --recovery_timeout="15mins" --registration_backoff_factor="10ms" --resources="cpus:2;gpus:0;mem:1024;disk:1024;ports:[31000-32000]"
--revocable_cpu_low_priority="true" --runtime_dir="/tmp/Endpoint_SlaveEndpointTest_AuthorizedRequest_2_Yxbjzv"
--sandbox_directory="/mnt/mesos/sandbox" --strict="true" --switch_user="true" --systemd_enable_support="true"
--systemd_runtime_directory="/run/systemd/system" --version="false" --work_dir="/tmp/Endpoint_SlaveEndpointTest_AuthorizedRequest_2_6Hjb2e"
I1202 07:15:11.102576 26722 credentials.hpp:86] Loading credential for authentication from
'/tmp/Endpoint_SlaveEndpointTest_AuthorizedRequest_2_Yxbjzv/credential'
I1202 07:15:11.102668 26722 slave.cpp:346] Agent using credential for: test-principal
I1202 07:15:11.102680 26722 credentials.hpp:37] Loading credentials for authentication from
'/tmp/Endpoint_SlaveEndpointTest_AuthorizedRequest_2_Yxbjzv/http_credentials'
I1202 07:15:11.102787 26722 http.cpp:922] Using default 'basic' HTTP authenticator for realm
'mesos-agent-readonly'
I1202 07:15:11.102828 26722 http.cpp:922] Using default 'basic' HTTP authenticator for realm
'mesos-agent-readwrite'
I1202 07:15:11.103116 26722 slave.cpp:533] Agent resources: cpus(*):2; mem(*):1024; disk(*):1024;
ports(*):[31000-32000]
I1202 07:15:11.103149 26722 slave.cpp:541] Agent attributes: [  ]
I1202 07:15:11.103158 26722 slave.cpp:546] Agent hostname: 1b9193698323
I1202 07:15:11.103431 26717 state.cpp:57] Recovering state from '/tmp/Endpoint_SlaveEndpointTest_AuthorizedRequest_2_6Hjb2e/meta'
I1202 07:15:11.103548 26722 status_update_manager.cpp:203] Recovering status update manager
I1202 07:15:11.103669 26718 containerizer.cpp:579] Recovering containerizer
I1202 07:15:11.104161 26718 provisioner.cpp:253] Provisioner recovery complete
I1202 07:15:11.104307 26718 slave.cpp:5414] Finished recovery
I1202 07:15:11.104629 26718 slave.cpp:5588] Querying resource estimator for oversubscribable
resources
I1202 07:15:11.104856 26728 slave.cpp:5602] Received oversubscribable resources {} from the
resource estimator
I1202 07:15:11.105340 26715 process.cpp:3679] Handling HTTP event for process 'slave(650)'
with path: '/slave(650)/containers'
I1202 07:15:11.105720 26719 http.cpp:874] Authorizing principal 'test-principal' to GET the
'/containers' endpoint
I1202 07:15:11.106812 26724 slave.cpp:790] Agent terminating
[       OK ] Endpoint/SlaveEndpointTest.AuthorizedRequest/2 (10 ms)
[ RUN      ] Endpoint/SlaveEndpointTest.UnauthorizedRequest/0
I1202 07:15:11.113296 26714 containerizer.cpp:206] Using isolation: posix/cpu,posix/mem,filesystem/posix,network/cni
W1202 07:15:11.113580 26714 backend.cpp:76] Failed to create 'aufs' backend: AufsBackend requires
root privileges, but is running as user mesos
W1202 07:15:11.113654 26714 backend.cpp:76] Failed to create 'bind' backend: BindBackend requires
root privileges
I1202 07:15:11.114578 26717 slave.cpp:208] Mesos agent started on (651)@172.17.0.2:55828
I1202 07:15:11.114593 26717 slave.cpp:209] Flags at startup: --acls="" --appc_simple_discovery_uri_prefix="http://"
--appc_store_dir="/tmp/mesos/store/appc" --authenticate_http_readonly="true" --authenticate_http_readwrite="true"
--authenticatee="crammd5" --authentication_backoff_factor="1secs" --authorizer="local" --cgroups_cpu_enable_pids_and_tids_count="false"
--cgroups_enable_cfs="false" --cgroups_hierarchy="/sys/fs/cgroup" --cgroups_limit_swap="false"
--cgroups_root="mesos" --container_disk_watch_interval="15secs" --containerizers="mesos" --credential="/tmp/Endpoint_SlaveEndpointTest_UnauthorizedRequest_0_UFmuOz/credential"
--default_role="*" --disk_watch_interval="1mins" --docker="docker" --docker_kill_orphans="true"
--docker_registry="https://registry-1.docker.io" --docker_remove_delay="6hrs" --docker_socket="/var/run/docker.sock"
--docker_stop_timeout="0ns" --docker_store_dir="/tmp/mesos/store/docker" --docker_volume_checkpoint_dir="/var/run/mesos/isolators/docker/volume"
--enforce_container_disk_quota="false" --executor_registration_timeout="1mins" --executor_shutdown_grace_period="5secs"
--fetcher_cache_dir="/tmp/Endpoint_SlaveEndpointTest_UnauthorizedRequest_0_UFmuOz/fetch" --fetcher_cache_size="2GB"
--frameworks_home="" --gc_delay="1weeks" --gc_disk_headroom="0.1" --hadoop_home="" --help="false"
--hostname_lookup="true" --http_authenticators="basic" --http_command_executor="false" --http_credentials="/tmp/Endpoint_SlaveEndpointTest_UnauthorizedRequest_0_UFmuOz/http_credentials"
--image_provisioner_backend="copy" --initialize_driver_logging="true" --io_switchboard_enable_server="true"
--isolation="posix/cpu,posix/mem" --launcher="posix" --launcher_dir="/mesos/build/src" --logbufsecs="0"
--logging_level="INFO" --max_completed_executors_per_framework="150" --oversubscribed_resources_interval="15secs"
--perf_duration="10secs" --perf_interval="1mins" --qos_correction_interval_min="0ns" --quiet="false"
--recover="reconnect" --recovery_timeout="15mins" --registration_backoff_factor="10ms" --resources="cpus:2;gpus:0;mem:1024;disk:1024;ports:[31000-32000]"
--revocable_cpu_low_priority="true" --runtime_dir="/tmp/Endpoint_SlaveEndpointTest_UnauthorizedRequest_0_UFmuOz"
--sandbox_directory="/mnt/mesos/sandbox" --strict="true" --switch_user="true" --systemd_enable_support="true"
--systemd_runtime_directory="/run/systemd/system" --version="false" --work_dir="/tmp/Endpoint_SlaveEndpointTest_UnauthorizedRequest_0_e00kfj"
I1202 07:15:11.114866 26717 credentials.hpp:86] Loading credential for authentication from
'/tmp/Endpoint_SlaveEndpointTest_UnauthorizedRequest_0_UFmuOz/credential'
I1202 07:15:11.114939 26717 slave.cpp:346] Agent using credential for: test-principal
I1202 07:15:11.115001 26717 credentials.hpp:37] Loading credentials for authentication from
'/tmp/Endpoint_SlaveEndpointTest_UnauthorizedRequest_0_UFmuOz/http_credentials'
I1202 07:15:11.115121 26717 http.cpp:922] Using default 'basic' HTTP authenticator for realm
'mesos-agent-readonly'
I1202 07:15:11.115171 26717 http.cpp:922] Using default 'basic' HTTP authenticator for realm
'mesos-agent-readwrite'
I1202 07:15:11.115495 26717 slave.cpp:533] Agent resources: cpus(*):2; mem(*):1024; disk(*):1024;
ports(*):[31000-32000]
I1202 07:15:11.115527 26717 slave.cpp:541] Agent attributes: [  ]
I1202 07:15:11.115532 26717 slave.cpp:546] Agent hostname: 1b9193698323
I1202 07:15:11.115881 26725 state.cpp:57] Recovering state from '/tmp/Endpoint_SlaveEndpointTest_UnauthorizedRequest_0_e00kfj/meta'
I1202 07:15:11.116040 26720 status_update_manager.cpp:203] Recovering status update manager
I1202 07:15:11.116113 26724 containerizer.cpp:579] Recovering containerizer
I1202 07:15:11.116608 26726 provisioner.cpp:253] Provisioner recovery complete
I1202 07:15:11.116746 26726 slave.cpp:5414] Finished recovery
I1202 07:15:11.117017 26726 slave.cpp:5588] Querying resource estimator for oversubscribable
resources
I1202 07:15:11.117110 26725 slave.cpp:5602] Received oversubscribable resources {} from the
resource estimator
I1202 07:15:11.117664 26724 process.cpp:3679] Handling HTTP event for process 'slave(651)'
with path: '/slave(651)/monitor/statistics'
I1202 07:15:11.118038 26719 http.cpp:874] Authorizing principal 'test-principal' to GET the
'/monitor/statistics' endpoint
I1202 07:15:11.118847 26730 slave.cpp:790] Agent terminating
[       OK ] Endpoint/SlaveEndpointTest.UnauthorizedRequest/0 (9 ms)
[ RUN      ] Endpoint/SlaveEndpointTest.UnauthorizedRequest/1
I1202 07:15:11.127578 26714 containerizer.cpp:206] Using isolation: posix/cpu,posix/mem,filesystem/posix,network/cni
W1202 07:15:11.127843 26714 backend.cpp:76] Failed to create 'aufs' backend: AufsBackend requires
root privileges, but is running as user mesos
W1202 07:15:11.127926 26714 backend.cpp:76] Failed to create 'bind' backend: BindBackend requires
root privileges
I1202 07:15:11.128830 26726 slave.cpp:208] Mesos agent started on (652)@172.17.0.2:55828
I1202 07:15:11.128847 26726 slave.cpp:209] Flags at startup: --acls="" --appc_simple_discovery_uri_prefix="http://"
--appc_store_dir="/tmp/mesos/store/appc" --authenticate_http_readonly="true" --authenticate_http_readwrite="true"
--authenticatee="crammd5" --authentication_backoff_factor="1secs" --authorizer="local" --cgroups_cpu_enable_pids_and_tids_count="false"
--cgroups_enable_cfs="false" --cgroups_hierarchy="/sys/fs/cgroup" --cgroups_limit_swap="false"
--cgroups_root="mesos" --container_disk_watch_interval="15secs" --containerizers="mesos" --credential="/tmp/Endpoint_SlaveEndpointTest_UnauthorizedRequest_1_SkrJcE/credential"
--default_role="*" --disk_watch_interval="1mins" --docker="docker" --docker_kill_orphans="true"
--docker_registry="https://registry-1.docker.io" --docker_remove_delay="6hrs" --docker_socket="/var/run/docker.sock"
--docker_stop_timeout="0ns" --docker_store_dir="/tmp/mesos/store/docker" --docker_volume_checkpoint_dir="/var/run/mesos/isolators/docker/volume"
--enforce_container_disk_quota="false" --executor_registration_timeout="1mins" --executor_shutdown_grace_period="5secs"
--fetcher_cache_dir="/tmp/Endpoint_SlaveEndpointTest_UnauthorizedRequest_1_SkrJcE/fetch" --fetcher_cache_size="2GB"
--frameworks_home="" --gc_delay="1weeks" --gc_disk_headroom="0.1" --hadoop_home="" --help="false"
--hostname_lookup="true" --http_authenticators="basic" --http_command_executor="false" --http_credentials="/tmp/Endpoint_SlaveEndpointTest_UnauthorizedRequest_1_SkrJcE/http_credentials"
--image_provisioner_backend="copy" --initialize_driver_logging="true" --io_switchboard_enable_server="true"
--isolation="posix/cpu,posix/mem" --launcher="posix" --launcher_dir="/mesos/build/src" --logbufsecs="0"
--logging_level="INFO" --max_completed_executors_per_framework="150" --oversubscribed_resources_interval="15secs"
--perf_duration="10secs" --perf_interval="1mins" --qos_correction_interval_min="0ns" --quiet="false"
--recover="reconnect" --recovery_timeout="15mins" --registration_backoff_factor="10ms" --resources="cpus:2;gpus:0;mem:1024;disk:1024;ports:[31000-32000]"
--revocable_cpu_low_priority="true" --runtime_dir="/tmp/Endpoint_SlaveEndpointTest_UnauthorizedRequest_1_SkrJcE"
--sandbox_directory="/mnt/mesos/sandbox" --strict="true" --switch_user="true" --systemd_enable_support="true"
--systemd_runtime_directory="/run/systemd/system" --version="false" --work_dir="/tmp/Endpoint_SlaveEndpointTest_UnauthorizedRequest_1_iQffBn"
I1202 07:15:11.129155 26726 credentials.hpp:86] Loading credential for authentication from
'/tmp/Endpoint_SlaveEndpointTest_UnauthorizedRequest_1_SkrJcE/credential'
I1202 07:15:11.129235 26726 slave.cpp:346] Agent using credential for: test-principal
I1202 07:15:11.129247 26726 credentials.hpp:37] Loading credentials for authentication from
'/tmp/Endpoint_SlaveEndpointTest_UnauthorizedRequest_1_SkrJcE/http_credentials'
I1202 07:15:11.129348 26726 http.cpp:922] Using default 'basic' HTTP authenticator for realm
'mesos-agent-readonly'
I1202 07:15:11.129397 26726 http.cpp:922] Using default 'basic' HTTP authenticator for realm
'mesos-agent-readwrite'
I1202 07:15:11.129730 26726 slave.cpp:533] Agent resources: cpus(*):2; mem(*):1024; disk(*):1024;
ports(*):[31000-32000]
I1202 07:15:11.129763 26726 slave.cpp:541] Agent attributes: [  ]
I1202 07:15:11.129768 26726 slave.cpp:546] Agent hostname: 1b9193698323
I1202 07:15:11.130106 26724 state.cpp:57] Recovering state from '/tmp/Endpoint_SlaveEndpointTest_UnauthorizedRequest_1_iQffBn/meta'
I1202 07:15:11.130277 26721 status_update_manager.cpp:203] Recovering status update manager
I1202 07:15:11.130455 26726 containerizer.cpp:579] Recovering containerizer
I1202 07:15:11.130893 26726 provisioner.cpp:253] Provisioner recovery complete
I1202 07:15:11.131073 26727 slave.cpp:5414] Finished recovery
I1202 07:15:11.131377 26727 slave.cpp:5588] Querying resource estimator for oversubscribable
resources
I1202 07:15:11.131523 26723 slave.cpp:5602] Received oversubscribable resources {} from the
resource estimator
I1202 07:15:11.132146 26715 process.cpp:3679] Handling HTTP event for process 'slave(652)'
with path: '/slave(652)/monitor/statistics.json'
I1202 07:15:11.132470 26718 http.cpp:874] Authorizing principal 'test-principal' to GET the
'/monitor/statistics.json' endpoint
I1202 07:15:11.133343 26726 slave.cpp:790] Agent terminating
[       OK ] Endpoint/SlaveEndpointTest.UnauthorizedRequest/1 (10 ms)
[ RUN      ] Endpoint/SlaveEndpointTest.UnauthorizedRequest/2
I1202 07:15:11.148355 26714 containerizer.cpp:206] Using isolation: posix/cpu,posix/mem,filesystem/posix,network/cni
W1202 07:15:11.148732 26714 backend.cpp:76] Failed to create 'aufs' backend: AufsBackend requires
root privileges, but is running as user mesos
W1202 07:15:11.148828 26714 backend.cpp:76] Failed to create 'bind' backend: BindBackend requires
root privileges
I1202 07:15:11.149657 26716 slave.cpp:208] Mesos agent started on (653)@172.17.0.2:55828
I1202 07:15:11.149809 26716 slave.cpp:209] Flags at startup: --acls="" --appc_simple_discovery_uri_prefix="http://"
--appc_store_dir="/tmp/mesos/store/appc" --authenticate_http_readonly="true" --authenticate_http_readwrite="true"
--authenticatee="crammd5" --authentication_backoff_factor="1secs" --authorizer="local" --cgroups_cpu_enable_pids_and_tids_count="false"
--cgroups_enable_cfs="false" --cgroups_hierarchy="/sys/fs/cgroup" --cgroups_limit_swap="false"
--cgroups_root="mesos" --container_disk_watch_interval="15secs" --containerizers="mesos" --credential="/tmp/Endpoint_SlaveEndpointTest_UnauthorizedRequest_2_opboNI/credential"
--default_role="*" --disk_watch_interval="1mins" --docker="docker" --docker_kill_orphans="true"
--docker_registry="https://registry-1.docker.io" --docker_remove_delay="6hrs" --docker_socket="/var/run/docker.sock"
--docker_stop_timeout="0ns" --docker_store_dir="/tmp/mesos/store/docker" --docker_volume_checkpoint_dir="/var/run/mesos/isolators/docker/volume"
--enforce_container_disk_quota="false" --executor_registration_timeout="1mins" --executor_shutdown_grace_period="5secs"
--fetcher_cache_dir="/tmp/Endpoint_SlaveEndpointTest_UnauthorizedRequest_2_opboNI/fetch" --fetcher_cache_size="2GB"
--frameworks_home="" --gc_delay="1weeks" --gc_disk_headroom="0.1" --hadoop_home="" --help="false"
--hostname_lookup="true" --http_authenticators="basic" --http_command_executor="false" --http_credentials="/tmp/Endpoint_SlaveEndpointTest_UnauthorizedRequest_2_opboNI/http_credentials"
--image_provisioner_backend="copy" --initialize_driver_logging="true" --io_switchboard_enable_server="true"
--isolation="posix/cpu,posix/mem" --launcher="posix" --launcher_dir="/mesos/build/src" --logbufsecs="0"
--logging_level="INFO" --max_completed_executors_per_framework="150" --oversubscribed_resources_interval="15secs"
--perf_duration="10secs" --perf_interval="1mins" --qos_correction_interval_min="0ns" --quiet="false"
--recover="reconnect" --recovery_timeout="15mins" --registration_backoff_factor="10ms" --resources="cpus:2;gpus:0;mem:1024;disk:1024;ports:[31000-32000]"
--revocable_cpu_low_priority="true" --runtime_dir="/tmp/Endpoint_SlaveEndpointTest_UnauthorizedRequest_2_opboNI"
--sandbox_directory="/mnt/mesos/sandbox" --strict="true" --switch_user="true" --systemd_enable_support="true"
--systemd_runtime_directory="/run/systemd/system" --version="false" --work_dir="/tmp/Endpoint_SlaveEndpointTest_UnauthorizedRequest_2_ItAx8r"
I1202 07:15:11.150178 26716 credentials.hpp:86] Loading credential for authentication from
'/tmp/Endpoint_SlaveEndpointTest_UnauthorizedRequest_2_opboNI/credential'
I1202 07:15:11.150262 26716 slave.cpp:346] Agent using credential for: test-principal
I1202 07:15:11.150275 26716 credentials.hpp:37] Loading credentials for authentication from
'/tmp/Endpoint_SlaveEndpointTest_UnauthorizedRequest_2_opboNI/http_credentials'
I1202 07:15:11.150369 26716 http.cpp:922] Using default 'basic' HTTP authenticator for realm
'mesos-agent-readonly'
I1202 07:15:11.150416 26716 http.cpp:922] Using default 'basic' HTTP authenticator for realm
'mesos-agent-readwrite'
I1202 07:15:11.150812 26716 slave.cpp:533] Agent resources: cpus(*):2; mem(*):1024; disk(*):1024;
ports(*):[31000-32000]
I1202 07:15:11.150845 26716 slave.cpp:541] Agent attributes: [  ]
I1202 07:15:11.150849 26716 slave.cpp:546] Agent hostname: 1b9193698323
I1202 07:15:11.151180 26724 state.cpp:57] Recovering state from '/tmp/Endpoint_SlaveEndpointTest_UnauthorizedRequest_2_ItAx8r/meta'
I1202 07:15:11.151338 26724 status_update_manager.cpp:203] Recovering status update manager
I1202 07:15:11.151404 26724 containerizer.cpp:579] Recovering containerizer
I1202 07:15:11.151728 26724 provisioner.cpp:253] Provisioner recovery complete
I1202 07:15:11.151847 26724 slave.cpp:5414] Finished recovery
I1202 07:15:11.152107 26724 slave.cpp:5588] Querying resource estimator for oversubscribable
resources
I1202 07:15:11.152225 26724 slave.cpp:5602] Received oversubscribable resources {} from the
resource estimator
I1202 07:15:11.152806 26718 process.cpp:3679] Handling HTTP event for process 'slave(653)'
with path: '/slave(653)/containers'
I1202 07:15:11.153136 26717 http.cpp:874] Authorizing principal 'test-principal' to GET the
'/containers' endpoint
I1202 07:15:11.154026 26715 slave.cpp:790] Agent terminating
[       OK ] Endpoint/SlaveEndpointTest.UnauthorizedRequest/2 (9 ms)
[ RUN      ] Endpoint/SlaveEndpointTest.NoAuthorizer/0
I1202 07:15:11.158177 26714 containerizer.cpp:206] Using isolation: posix/cpu,posix/mem,filesystem/posix,network/cni
W1202 07:15:11.158432 26714 backend.cpp:76] Failed to create 'aufs' backend: AufsBackend requires
root privileges, but is running as user mesos
W1202 07:15:11.158493 26714 backend.cpp:76] Failed to create 'bind' backend: BindBackend requires
root privileges
I1202 07:15:11.159140 26714 cluster.cpp:435] Creating default 'local' authorizer
I1202 07:15:11.159595 26727 slave.cpp:208] Mesos agent started on (654)@172.17.0.2:55828
I1202 07:15:11.159611 26727 slave.cpp:209] Flags at startup: --acls="" --appc_simple_discovery_uri_prefix="http://"
--appc_store_dir="/tmp/mesos/store/appc" --authenticate_http_readonly="true" --authenticate_http_readwrite="true"
--authenticatee="crammd5" --authentication_backoff_factor="1secs" --authorizer="local" --cgroups_cpu_enable_pids_and_tids_count="false"
--cgroups_enable_cfs="false" --cgroups_hierarchy="/sys/fs/cgroup" --cgroups_limit_swap="false"
--cgroups_root="mesos" --container_disk_watch_interval="15secs" --containerizers="mesos" --credential="/tmp/Endpoint_SlaveEndpointTest_NoAuthorizer_0_IzrbwN/credential"
--default_role="*" --disk_watch_interval="1mins" --docker="docker" --docker_kill_orphans="true"
--docker_registry="https://registry-1.docker.io" --docker_remove_delay="6hrs" --docker_socket="/var/run/docker.sock"
--docker_stop_timeout="0ns" --docker_store_dir="/tmp/mesos/store/docker" --docker_volume_checkpoint_dir="/var/run/mesos/isolators/docker/volume"
--enforce_container_disk_quota="false" --executor_registration_timeout="1mins" --executor_shutdown_grace_period="5secs"
--fetcher_cache_dir="/tmp/Endpoint_SlaveEndpointTest_NoAuthorizer_0_IzrbwN/fetch" --fetcher_cache_size="2GB"
--frameworks_home="" --gc_delay="1weeks" --gc_disk_headroom="0.1" --hadoop_home="" --help="false"
--hostname_lookup="true" --http_authenticators="basic" --http_command_executor="false" --http_credentials="/tmp/Endpoint_SlaveEndpointTest_NoAuthorizer_0_IzrbwN/http_credentials"
--image_provisioner_backend="copy" --initialize_driver_logging="true" --io_switchboard_enable_server="true"
--isolation="posix/cpu,posix/mem" --launcher="posix" --launcher_dir="/mesos/build/src" --logbufsecs="0"
--logging_level="INFO" --max_completed_executors_per_framework="150" --oversubscribed_resources_interval="15secs"
--perf_duration="10secs" --perf_interval="1mins" --qos_correction_interval_min="0ns" --quiet="false"
--recover="reconnect" --recovery_timeout="15mins" --registration_backoff_factor="10ms" --resources="cpus:2;gpus:0;mem:1024;disk:1024;ports:[31000-32000]"
--revocable_cpu_low_priority="true" --runtime_dir="/tmp/Endpoint_SlaveEndpointTest_NoAuthorizer_0_IzrbwN"
--sandbox_directory="/mnt/mesos/sandbox" --strict="true" --switch_user="true" --systemd_enable_support="true"
--systemd_runtime_directory="/run/systemd/system" --version="false" --work_dir="/tmp/Endpoint_SlaveEndpointTest_NoAuthorizer_0_O2nKPw"
I1202 07:15:11.159917 26727 credentials.hpp:86] Loading credential for authentication from
'/tmp/Endpoint_SlaveEndpointTest_NoAuthorizer_0_IzrbwN/credential'
I1202 07:15:11.159994 26727 slave.cpp:346] Agent using credential for: test-principal
I1202 07:15:11.160010 26727 credentials.hpp:37] Loading credentials for authentication from
'/tmp/Endpoint_SlaveEndpointTest_NoAuthorizer_0_IzrbwN/http_credentials'
I1202 07:15:11.160130 26727 http.cpp:922] Using default 'basic' HTTP authenticator for realm
'mesos-agent-readonly'
I1202 07:15:11.160169 26727 http.cpp:922] Using default 'basic' HTTP authenticator for realm
'mesos-agent-readwrite'
I1202 07:15:11.160491 26727 slave.cpp:533] Agent resources: cpus(*):2; mem(*):1024; disk(*):1024;
ports(*):[31000-32000]
I1202 07:15:11.160523 26727 slave.cpp:541] Agent attributes: [  ]
I1202 07:15:11.160528 26727 slave.cpp:546] Agent hostname: 1b9193698323
I1202 07:15:11.160848 26718 state.cpp:57] Recovering state from '/tmp/Endpoint_SlaveEndpointTest_NoAuthorizer_0_O2nKPw/meta'
I1202 07:15:11.161008 26722 status_update_manager.cpp:203] Recovering status update manager
I1202 07:15:11.161101 26722 containerizer.cpp:579] Recovering containerizer
I1202 07:15:11.161506 26727 provisioner.cpp:253] Provisioner recovery complete
I1202 07:15:11.161684 26720 slave.cpp:5414] Finished recovery
I1202 07:15:11.161975 26720 slave.cpp:5588] Querying resource estimator for oversubscribable
resources
I1202 07:15:11.162112 26715 slave.cpp:5602] Received oversubscribable resources {} from the
resource estimator
I1202 07:15:11.162626 26717 process.cpp:3679] Handling HTTP event for process 'slave(654)'
with path: '/slave(654)/monitor/statistics'
I1202 07:15:11.162950 26727 http.cpp:874] Authorizing principal 'test-principal' to GET the
'/monitor/statistics' endpoint
I1202 07:15:11.163924 26717 slave.cpp:790] Agent terminating
[       OK ] Endpoint/SlaveEndpointTest.NoAuthorizer/0 (9 ms)
[ RUN      ] Endpoint/SlaveEndpointTest.NoAuthorizer/1
I1202 07:15:11.171800 26714 containerizer.cpp:206] Using isolation: posix/cpu,posix/mem,filesystem/posix,network/cni
W1202 07:15:11.172107 26714 backend.cpp:76] Failed to create 'aufs' backend: AufsBackend requires
root privileges, but is running as user mesos
W1202 07:15:11.172178 26714 backend.cpp:76] Failed to create 'bind' backend: BindBackend requires
root privileges
I1202 07:15:11.172679 26714 cluster.cpp:435] Creating default 'local' authorizer
I1202 07:15:11.173053 26715 slave.cpp:208] Mesos agent started on (655)@172.17.0.2:55828
I1202 07:15:11.173068 26715 slave.cpp:209] Flags at startup: --acls="" --appc_simple_discovery_uri_prefix="http://"
--appc_store_dir="/tmp/mesos/store/appc" --authenticate_http_readonly="true" --authenticate_http_readwrite="true"
--authenticatee="crammd5" --authentication_backoff_factor="1secs" --authorizer="local" --cgroups_cpu_enable_pids_and_tids_count="false"
--cgroups_enable_cfs="false" --cgroups_hierarchy="/sys/fs/cgroup" --cgroups_limit_swap="false"
--cgroups_root="mesos" --container_disk_watch_interval="15secs" --containerizers="mesos" --credential="/tmp/Endpoint_SlaveEndpointTest_NoAuthorizer_1_4G6enS/credential"
--default_role="*" --disk_watch_interval="1mins" --docker="docker" --docker_kill_orphans="true"
--docker_registry="https://registry-1.docker.io" --docker_remove_delay="6hrs" --docker_socket="/var/run/docker.sock"
--docker_stop_timeout="0ns" --docker_store_dir="/tmp/mesos/store/docker" --docker_volume_checkpoint_dir="/var/run/mesos/isolators/docker/volume"
--enforce_container_disk_quota="false" --executor_registration_timeout="1mins" --executor_shutdown_grace_period="5secs"
--fetcher_cache_dir="/tmp/Endpoint_SlaveEndpointTest_NoAuthorizer_1_4G6enS/fetch" --fetcher_cache_size="2GB"
--frameworks_home="" --gc_delay="1weeks" --gc_disk_headroom="0.1" --hadoop_home="" --help="false"
--hostname_lookup="true" --http_authenticators="basic" --http_command_executor="false" --http_credentials="/tmp/Endpoint_SlaveEndpointTest_NoAuthorizer_1_4G6enS/http_credentials"
--image_provisioner_backend="copy" --initialize_driver_logging="true" --io_switchboard_enable_server="true"
--isolation="posix/cpu,posix/mem" --launcher="posix" --launcher_dir="/mesos/build/src" --logbufsecs="0"
--logging_level="INFO" --max_completed_executors_per_framework="150" --oversubscribed_resources_interval="15secs"
--perf_duration="10secs" --perf_interval="1mins" --qos_correction_interval_min="0ns" --quiet="false"
--recover="reconnect" --recovery_timeout="15mins" --registration_backoff_factor="10ms" --resources="cpus:2;gpus:0;mem:1024;disk:1024;ports:[31000-32000]"
--revocable_cpu_low_priority="true" --runtime_dir="/tmp/Endpoint_SlaveEndpointTest_NoAuthorizer_1_4G6enS"
--sandbox_directory="/mnt/mesos/sandbox" --strict="true" --switch_user="true" --systemd_enable_support="true"
--systemd_runtime_directory="/run/systemd/system" --version="false" --work_dir="/tmp/Endpoint_SlaveEndpointTest_NoAuthorizer_1_GGgAEB"
I1202 07:15:11.173387 26715 credentials.hpp:86] Loading credential for authentication from
'/tmp/Endpoint_SlaveEndpointTest_NoAuthorizer_1_4G6enS/credential'
I1202 07:15:11.173480 26715 slave.cpp:346] Agent using credential for: test-principal
I1202 07:15:11.173497 26715 credentials.hpp:37] Loading credentials for authentication from
'/tmp/Endpoint_SlaveEndpointTest_NoAuthorizer_1_4G6enS/http_credentials'
I1202 07:15:11.173614 26715 http.cpp:922] Using default 'basic' HTTP authenticator for realm
'mesos-agent-readonly'
I1202 07:15:11.173660 26715 http.cpp:922] Using default 'basic' HTTP authenticator for realm
'mesos-agent-readwrite'
I1202 07:15:11.174026 26715 slave.cpp:533] Agent resources: cpus(*):2; mem(*):1024; disk(*):1024;
ports(*):[31000-32000]
I1202 07:15:11.174058 26715 slave.cpp:541] Agent attributes: [  ]
I1202 07:15:11.174063 26715 slave.cpp:546] Agent hostname: 1b9193698323
I1202 07:15:11.174464 26727 state.cpp:57] Recovering state from '/tmp/Endpoint_SlaveEndpointTest_NoAuthorizer_1_GGgAEB/meta'
I1202 07:15:11.174604 26716 status_update_manager.cpp:203] Recovering status update manager
I1202 07:15:11.174778 26721 containerizer.cpp:579] Recovering containerizer
I1202 07:15:11.175235 26725 provisioner.cpp:253] Provisioner recovery complete
I1202 07:15:11.175365 26723 slave.cpp:5414] Finished recovery
I1202 07:15:11.175778 26723 slave.cpp:5588] Querying resource estimator for oversubscribable
resources
I1202 07:15:11.175992 26715 slave.cpp:5602] Received oversubscribable resources {} from the
resource estimator
I1202 07:15:11.176565 26719 process.cpp:3679] Handling HTTP event for process 'slave(655)'
with path: '/slave(655)/monitor/statistics.json'
I1202 07:15:11.176954 26718 http.cpp:874] Authorizing principal 'test-principal' to GET the
'/monitor/statistics.json' endpoint
I1202 07:15:11.178128 26714 slave.cpp:790] Agent terminating
[       OK ] Endpoint/SlaveEndpointTest.NoAuthorizer/1 (9 ms)
[ RUN      ] Endpoint/SlaveEndpointTest.NoAuthorizer/2
I1202 07:15:11.185048 26714 containerizer.cpp:206] Using isolation: posix/cpu,posix/mem,filesystem/posix,network/cni
W1202 07:15:11.185314 26714 backend.cpp:76] Failed to create 'aufs' backend: AufsBackend requires
root privileges, but is running as user mesos
W1202 07:15:11.185381 26714 backend.cpp:76] Failed to create 'bind' backend: BindBackend requires
root privileges
I1202 07:15:11.185845 26714 cluster.cpp:435] Creating default 'local' authorizer
I1202 07:15:11.186187 26725 slave.cpp:208] Mesos agent started on (656)@172.17.0.2:55828
I1202 07:15:11.186200 26725 slave.cpp:209] Flags at startup: --acls="" --appc_simple_discovery_uri_prefix="http://"
--appc_store_dir="/tmp/mesos/store/appc" --authenticate_http_readonly="true" --authenticate_http_readwrite="true"
--authenticatee="crammd5" --authentication_backoff_factor="1secs" --authorizer="local" --cgroups_cpu_enable_pids_and_tids_count="false"
--cgroups_enable_cfs="false" --cgroups_hierarchy="/sys/fs/cgroup" --cgroups_limit_swap="false"
--cgroups_root="mesos" --container_disk_watch_interval="15secs" --containerizers="mesos" --credential="/tmp/Endpoint_SlaveEndpointTest_NoAuthorizer_2_Q66YmX/credential"
--default_role="*" --disk_watch_interval="1mins" --docker="docker" --docker_kill_orphans="true"
--docker_registry="https://registry-1.docker.io" --docker_remove_delay="6hrs" --docker_socket="/var/run/docker.sock"
--docker_stop_timeout="0ns" --docker_store_dir="/tmp/mesos/store/docker" --docker_volume_checkpoint_dir="/var/run/mesos/isolators/docker/volume"
--enforce_container_disk_quota="false" --executor_registration_timeout="1mins" --executor_shutdown_grace_period="5secs"
--fetcher_cache_dir="/tmp/Endpoint_SlaveEndpointTest_NoAuthorizer_2_Q66YmX/fetch" --fetcher_cache_size="2GB"
--frameworks_home="" --gc_delay="1weeks" --gc_disk_headroom="0.1" --hadoop_home="" --help="false"
--hostname_lookup="true" --http_authenticators="basic" --http_command_executor="false" --http_credentials="/tmp/Endpoint_SlaveEndpointTest_NoAuthorizer_2_Q66YmX/http_credentials"
--image_provisioner_backend="copy" --initialize_driver_logging="true" --io_switchboard_enable_server="true"
--isolation="posix/cpu,posix/mem" --launcher="posix" --launcher_dir="/mesos/build/src" --logbufsecs="0"
--logging_level="INFO" --max_completed_executors_per_framework="150" --oversubscribed_resources_interval="15secs"
--perf_duration="10secs" --perf_interval="1mins" --qos_correction_interval_min="0ns" --quiet="false"
--recover="reconnect" --recovery_timeout="15mins" --registration_backoff_factor="10ms" --resources="cpus:2;gpus:0;mem:1024;disk:1024;ports:[31000-32000]"
--revocable_cpu_low_priority="true" --runtime_dir="/tmp/Endpoint_SlaveEndpointTest_NoAuthorizer_2_Q66YmX"
--sandbox_directory="/mnt/mesos/sandbox" --strict="true" --switch_user="true" --systemd_enable_support="true"
--systemd_runtime_directory="/run/systemd/system" --version="false" --work_dir="/tmp/Endpoint_SlaveEndpointTest_NoAuthorizer_2_GGgbCG"
I1202 07:15:11.186525 26725 credentials.hpp:86] Loading credential for authentication from
'/tmp/Endpoint_SlaveEndpointTest_NoAuthorizer_2_Q66YmX/credential'
I1202 07:15:11.186605 26725 slave.cpp:346] Agent using credential for: test-principal
I1202 07:15:11.186622 26725 credentials.hpp:37] Loading credentials for authentication from
'/tmp/Endpoint_SlaveEndpointTest_NoAuthorizer_2_Q66YmX/http_credentials'
I1202 07:15:11.186740 26725 http.cpp:922] Using default 'basic' HTTP authenticator for realm
'mesos-agent-readonly'
I1202 07:15:11.186851 26725 http.cpp:922] Using default 'basic' HTTP authenticator for realm
'mesos-agent-readwrite'
I1202 07:15:11.187142 26725 slave.cpp:533] Agent resources: cpus(*):2; mem(*):1024; disk(*):1024;
ports(*):[31000-32000]
I1202 07:15:11.187175 26725 slave.cpp:541] Agent attributes: [  ]
I1202 07:15:11.187185 26725 slave.cpp:546] Agent hostname: 1b9193698323
I1202 07:15:11.187492 26728 state.cpp:57] Recovering state from '/tmp/Endpoint_SlaveEndpointTest_NoAuthorizer_2_GGgbCG/meta'
I1202 07:15:11.187649 26721 status_update_manager.cpp:203] Recovering status update manager
I1202 07:15:11.187803 26727 containerizer.cpp:579] Recovering containerizer
I1202 07:15:11.188208 26730 provisioner.cpp:253] Provisioner recovery complete
I1202 07:15:11.188370 26727 slave.cpp:5414] Finished recovery
I1202 07:15:11.188658 26727 slave.cpp:5588] Querying resource estimator for oversubscribable
resources
I1202 07:15:11.188848 26719 slave.cpp:5602] Received oversubscribable resources {} from the
resource estimator
I1202 07:15:11.189949 26716 process.cpp:3679] Handling HTTP event for process 'slave(656)'
with path: '/slave(656)/containers'
I1202 07:15:11.190470 26724 http.cpp:874] Authorizing principal 'test-principal' to GET the
'/containers' endpoint
I1202 07:15:11.192071 26715 slave.cpp:790] Agent terminating
[       OK ] Endpoint/SlaveEndpointTest.NoAuthorizer/2 (11 ms)
[----------] 9 tests from Endpoint/SlaveEndpointTest (121 ms total)

[----------] Global test environment tear-down
[==========] 1357 tests from 153 test cases ran. (848366 ms total)
[  PASSED  ] 1357 tests.

  YOU HAVE 9 DISABLED TESTS

Inconsistency detected by ld.so: dl-close.c: 762: _dl_close: Assertion `map->l_init_called'
failed!
make[3]: *** [CMakeFiles/check] Error 127
make[3]: Leaving directory `/mesos/build'
make[2]: *** [CMakeFiles/check.dir/all] Error 2
make[2]: Leaving directory `/mesos/build'
make[1]: *** [CMakeFiles/check.dir/rule] Error 2
make[1]: Leaving directory `/mesos/build'
make: *** [check] Error 2
+ docker rmi mesos-1480658886-6724
Untagged: mesos-1480658886-6724:latest
Deleted: sha256:f661bdf9b718aaa15fe5716eba0b92303f86b2b1a10d5ef15f0e58b85a1184f9
Deleted: sha256:af1a461e46737685f33e4d5d5801ebaf97d93927bba8d9b0795583bd4679113d
Deleted: sha256:ddba740c6d7b5c4114eb3b5245dd76e6e2d6d811d316e41898286430a570421d
Deleted: sha256:baf73f4a57c48d7fdbf39b12314d8103d6b2ec9b82c0aa3520e9cc40beb3befb
Deleted: sha256:553a4ce3a615db5d90e554a7e4461e27bdeff37b4ab37d54ff786f81df5bade5
Deleted: sha256:6489c7260c533867605263aa0895349db0a419df2a4523568dc56cb5ab360603
Deleted: sha256:0924b17d67904630b5bb9d2d27e650399f378095186072cbe72fc667853e471b
Deleted: sha256:3cdfca5cbe7d2954bb010f538a5e24cbe2fc91233a5bb505dbf9a1647873bdf7
Deleted: sha256:830c8df0fdc96b8bad2e717fe227aa92bdb01e89fa24d626f756e04af06ff8a7
Deleted: sha256:00b2c5d23b2632380c56c81a889d0b277c743a4b815b509839b7e56a9da1ba24
Deleted: sha256:e1e23ace537715a7d0d7cc77d3726ee4ad14beceabff6a4b061e8ad955b7886b
Deleted: sha256:8419b1cf8a17c4038dccf8687f16ead9e378f664b163e1f415452b4e8634a756
Deleted: sha256:935e4addef4302849c2e7778fb46094b91cab6f04753e9db99dc5721c253ba05
Deleted: sha256:52b5bfaef1ba461fd2c4338a5e3fd39dcc1902b249f840a9b3789c31ba7dcc2f
Deleted: sha256:ccc766d29e262288042ac97816d4ba125a721464dd626cf99babcb575b6ee79d
Deleted: sha256:9243c329e76bc8064bd666751dd51e7d0ade59f5750a8e5c750d04d629fcd1a0
Deleted: sha256:485bff3c480f33beee45fe9c93193615c6340ded27676c9cddb1d4d651977b46
Deleted: sha256:8210f902a3b16358c6c7331842e8315d2106d33a8758afd0365ab4e5ba03856b
Deleted: sha256:116a7e8e257ea1ca66d977bb5dccf460cdd6fb6e2f7e6b73044f811dab62cc3a
Deleted: sha256:2e3c7143739c6957d4295ffb9022c57c444c77b77fd5397be84154a881086f0a
Deleted: sha256:5d6bf656915ed0cedbbca5a89fdce4f07d182affd81ab6ec07db70cd6b90a2b1
Deleted: sha256:3bad0d93432eb5d18745b61b0d1d5a946a9d18967c7225450d23225cbe466eaf
Deleted: sha256:a5a251909b60a7ba169d7584b5c10d88a2bc6c8a6b38c2941f45f8f5b0d4f338
Deleted: sha256:6a26dffb51a1fecd6b29a6ea44714b55cc138b47bece9e1c40b05aa38448946d
Build step 'Execute shell' marked build as failure

Mime
View raw message