mesos-builds mailing list archives

Site index · List index
Message view « Date » · « Thread »
Top « Date » · « Thread »
From Apache Jenkins Server <jenk...@builds.apache.org>
Subject Build failed in Jenkins: Mesos » cmake,gcc,--verbose --enable-libevent --enable-ssl,GLOG_v=1 MESOS_VERBOSE=1,ubuntu:14.04,(docker||Hadoop)&&(!ubuntu-us1)&&(!ubuntu-6)&&(!ubuntu-eu2) #3030
Date Sun, 11 Dec 2016 06:01:19 GMT
See <https://builds.apache.org/job/Mesos/BUILDTOOL=cmake,COMPILER=gcc,CONFIGURATION=--verbose%20--enable-libevent%20--enable-ssl,ENVIRONMENT=GLOG_v=1%20MESOS_VERBOSE=1,OS=ubuntu%3A14.04,label_exp=(docker%7C%7CHadoop)&&(!ubuntu-us1)&&(!ubuntu-6)&&(!ubuntu-eu2)/3030/changes>

Changes:

[alexr] Added comments around some health check limitations.

[alexr] Timed health check duration.

[vinodkone] Added agent API test for attaching input to a nested container session.

------------------------------------------
[...truncated 176096 lines...]
I1211 06:00:25.305299 27014 http.cpp:922] Using default 'basic' HTTP authenticator for realm
'mesos-agent-readwrite'
I1211 06:00:25.305582 27014 slave.cpp:534] Agent resources: cpus(*):2; mem(*):1024; disk(*):1024;
ports(*):[31000-32000]
I1211 06:00:25.305632 27014 slave.cpp:542] Agent attributes: [  ]
I1211 06:00:25.305640 27014 slave.cpp:547] Agent hostname: 52e1eb6eee8e
I1211 06:00:25.306015 27008 state.cpp:57] Recovering state from '/tmp/Endpoint_SlaveEndpointTest_AuthorizedRequest_0_ECSzs3/meta'
I1211 06:00:25.306318 27020 status_update_manager.cpp:203] Recovering status update manager
I1211 06:00:25.306782 27016 containerizer.cpp:594] Recovering containerizer
I1211 06:00:25.307919 27019 provisioner.cpp:253] Provisioner recovery complete
I1211 06:00:25.308229 27018 slave.cpp:5415] Finished recovery
I1211 06:00:25.308631 27018 slave.cpp:5589] Querying resource estimator for oversubscribable
resources
I1211 06:00:25.308935 27013 slave.cpp:5603] Received oversubscribable resources {} from the
resource estimator
I1211 06:00:25.309818 27017 process.cpp:3679] Handling HTTP event for process 'slave(660)'
with path: '/slave(660)/monitor/statistics'
I1211 06:00:25.310451 27010 http.cpp:874] Authorizing principal 'test-principal' to GET the
'/monitor/statistics' endpoint
I1211 06:00:25.312541 27015 slave.cpp:791] Agent terminating
I1211 06:00:25.318644 27007 containerizer.cpp:220] Using isolation: posix/cpu,posix/mem,filesystem/posix,network/cni
W1211 06:00:25.318997 27007 backend.cpp:76] Failed to create 'aufs' backend: AufsBackend requires
root privileges, but is running as user mesos
W1211 06:00:25.319085 27007 backend.cpp:76] Failed to create 'bind' backend: BindBackend requires
root privileges
I1211 06:00:25.320436 27012 slave.cpp:209] Mesos agent started on (661)@172.17.0.2:41459
I1211 06:00:25.320452 27012 slave.cpp:210] Flags at startup: --acls="" --appc_simple_discovery_uri_prefix="http://"
--appc_store_dir="/tmp/mesos/store/appc" --authenticate_http_readonly="true" --authenticate_http_readwrite="true"
--authenticatee="crammd5" --authentication_backoff_factor="1secs" --authorizer="local" --cgroups_cpu_enable_pids_and_tids_count="false"
--cgroups_enable_cfs="false" --cgroups_hierarchy="/sys/fs/cgroup" --cgroups_limit_swap="false"
--cgroups_root="mesos" --container_disk_watch_interval="15secs" --containerizers="mesos" --credential="/tmp/Endpoint_SlaveEndpointTest_AuthorizedRequest_1_JVHEfP/credential"
--default_role="*" --disk_watch_interval="1mins" --docker="docker" --docker_kill_orphans="true"
--docker_registry="https://registry-1.docker.io" --docker_remove_delay="6hrs" --docker_socket="/var/run/docker.sock"
--docker_stop_timeout="0ns" --docker_store_dir="/tmp/mesos/store/docker" --docker_volume_checkpoint_dir="/var/run/mesos/isolators/docker/volume"
--enforce_container_disk_quota="false" --executor_registration_timeout="1mins" --executor_shutdown_grace_period="5secs"
--fetcher_cache_dir="/tmp/Endpoint_SlaveEndpointTest_AuthorizedRequest_1_JVHEfP/fetch" --fetcher_cache_size="2GB"
--frameworks_home="" --gc_delay="1weeks" --gc_disk_headroom="0.1" --hadoop_home="" --help="false"
--hostname_lookup="true" --http_authenticators="basic" --http_command_executor="false" --http_credentials="/tmp/Endpoint_SlaveEndpointTest_AuthorizedRequest_1_JVHEfP/http_credentials"
--image_provisioner_backend="copy" --initialize_driver_logging="true" --io_switchboard_enable_server="true"
--isolation="posix/cpu,posix/mem" --launcher="posix" --launcher_dir="/mesos/build/src" --logbufsecs="0"
--logging_level="INFO" --max_completed_executors_per_framework="150" --oversubscribed_resources_interval="15secs"
--perf_duration="10secs" --perf_interval="1mins" --qos_correction_interval_min="0ns" --quiet="false"
--recover="reconnect" --recovery_timeout="15mins" --registration_backoff_factor="10ms" --resources="cpus:2;gpus:0;mem:1024;disk:1024;ports:[31000-32000]"
--revocable_cpu_low_priority="true" --runtime_dir="/tmp/Endpoint_SlaveEndpointTest_AuthorizedRequest_1_JVHEfP"
--sandbox_directory="/mnt/mesos/sandbox" --strict="true" --switch_user="true" --systemd_enable_support="true"
--systemd_runtime_directory="/run/systemd/system" --version="false" --work_dir="/tmp/Endpoint_SlaveEndpointTest_AuthorizedRequest_1_iQpBSg"
I1211 06:00:25.320866 27012 credentials.hpp:86] Loading credential for authentication from
'/tmp/Endpoint_SlaveEndpointTest_AuthorizedRequest_1_JVHEfP/credential'
I1211 06:00:25.320991 27012 slave.cpp:347] Agent using credential for: test-principal
I1211 06:00:25.321003 27012 credentials.hpp:37] Loading credentials for authentication from
'/tmp/Endpoint_SlaveEndpointTest_AuthorizedRequest_1_JVHEfP/http_credentials'
I1211 06:00:25.321113 27012 http.cpp:922] Using default 'basic' HTTP authenticator for realm
'mesos-agent-readonly'
I1211 06:00:25.321162 27012 http.cpp:922] Using default 'basic' HTTP authenticator for realm
'mesos-agent-readwrite'
I1211 06:00:25.321622 27012 slave.cpp:534] Agent resources: cpus(*):2; mem(*):1024; disk(*):1024;
ports(*):[31000-32000]
I1211 06:00:25.321660 27012 slave.cpp:542] Agent attributes: [  ]
I1211 06:00:25.321667 27012 slave.cpp:547] Agent hostname: 52e1eb6eee8e
I1211 06:00:25.322244 27011 state.cpp:57] Recovering state from '/tmp/Endpoint_SlaveEndpointTest_AuthorizedRequest_1_iQpBSg/meta'
I1211 06:00:25.322420 27010 status_update_manager.cpp:203] Recovering status update manager
I1211 06:00:25.322507 27010 containerizer.cpp:594] Recovering containerizer
I1211 06:00:25.323194 27018 provisioner.cpp:253] Provisioner recovery complete
I1211 06:00:25.323578 27011 slave.cpp:5415] Finished recovery
I1211 06:00:25.323994 27011 slave.cpp:5589] Querying resource estimator for oversubscribable
resources
I1211 06:00:25.324196 27021 slave.cpp:5603] Received oversubscribable resources {} from the
resource estimator
I1211 06:00:25.325044 27012 process.cpp:3679] Handling HTTP event for process 'slave(661)'
with path: '/slave(661)/monitor/statistics.json'
I1211 06:00:25.325623 27013 http.cpp:874] Authorizing principal 'test-principal' to GET the
'/monitor/statistics.json' endpoint
I1211 06:00:25.328493 27007 slave.cpp:791] Agent terminating
I1211 06:00:25.334314 27007 containerizer.cpp:220] Using isolation: posix/cpu,posix/mem,filesystem/posix,network/cni
W1211 06:00:25.334677 27007 backend.cpp:76] Failed to create 'aufs' backend: AufsBackend requires
root privileges, but is running as user mesos
W1211 06:00:25.334765 27007 backend.cpp:76] Failed to create 'bind' backend: BindBackend requires
root privileges
I1211 06:00:25.336192 27008 slave.cpp:209] Mesos agent started on (662)@172.17.0.2:41459
I1211 06:00:25.336210 27008 slave.cpp:210] Flags at startup: --acls="" --appc_simple_discovery_uri_prefix="http://"
--appc_store_dir="/tmp/mesos/store/appc" --authenticate_http_readonly="true" --authenticate_http_readwrite="true"
--authenticatee="crammd5" --authentication_backoff_factor="1secs" --authorizer="local" --cgroups_cpu_enable_pids_and_tids_count="false"
--cgroups_enable_cfs="false" --cgroups_hierarchy="/sys/fs/cgroup" --cgroups_limit_swap="false"
--cgroups_root="mesos" --container_disk_watch_interval="15secs" --containerizers="mesos" --credential="/tmp/Endpoint_SlaveEndpointTest_AuthorizedRequest_2_155mS2/credential"
--default_role="*" --disk_watch_interval="1mins" --docker="docker" --docker_kill_orphans="true"
--docker_registry="https://registry-1.docker.io" --docker_remove_delay="6hrs" --docker_socket="/var/run/docker.sock"
--docker_stop_timeout="0ns" --docker_store_dir="/tmp/mesos/store/docker" --docker_volume_checkpoint_dir="/var/run/mesos/isolators/docker/volume"
--enforce_container_disk_quota="false" --executor_registration_timeout="1mins" --executor_shutdown_grace_period="5secs"
--fetcher_cache_dir="/tmp/Endpoint_SlaveEndpointTest_AuthorizedRequest_2_155mS2/fetch" --fetcher_cache_size="2GB"
--frameworks_home="" --gc_delay="1weeks" --gc_disk_headroom="0.1" --hadoop_home="" --help="false"
--hostname_lookup="true" --http_authenticators="basic" --http_command_executor="false" --http_credentials="/tmp/Endpoint_SlaveEndpointTest_AuthorizedRequest_2_155mS2/http_credentials"
--image_provisioner_backend="copy" --initialize_driver_logging="true" --io_switchboard_enable_server="true"
--isolation="posix/cpu,posix/mem" --launcher="posix" --launcher_dir="/mesos/build/src" --logbufsecs="0"
--logging_level="INFO" --max_completed_executors_per_framework="150" --oversubscribed_resources_interval="15secs"
--perf_duration="10secs" --perf_interval="1mins" --qos_correction_interval_min="0ns" --quiet="false"
--recover="reconnect" --recovery_timeout="15mins" --registration_backoff_factor="10ms" --resources="cpus:2;gpus:0;mem:1024;disk:1024;ports:[31000-32000]"
--revocable_cpu_low_priority="true" --runtime_dir="/tmp/Endpoint_SlaveEndpointTest_AuthorizedRequest_2_155mS2"
--sandbox_directory="/mnt/mesos/sandbox" --strict="true" --switch_user="true" --systemd_enable_support="true"
--systemd_runtime_directory="/run/systemd/system" --version="false" --work_dir="/tmp/Endpoint_SlaveEndpointTest_AuthorizedRequest_2_Mk5Lsu"
I1211 06:00:25.336583 27008 credentials.hpp:86] Loading credential for authentication from
'/tmp/Endpoint_SlaveEndpointTest_AuthorizedRequest_2_155mS2/credential'
I1211 06:00:25.336679 27008 slave.cpp:347] Agent using credential for: test-principal
I1211 06:00:25.336693 27008 credentials.hpp:37] Loading credentials for authentication from
'/tmp/Endpoint_SlaveEndpointTest_AuthorizedRequest_2_155mS2/http_credentials'
I1211 06:00:25.336805 27008 http.cpp:922] Using default 'basic' HTTP authenticator for realm
'mesos-agent-readonly'
I1211 06:00:25.336855 27008 http.cpp:922] Using default 'basic' HTTP authenticator for realm
'mesos-agent-readwrite'
I1211 06:00:25.337203 27008 slave.cpp:534] Agent resources: cpus(*):2; mem(*):1024; disk(*):1024;
ports(*):[31000-32000]
I1211 06:00:25.337240 27008 slave.cpp:542] Agent attributes: [  ]
I1211 06:00:25.337247 27008 slave.cpp:547] Agent hostname: 52e1eb6eee8e
I1211 06:00:25.337698 27013 state.cpp:57] Recovering state from '/tmp/Endpoint_SlaveEndpointTest_AuthorizedRequest_2_Mk5Lsu/meta'
I1211 06:00:25.337877 27008 status_update_manager.cpp:203] Recovering status update manager
I1211 06:00:25.337990 27015 containerizer.cpp:594] Recovering containerizer
I1211 06:00:25.339098 27016 provisioner.cpp:253] Provisioner recovery complete
I1211 06:00:25.339426 27019 slave.cpp:5415] Finished recovery
I1211 06:00:25.339828 27019 slave.cpp:5589] Querying resource estimator for oversubscribable
resources
I1211 06:00:25.340394 27020 slave.cpp:5603] Received oversubscribable resources {} from the
resource estimator
I1211 06:00:25.341126 27017 process.cpp:3679] Handling HTTP event for process 'slave(662)'
with path: '/slave(662)/containers'
I1211 06:00:25.341866 27023 http.cpp:874] Authorizing principal 'test-principal' to GET the
'/containers' endpoint
I1211 06:00:25.343541 27013 slave.cpp:791] Agent terminating
I1211 06:00:25.349252 27007 containerizer.cpp:220] Using isolation: posix/cpu,posix/mem,filesystem/posix,network/cni
W1211 06:00:25.349607 27007 backend.cpp:76] Failed to create 'aufs' backend: AufsBackend requires
root privileges, but is running as user mesos
W1211 06:00:25.349689 27007 backend.cpp:76] Failed to create 'bind' backend: BindBackend requires
root privileges
I1211 06:00:25.351019 27021 slave.cpp:209] Mesos agent started on (663)@172.17.0.2:41459
I1211 06:00:25.351037 27021 slave.cpp:210] Flags at startup: --acls="" --appc_simple_discovery_uri_prefix="http://"
--appc_store_dir="/tmp/mesos/store/appc" --authenticate_http_readonly="true" --authenticate_http_readwrite="true"
--authenticatee="crammd5" --authentication_backoff_factor="1secs" --authorizer="local" --cgroups_cpu_enable_pids_and_tids_count="false"
--cgroups_enable_cfs="false" --cgroups_hierarchy="/sys/fs/cgroup" --cgroups_limit_swap="false"
--cgroups_root="mesos" --container_disk_watch_interval="15secs" --containerizers="mesos" --credential="/tmp/Endpoint_SlaveEndpointTest_UnauthorizedRequest_0_ZM4UEg/credential"
--default_role="*" --disk_watch_interval="1mins" --docker="docker" --docker_kill_orphans="true"
--docker_registry="https://registry-1.docker.io" --docker_remove_delay="6hrs" --docker_socket="/var/run/docker.sock"
--docker_stop_timeout="0ns" --docker_store_dir="/tmp/mesos/store/docker" --docker_volume_checkpoint_dir="/var/run/mesos/isolators/docker/volume"
--enforce_container_disk_quota="false" --executor_registration_timeout="1mins" --executor_shutdown_grace_period="5secs"
--fetcher_cache_dir="/tmp/Endpoint_SlaveEndpointTest_UnauthorizedRequest_0_ZM4UEg/fetch" --fetcher_cache_size="2GB"
--frameworks_home="" --gc_delay="1weeks" --gc_disk_headroom="0.1" --hadoop_home="" --help="false"
--hostname_lookup="true" --http_authenticators="basic" --http_command_executor="false" --http_credentials="/tmp/Endpoint_SlaveEndpointTest_UnauthorizedRequest_0_ZM4UEg/http_credentials"
--image_provisioner_backend="copy" --initialize_driver_logging="true" --io_switchboard_enable_server="true"
--isolation="posix/cpu,posix/mem" --launcher="posix" --launcher_dir="/mesos/build/src" --logbufsecs="0"
--logging_level="INFO" --max_completed_executors_per_framework="150" --oversubscribed_resources_interval="15secs"
--perf_duration="10secs" --perf_interval="1mins" --qos_correction_interval_min="0ns" --quiet="false"
--recover=[       OK ] Endpoint/SlaveEndpointTest.NoAuthorizer/2 (11969 ms)
[----------] 9 tests from Endpoint/SlaveEndpointTest (12092 ms total)

[----------] Global test environment tear-down
[==========] 1378 tests from 158 test cases ran. (233810 ms total)
[  PASSED  ] 1376 tests.
[  FAILED  ] 2 tests, listed below:
[  FAILED  ] ContainerLoggerTest.LOGROTATE_RotateInSandbox
[  FAILED  ] SlaveAuthorizerTest/0.ViewFlags, where TypeParam = mesos::internal::tests::Module<mesos::Authorizer,
(mesos::internal::tests::ModuleID)8>

 2 FAILED TESTS
  YOU HAVE 9 DISABLED TESTS

make[3]: Leaving directory `/mesos/build'
make[2]: Leaving directory `/mesos/build'
make[1]: Leaving directory `/mesos/build'
"reconnect" --recovery_timeout="15mins" --registration_backoff_factor="10ms" --resources="cpus:2;gpus:0;mem:1024;disk:1024;ports:[31000-32000]"
--revocable_cpu_low_priority="true" --runtime_dir="/tmp/Endpoint_SlaveEndpointTest_UnauthorizedRequest_0_ZM4UEg"
--sandbox_directory="/mnt/mesos/sandbox" --strict="true" --switch_user="true" --systemd_enable_support="true"
--systemd_runtime_directory="/run/systemd/system" --version="false" --work_dir="/tmp/Endpoint_SlaveEndpointTest_UnauthorizedRequest_0_0c7TcI"
I1211 06:00:25.351461 27021 credentials.hpp:86] Loading credential for authentication from
'/tmp/Endpoint_SlaveEndpointTest_UnauthorizedRequest_0_ZM4UEg/credential'
I1211 06:00:25.351555 27021 slave.cpp:347] Agent using credential for: test-principal
I1211 06:00:25.351567 27021 credentials.hpp:37] Loading credentials for authentication from
'/tmp/Endpoint_SlaveEndpointTest_UnauthorizedRequest_0_ZM4UEg/http_credentials'
I1211 06:00:25.351675 27021 http.cpp:922] Using default 'basic' HTTP authenticator for realm
'mesos-agent-readonly'
I1211 06:00:25.351717 27021 http.cpp:922] Using default 'basic' HTTP authenticator for realm
'mesos-agent-readwrite'
I1211 06:00:25.352064 27021 slave.cpp:534] Agent resources: cpus(*):2; mem(*):1024; disk(*):1024;
ports(*):[31000-32000]
I1211 06:00:25.352102 27021 slave.cpp:542] Agent attributes: [  ]
I1211 06:00:25.352110 27021 slave.cpp:547] Agent hostname: 52e1eb6eee8e
I1211 06:00:25.352651 27021 state.cpp:57] Recovering state from '/tmp/Endpoint_SlaveEndpointTest_UnauthorizedRequest_0_0c7TcI/meta'
I1211 06:00:25.352866 27017 status_update_manager.cpp:203] Recovering status update manager
I1211 06:00:25.352959 27017 containerizer.cpp:594] Recovering containerizer
I1211 06:00:25.353752 27012 provisioner.cpp:253] Provisioner recovery complete
I1211 06:00:25.354001 27012 slave.cpp:5415] Finished recovery
I1211 06:00:25.354427 27012 slave.cpp:5589] Querying resource estimator for oversubscribable
resources
I1211 06:00:25.354696 27010 slave.cpp:5603] Received oversubscribable resources {} from the
resource estimator
I1211 06:00:25.355741 27018 process.cpp:3679] Handling HTTP event for process 'slave(663)'
with path: '/slave(663)/monitor/statistics'
I1211 06:00:25.356333 27011 http.cpp:874] Authorizing principal 'test-principal' to GET the
'/monitor/statistics' endpoint
I1211 06:00:25.358260 27007 slave.cpp:791] Agent terminating
I1211 06:00:25.364300 27007 containerizer.cpp:220] Using isolation: posix/cpu,posix/mem,filesystem/posix,network/cni
W1211 06:00:25.364651 27007 backend.cpp:76] Failed to create 'aufs' backend: AufsBackend requires
root privileges, but is running as user mesos
W1211 06:00:25.364740 27007 backend.cpp:76] Failed to create 'bind' backend: BindBackend requires
root privileges
I1211 06:00:25.366010 27017 slave.cpp:209] Mesos agent started on (664)@172.17.0.2:41459
I1211 06:00:25.366029 27017 slave.cpp:210] Flags at startup: --acls="" --appc_simple_discovery_uri_prefix="http://"
--appc_store_dir="/tmp/mesos/store/appc" --authenticate_http_readonly="true" --authenticate_http_readwrite="true"
--authenticatee="crammd5" --authentication_backoff_factor="1secs" --authorizer="local" --cgroups_cpu_enable_pids_and_tids_count="false"
--cgroups_enable_cfs="false" --cgroups_hierarchy="/sys/fs/cgroup" --cgroups_limit_swap="false"
--cgroups_root="mesos" --container_disk_watch_interval="15secs" --containerizers="mesos" --credential="/tmp/Endpoint_SlaveEndpointTest_UnauthorizedRequest_1_73eaBu/credential"
--default_role="*" --disk_watch_interval="1mins" --docker="docker" --docker_kill_orphans="true"
--docker_registry="https://registry-1.docker.io" --docker_remove_delay="6hrs" --docker_socket="/var/run/docker.sock"
--docker_stop_timeout="0ns" --docker_store_dir="/tmp/mesos/store/docker" --docker_volume_checkpoint_dir="/var/run/mesos/isolators/docker/volume"
--enforce_container_disk_quota="false" --executor_registration_timeout="1mins" --executor_shutdown_grace_period="5secs"
--fetcher_cache_dir="/tmp/Endpoint_SlaveEndpointTest_UnauthorizedRequest_1_73eaBu/fetch" --fetcher_cache_size="2GB"
--frameworks_home="" --gc_delay="1weeks" --gc_disk_headroom="0.1" --hadoop_home="" --help="false"
--hostname_lookup="true" --http_authenticators="basic" --http_command_executor="false" --http_credentials="/tmp/Endpoint_SlaveEndpointTest_UnauthorizedRequest_1_73eaBu/http_credentials"
--image_provisioner_backend="copy" --initialize_driver_logging="true" --io_switchboard_enable_server="true"
--isolation="posix/cpu,posix/mem" --launcher="posix" --launcher_dir="/mesos/build/src" --logbufsecs="0"
--logging_level="INFO" --max_completed_executors_per_framework="150" --oversubscribed_resources_interval="15secs"
--perf_duration="10secs" --perf_interval="1mins" --qos_correction_interval_min="0ns" --quiet="false"
--recover="reconnect" --recovery_timeout="15mins" --registration_backoff_factor="10ms" --resources="cpus:2;gpus:0;mem:1024;disk:1024;ports:[31000-32000]"
--revocable_cpu_low_priority="true" --runtime_dir="/tmp/Endpoint_SlaveEndpointTest_UnauthorizedRequest_1_73eaBu"
--sandbox_directory="/mnt/mesos/sandbox" --strict="true" --switch_user="true" --systemd_enable_support="true"
--systemd_runtime_directory="/run/systemd/system" --version="false" --work_dir="/tmp/Endpoint_SlaveEndpointTest_UnauthorizedRequest_1_enJH6V"
I1211 06:00:25.366437 27017 credentials.hpp:86] Loading credential for authentication from
'/tmp/Endpoint_SlaveEndpointTest_UnauthorizedRequest_1_73eaBu/credential'
I1211 06:00:25.366530 27017 slave.cpp:347] Agent using credential for: test-principal
I1211 06:00:25.366544 27017 credentials.hpp:37] Loading credentials for authentication from
'/tmp/Endpoint_SlaveEndpointTest_UnauthorizedRequest_1_73eaBu/http_credentials'
I1211 06:00:25.366650 27017 http.cpp:922] Using default 'basic' HTTP authenticator for realm
'mesos-agent-readonly'
I1211 06:00:25.366695 27017 http.cpp:922] Using default 'basic' HTTP authenticator for realm
'mesos-agent-readwrite'
I1211 06:00:25.367069 27017 slave.cpp:534] Agent resources: cpus(*):2; mem(*):1024; disk(*):1024;
ports(*):[31000-32000]
I1211 06:00:25.367106 27017 slave.cpp:542] Agent attributes: [  ]
I1211 06:00:25.367113 27017 slave.cpp:547] Agent hostname: 52e1eb6eee8e
I1211 06:00:25.367763 27018 state.cpp:57] Recovering state from '/tmp/Endpoint_SlaveEndpointTest_UnauthorizedRequest_1_enJH6V/meta'
I1211 06:00:25.367949 27017 status_update_manager.cpp:203] Recovering status update manager
I1211 06:00:25.368055 27013 containerizer.cpp:594] Recovering containerizer
I1211 06:00:25.368854 27020 provisioner.cpp:253] Provisioner recovery complete
I1211 06:00:25.369189 27013 slave.cpp:5415] Finished recovery
I1211 06:00:25.369603 27013 slave.cpp:5589] Querying resource estimator for oversubscribable
resources
I1211 06:00:25.369729 27017 slave.cpp:5603] Received oversubscribable resources {} from the
resource estimator
I1211 06:00:25.370465 27013 process.cpp:3679] Handling HTTP event for process 'slave(664)'
with path: '/slave(664)/monitor/statistics.json'
I1211 06:00:25.370954 27012 http.cpp:874] Authorizing principal 'test-principal' to GET the
'/monitor/statistics.json' endpoint
I1211 06:00:25.372690 27015 slave.cpp:791] Agent terminating
I1211 06:00:25.378583 27007 containerizer.cpp:220] Using isolation: posix/cpu,posix/mem,filesystem/posix,network/cni
W1211 06:00:25.378937 27007 backend.cpp:76] Failed to create 'aufs' backend: AufsBackend requires
root privileges, but is running as user mesos
W1211 06:00:25.379035 27007 backend.cpp:76] Failed to create 'bind' backend: BindBackend requires
root privileges
I1211 06:00:25.380774 27012 slave.cpp:209] Mesos agent started on (665)@172.17.0.2:41459
I1211 06:00:25.380790 27012 slave.cpp:210] Flags at startup: --acls="" --appc_simple_discovery_uri_prefix="http://"
--appc_store_dir="/tmp/mesos/store/appc" --authenticate_http_readonly="true" --authenticate_http_readwrite="true"
--authenticatee="crammd5" --authentication_backoff_factor="1secs" --authorizer="local" --cgroups_cpu_enable_pids_and_tids_count="false"
--cgroups_enable_cfs="false" --cgroups_hierarchy="/sys/fs/cgroup" --cgroups_limit_swap="false"
--cgroups_root="mesos" --container_disk_watch_interval="15secs" --containerizers="mesos" --credential="/tmp/Endpoint_SlaveEndpointTest_UnauthorizedRequest_2_3nAQGI/credential"
--default_role="*" --disk_watch_interval="1mins" --docker="docker" --docker_kill_orphans="true"
--docker_registry="https://registry-1.docker.io" --docker_remove_delay="6hrs" --docker_socket="/var/run/docker.sock"
--docker_stop_timeout="0ns" --docker_store_dir="/tmp/mesos/store/docker" --docker_volume_checkpoint_dir="/var/run/mesos/isolators/docker/volume"
--enforce_container_disk_quota="false" --executor_registration_timeout="1mins" --executor_shutdown_grace_period="5secs"
--fetcher_cache_dir="/tmp/Endpoint_SlaveEndpointTest_UnauthorizedRequest_2_3nAQGI/fetch" --fetcher_cache_size="2GB"
--frameworks_home="" --gc_delay="1weeks" --gc_disk_headroom="0.1" --hadoop_home="" --help="false"
--hostname_lookup="true" --http_authenticators="basic" --http_command_executor="false" --http_credentials="/tmp/Endpoint_SlaveEndpointTest_UnauthorizedRequest_2_3nAQGI/http_credentials"
--image_provisioner_backend="copy" --initialize_driver_logging="true" --io_switchboard_enable_server="true"
--isolation="posix/cpu,posix/mem" --launcher="posix" --launcher_dir="/mesos/build/src" --logbufsecs="0"
--logging_level="INFO" --max_completed_executors_per_framework="150" --oversubscribed_resources_interval="15secs"
--perf_duration="10secs" --perf_interval="1mins" --qos_correction_interval_min="0ns" --quiet="false"
--recover="reconnect" --recovery_timeout="15mins" --registration_backoff_factor="10ms" --resources="cpus:2;gpus:0;mem:1024;disk:1024;ports:[31000-32000]"
--revocable_cpu_low_priority="true" --runtime_dir="/tmp/Endpoint_SlaveEndpointTest_UnauthorizedRequest_2_3nAQGI"
--sandbox_directory="/mnt/mesos/sandbox" --strict="true" --switch_user="true" --systemd_enable_support="true"
--systemd_runtime_directory="/run/systemd/system" --version="false" --work_dir="/tmp/Endpoint_SlaveEndpointTest_UnauthorizedRequest_2_Yh6399"
I1211 06:00:25.381161 27012 credentials.hpp:86] Loading credential for authentication from
'/tmp/Endpoint_SlaveEndpointTest_UnauthorizedRequest_2_3nAQGI/credential'
I1211 06:00:25.381253 27012 slave.cpp:347] Agent using credential for: test-principal
I1211 06:00:25.381264 27012 credentials.hpp:37] Loading credentials for authentication from
'/tmp/Endpoint_SlaveEndpointTest_UnauthorizedRequest_2_3nAQGI/http_credentials'
I1211 06:00:25.381371 27012 http.cpp:922] Using default 'basic' HTTP authenticator for realm
'mesos-agent-readonly'
I1211 06:00:25.381414 27012 http.cpp:922] Using default 'basic' HTTP authenticator for realm
'mesos-agent-readwrite'
I1211 06:00:25.381744 27012 slave.cpp:534] Agent resources: cpus(*):2; mem(*):1024; disk(*):1024;
ports(*):[31000-32000]
I1211 06:00:25.381793 27012 slave.cpp:542] Agent attributes: [  ]
I1211 06:00:25.381800 27012 slave.cpp:547] Agent hostname: 52e1eb6eee8e
I1211 06:00:25.382246 27012 state.cpp:57] Recovering state from '/tmp/Endpoint_SlaveEndpointTest_UnauthorizedRequest_2_Yh6399/meta'
I1211 06:00:25.382519 27016 status_update_manager.cpp:203] Recovering status update manager
I1211 06:00:25.382685 27010 containerizer.cpp:594] Recovering containerizer
I1211 06:00:25.383657 27020 provisioner.cpp:253] Provisioner recovery complete
I1211 06:00:25.383952 27018 slave.cpp:5415] Finished recovery
I1211 06:00:25.384399 27018 slave.cpp:5589] Querying resource estimator for oversubscribable
resources
I1211 06:00:25.384500 27018 slave.cpp:5603] Received oversubscribable resources {} from the
resource estimator
I1211 06:00:25.385370 27017 process.cpp:3679] Handling HTTP event for process 'slave(665)'
with path: '/slave(665)/containers'
I1211 06:00:25.386014 27013 http.cpp:874] Authorizing principal 'test-principal' to GET the
'/containers' endpoint
I1211 06:00:25.387429 27008 slave.cpp:791] Agent terminating
I1211 06:00:25.393354 27007 containerizer.cpp:220] Using isolation: posix/cpu,posix/mem,filesystem/posix,network/cni
W1211 06:00:25.393707 27007 backend.cpp:76] Failed to create 'aufs' backend: AufsBackend requires
root privileges, but is running as user mesos
W1211 06:00:25.393832 27007 backend.cpp:76] Failed to create 'bind' backend: BindBackend requires
root privileges
I1211 06:00:25.394554 27007 cluster.cpp:446] Creating default 'local' authorizer
I1211 06:00:25.395130 27010 slave.cpp:209] Mesos agent started on (666)@172.17.0.2:41459
I1211 06:00:25.395145 27010 slave.cpp:210] Flags at startup: --acls="" --appc_simple_discovery_uri_prefix="http://"
--appc_store_dir="/tmp/mesos/store/appc" --authenticate_http_readonly="true" --authenticate_http_readwrite="true"
--authenticatee="crammd5" --authentication_backoff_factor="1secs" --authorizer="local" --cgroups_cpu_enable_pids_and_tids_count="false"
--cgroups_enable_cfs="false" --cgroups_hierarchy="/sys/fs/cgroup" --cgroups_limit_swap="false"
--cgroups_root="mesos" --container_disk_watch_interval="15secs" --containerizers="mesos" --credential="/tmp/Endpoint_SlaveEndpointTest_NoAuthorizer_0_T6C5VW/credential"
--default_role="*" --disk_watch_interval="1mins" --docker="docker" --docker_kill_orphans="true"
--docker_registry="https://registry-1.docker.io" --docker_remove_delay="6hrs" --docker_socket="/var/run/docker.sock"
--docker_stop_timeout="0ns" --docker_store_dir="/tmp/mesos/store/docker" --docker_volume_checkpoint_dir="/var/run/mesos/isolators/docker/volume"
--enforce_container_disk_quota="false" --executor_registration_timeout="1mins" --executor_shutdown_grace_period="5secs"
--fetcher_cache_dir="/tmp/Endpoint_SlaveEndpointTest_NoAuthorizer_0_T6C5VW/fetch" --fetcher_cache_size="2GB"
--frameworks_home="" --gc_delay="1weeks" --gc_disk_headroom="0.1" --hadoop_home="" --help="false"
--hostname_lookup="true" --http_authenticators="basic" --http_command_executor="false" --http_credentials="/tmp/Endpoint_SlaveEndpointTest_NoAuthorizer_0_T6C5VW/http_credentials"
--image_provisioner_backend="copy" --initialize_driver_logging="true" --io_switchboard_enable_server="true"
--isolation="posix/cpu,posix/mem" --launcher="posix" --launcher_dir="/mesos/build/src" --logbufsecs="0"
--logging_level="INFO" --max_completed_executors_per_framework="150" --oversubscribed_resources_interval="15secs"
--perf_duration="10secs" --perf_interval="1mins" --qos_correction_interval_min="0ns" --quiet="false"
--recover="reconnect" --recovery_timeout="15mins" --registration_backoff_factor="10ms" --resources="cpus:2;gpus:0;mem:1024;disk:1024;ports:[31000-32000]"
--revocable_cpu_low_priority="true" --runtime_dir="/tmp/Endpoint_SlaveEndpointTest_NoAuthorizer_0_T6C5VW"
--sandbox_directory="/mnt/mesos/sandbox" --strict="true" --switch_user="true" --systemd_enable_support="true"
--systemd_runtime_directory="/run/systemd/system" --version="false" --work_dir="/tmp/Endpoint_SlaveEndpointTest_NoAuthorizer_0_8KxVmo"
I1211 06:00:25.395612 27010 credentials.hpp:86] Loading credential for authentication from
'/tmp/Endpoint_SlaveEndpointTest_NoAuthorizer_0_T6C5VW/credential'
I1211 06:00:25.395709 27010 slave.cpp:347] Agent using credential for: test-principal
I1211 06:00:25.395721 27010 credentials.hpp:37] Loading credentials for authentication from
'/tmp/Endpoint_SlaveEndpointTest_NoAuthorizer_0_T6C5VW/http_credentials'
I1211 06:00:25.395830 27010 http.cpp:922] Using default 'basic' HTTP authenticator for realm
'mesos-agent-readonly'
I1211 06:00:25.395875 27010 http.cpp:922] Using default 'basic' HTTP authenticator for realm
'mesos-agent-readwrite'
I1211 06:00:25.396248 27010 slave.cpp:534] Agent resources: cpus(*):2; mem(*):1024; disk(*):1024;
ports(*):[31000-32000]
I1211 06:00:25.396286 27010 slave.cpp:542] Agent attributes: [  ]
I1211 06:00:25.396294 27010 slave.cpp:547] Agent hostname: 52e1eb6eee8e
I1211 06:00:25.396754 27012 state.cpp:57] Recovering state from '/tmp/Endpoint_SlaveEndpointTest_NoAuthorizer_0_8KxVmo/meta'
I1211 06:00:25.396935 27021 status_update_manager.cpp:203] Recovering status update manager
I1211 06:00:25.397120 27023 containerizer.cpp:594] Recovering containerizer
I1211 06:00:25.397889 27020 provisioner.cpp:253] Provisioner recovery complete
I1211 06:00:25.398191 27008 slave.cpp:5415] Finished recovery
I1211 06:00:25.398594 27008 slave.cpp:5589] Querying resource estimator for oversubscribable
resources
I1211 06:00:25.398712 27020 slave.cpp:5603] Received oversubscribable resources {} from the
resource estimator
I1211 06:00:25.399510 27008 process.cpp:3679] Handling HTTP event for process 'slave(666)'
with path: '/slave(666)/monitor/statistics'
I1211 06:00:25.400269 27013 http.cpp:874] Authorizing principal 'test-principal' to GET the
'/monitor/statistics' endpoint
I1211 06:00:25.403606 27016 slave.cpp:791] Agent terminating
I1211 06:00:25.410322 27007 containerizer.cpp:220] Using isolation: posix/cpu,posix/mem,filesystem/posix,network/cni
W1211 06:00:25.410675 27007 backend.cpp:76] Failed to create 'aufs' backend: AufsBackend requires
root privileges, but is running as user mesos
W1211 06:00:25.410759 27007 backend.cpp:76] Failed to create 'bind' backend: BindBackend requires
root privileges
I1211 06:00:25.411804 27007 cluster.cpp:446] Creating default 'local' authorizer
I1211 06:00:25.412277 27012 slave.cpp:209] Mesos agent started on (667)@172.17.0.2:41459
I1211 06:00:25.412292 27012 slave.cpp:210] Flags at startup: --acls="" --appc_simple_discovery_uri_prefix="http://"
--appc_store_dir="/tmp/mesos/store/appc" --authenticate_http_readonly="true" --authenticate_http_readwrite="true"
--authenticatee="crammd5" --authentication_backoff_factor="1secs" --authorizer="local" --cgroups_cpu_enable_pids_and_tids_count="false"
--cgroups_enable_cfs="false" --cgroups_hierarchy="/sys/fs/cgroup" --cgroups_limit_swap="false"
--cgroups_root="mesos" --container_disk_watch_interval="15secs" --containerizers="mesos" --credential="/tmp/Endpoint_SlaveEndpointTest_NoAuthorizer_1_ztjUlb/credential"
--default_role="*" --disk_watch_interval="1mins" --docker="docker" --docker_kill_orphans="true"
--docker_registry="https://registry-1.docker.io" --docker_remove_delay="6hrs" --docker_socket="/var/run/docker.sock"
--docker_stop_timeout="0ns" --docker_store_dir="/tmp/mesos/store/docker" --docker_volume_checkpoint_dir="/var/run/mesos/isolators/docker/volume"
--enforce_container_disk_quota="false" --executor_registration_timeout="1mins" --executor_shutdown_grace_period="5secs"
--fetcher_cache_dir="/tmp/Endpoint_SlaveEndpointTest_NoAuthorizer_1_ztjUlb/fetch" --fetcher_cache_size="2GB"
--frameworks_home="" --gc_delay="1weeks" --gc_disk_headroom="0.1" --hadoop_home="" --help="false"
--hostname_lookup="true" --http_authenticators="basic" --http_command_executor="false" --http_credentials="/tmp/Endpoint_SlaveEndpointTest_NoAuthorizer_1_ztjUlb/http_credentials"
--image_provisioner_backend="copy" --initialize_driver_logging="true" --io_switchboard_enable_server="true"
--isolation="posix/cpu,posix/mem" --launcher="posix" --launcher_dir="/mesos/build/src" --logbufsecs="0"
--logging_level="INFO" --max_completed_executors_per_framework="150" --oversubscribed_resources_interval="15secs"
--perf_duration="10secs" --perf_interval="1mins" --qos_correction_interval_min="0ns" --quiet="false"
--recover="reconnect" --recovery_timeout="15mins" --registration_backoff_factor="10ms" --resources="cpus:2;gpus:0;mem:1024;disk:1024;ports:[31000-32000]"
--revocable_cpu_low_priority="true" --runtime_dir="/tmp/Endpoint_SlaveEndpointTest_NoAuthorizer_1_ztjUlb"
--sandbox_directory="/mnt/mesos/sandbox" --strict="true" --switch_user="true" --systemd_enable_support="true"
--systemd_runtime_directory="/run/systemd/system" --version="false" --work_dir="/tmp/Endpoint_SlaveEndpointTest_NoAuthorizer_1_IC6YJC"
I1211 06:00:25.412689 27012 credentials.hpp:86] Loading credential for authentication from
'/tmp/Endpoint_SlaveEndpointTest_NoAuthorizer_1_ztjUlb/credential'
I1211 06:00:25.412796 27012 slave.cpp:347] Agent using credential for: test-principal
I1211 06:00:25.412807 27012 credentials.hpp:37] Loading credentials for authentication from
'/tmp/Endpoint_SlaveEndpointTest_NoAuthorizer_1_ztjUlb/http_credentials'
I1211 06:00:25.412917 27012 http.cpp:922] Using default 'basic' HTTP authenticator for realm
'mesos-agent-readonly'
I1211 06:00:25.412961 27012 http.cpp:922] Using default 'basic' HTTP authenticator for realm
'mesos-agent-readwrite'
I1211 06:00:25.413363 27012 slave.cpp:534] Agent resources: cpus(*):2; mem(*):1024; disk(*):1024;
ports(*):[31000-32000]
I1211 06:00:25.413401 27012 slave.cpp:542] Agent attributes: [  ]
I1211 06:00:25.413408 27012 slave.cpp:547] Agent hostname: 52e1eb6eee8e
I1211 06:00:25.413743 27008 state.cpp:57] Recovering state from '/tmp/Endpoint_SlaveEndpointTest_NoAuthorizer_1_IC6YJC/meta'
I1211 06:00:25.414001 27018 status_update_manager.cpp:203] Recovering status update manager
I1211 06:00:25.414067 27018 containerizer.cpp:594] Recovering containerizer
I1211 06:00:25.414825 27008 provisioner.cpp:253] Provisioner recovery complete
I1211 06:00:25.415415 27010 slave.cpp:5415] Finished recovery
I1211 06:00:25.415813 27010 slave.cpp:5589] Querying resource estimator for oversubscribable
resources
I1211 06:00:25.415925 27017 slave.cpp:5603] Received oversubscribable resources {} from the
resource estimator
I1211 06:00:25.416568 27010 process.cpp:3679] Handling HTTP event for process 'slave(667)'
with path: '/slave(667)/monitor/statistics.json'
I1211 06:00:25.417081 27018 http.cpp:874] Authorizing principal 'test-principal' to GET the
'/monitor/statistics.json' endpoint
I1211 06:00:25.418716 27010 slave.cpp:791] Agent terminating
I1211 06:00:25.423138 27007 containerizer.cpp:220] Using isolation: posix/cpu,posix/mem,filesystem/posix,network/cni
W1211 06:00:25.423390 27007 backend.cpp:76] Failed to create 'aufs' backend: AufsBackend requires
root privileges, but is running as user mesos
W1211 06:00:25.423521 27007 backend.cpp:76] Failed to create 'bind' backend: BindBackend requires
root privileges
I1211 06:00:25.424801 27007 cluster.cpp:446] Creating default 'local' authorizer
I1211 06:00:25.425789 27018 slave.cpp:209] Mesos agent started on (668)@172.17.0.2:41459
I1211 06:00:25.425810 27018 slave.cpp:210] Flags at startup: --acls="" --appc_simple_discovery_uri_prefix="http://"
--appc_store_dir="/tmp/mesos/store/appc" --authenticate_http_readonly="true" --authenticate_http_readwrite="true"
--authenticatee="crammd5" --authentication_backoff_factor="1secs" --authorizer="local" --cgroups_cpu_enable_pids_and_tids_count="false"
--cgroups_enable_cfs="false" --cgroups_hierarchy="/sys/fs/cgroup" --cgroups_limit_swap="false"
--cgroups_root="mesos" --container_disk_watch_interval="15secs" --containerizers="mesos" --credential="/tmp/Endpoint_SlaveEndpointTest_NoAuthorizer_2_1bf2Up/credential"
--default_role="*" --disk_watch_interval="1mins" --docker="docker" --docker_kill_orphans="true"
--docker_registry="https://registry-1.docker.io" --docker_remove_delay="6hrs" --docker_socket="/var/run/docker.sock"
--docker_stop_timeout="0ns" --docker_store_dir="/tmp/mesos/store/docker" --docker_volume_checkpoint_dir="/var/run/mesos/isolators/docker/volume"
--enforce_container_disk_quota="false" --executor_registration_timeout="1mins" --executor_shutdown_grace_period="5secs"
--fetcher_cache_dir="/tmp/Endpoint_SlaveEndpointTest_NoAuthorizer_2_1bf2Up/fetch" --fetcher_cache_size="2GB"
--frameworks_home="" --gc_delay="1weeks" --gc_disk_headroom="0.1" --hadoop_home="" --help="false"
--hostname_lookup="true" --http_authenticators="basic" --http_command_executor="false" --http_credentials="/tmp/Endpoint_SlaveEndpointTest_NoAuthorizer_2_1bf2Up/http_credentials"
--image_provisioner_backend="copy" --initialize_driver_logging="true" --io_switchboard_enable_server="true"
--isolation="posix/cpu,posix/mem" --launcher="posix" --launcher_dir="/mesos/build/src" --logbufsecs="0"
--logging_level="INFO" --max_completed_executors_per_framework="150" --oversubscribed_resources_interval="15secs"
--perf_duration="10secs" --perf_interval="1mins" --qos_correction_interval_min="0ns" --quiet="false"
--recover="reconnect" --recovery_timeout="15mins" --registration_backoff_factor="10ms" --resources="cpus:2;gpus:0;mem:1024;disk:1024;ports:[31000-32000]"
--revocable_cpu_low_priority="true" --runtime_dir="/tmp/Endpoint_SlaveEndpointTest_NoAuthorizer_2_1bf2Up"
--sandbox_directory="/mnt/mesos/sandbox" --strict="true" --switch_user="true" --systemd_enable_support="true"
--systemd_runtime_directory="/run/systemd/system" --version="false" --work_dir="/tmp/Endpoint_SlaveEndpointTest_NoAuthorizer_2_SxDXgR"
I1211 06:00:25.426218 27018 credentials.hpp:86] Loading credential for authentication from
'/tmp/Endpoint_SlaveEndpointTest_NoAuthorizer_2_1bf2Up/credential'
I1211 06:00:25.426311 27018 slave.cpp:347] Agent using credential for: test-principal
I1211 06:00:25.426323 27018 credentials.hpp:37] Loading credentials for authentication from
'/tmp/Endpoint_SlaveEndpointTest_NoAuthorizer_2_1bf2Up/http_credentials'
I1211 06:00:25.426431 27018 http.cpp:922] Using default 'basic' HTTP authenticator for realm
'mesos-agent-readonly'
I1211 06:00:25.426476 27018 http.cpp:922] Using default 'basic' HTTP authenticator for realm
'mesos-agent-readwrite'
I1211 06:00:25.426826 27018 slave.cpp:534] Agent resources: cpus(*):2; mem(*):1024; disk(*):1024;
ports(*):[31000-32000]
I1211 06:00:25.426862 27018 slave.cpp:542] Agent attributes: [  ]
I1211 06:00:37.383062 27018 slave.cpp:547] Agent hostname: 52e1eb6eee8e
I1211 06:00:37.383739 27008 state.cpp:57] Recovering state from '/tmp/Endpoint_SlaveEndpointTest_NoAuthorizer_2_SxDXgR/meta'
I1211 06:00:37.383937 27018 status_update_manager.cpp:203] Recovering status update manager
I1211 06:00:37.384099 27020 containerizer.cpp:594] Recovering containerizer
I1211 06:00:37.384865 27021 provisioner.cpp:253] Provisioner recovery complete
I1211 06:00:37.385155 27011 slave.cpp:5415] Finished recovery
I1211 06:00:37.385630 27011 slave.cpp:5589] Querying resource estimator for oversubscribable
resources
I1211 06:00:37.385792 27020 slave.cpp:5603] Received oversubscribable resources {} from the
resource estimator
I1211 06:00:37.386554 27016 process.cpp:3679] Handling HTTP event for process 'slave(668)'
with path: '/slave(668)/containers'
I1211 06:00:37.387018 27018 http.cpp:874] Authorizing principal 'test-principal' to GET the
'/containers' endpoint
I1211 06:00:37.388607 27007 slave.cpp:791] Agent terminating
Inconsistency detected by ld.so: dl-close.c: 762: _dl_close: Assertion `map->l_init_called'
failed!
make[3]: *** [CMakeFiles/check] Error 127
make[2]: *** [CMakeFiles/check.dir/all] Error 2
make[1]: *** [CMakeFiles/check.dir/rule] Error 2
make: *** [check] Error 2
+ docker rmi mesos-1481433445-4358
Untagged: mesos-1481433445-4358:latest
Deleted: sha256:d3a5c2b6dce41379e9e0c92c854376d68e03ac3dc8df425107009b711da0007f
Deleted: sha256:6a5150e7b5aa11a64b794ff929d1db4a7b645f2fc6f092af6f1582282732ce80
Deleted: sha256:3f2c0a567b5898a531c0ec2ea6e85116a34661c2ad4884b145dcbe0cbc765180
Deleted: sha256:5054d8a170b64dcbd79f883d4b5d31d14728d4bc5e83ce39d0d22760e16f9012
Deleted: sha256:80754c76d86aa3a9b0cbda6044cbed387cfa7a0ab7ceb6cd4c7d684653aadeb0
Deleted: sha256:6a411412c9cd21612aea90a4d76df274b439fa71aaa8e007116d8ce334bec36f
Deleted: sha256:6190af3abf96e81c698a91a8ef9e72bec95d2f9c1a13aa5f6ba9c80d10dd552a
Deleted: sha256:d54737aa9e1b4b04685de1fcba08f6d2fdbd7d83be1ec393146cae3ec59ced14
Deleted: sha256:dfa2163ba6f08e7809390dd0050c0bec87a097d89fac33adf14885f446d85c45
Deleted: sha256:b374900c827656eead110007c1c02397d662a04c0fc80c9193f86546796bea20
Deleted: sha256:053175b8bef6bd3c5d450f2599eb31fedd2368acdea049beaf0b9018d76b8ef0
Deleted: sha256:8bf542d162ec73589552647d5a34bcd4b139ef5f7e8c0915dae1661fd3cef2b9
Deleted: sha256:9f3f15d25b72aae9cd892cc725be8e75d7fd560d65fcffe28bf242b8ecef4f40
Deleted: sha256:ea8f5c6579d369b8da652be710b64cccd0a32db3de8c099928b9d760217e54e0
Deleted: sha256:d8ec5ef3ba28ac38f55bc25d6f12bd6fa0b3bd19f526e16c81a71a0cd344f9cf
Deleted: sha256:e2ecd578b13db27376a5e2b2c33cc0653ee7326c36c078a736e991b5c8fb3e35
Deleted: sha256:2366c709297e627ca4a524a1cfe9a1f8d6a5e81d3efee130f2447bfcd7ab43ab
Deleted: sha256:07d3bde5550719c11908300ef8a4305f56197e72990f5286c7b12bfa82255f9e
Deleted: sha256:888ac7fbd7d1c45b43a7e57471757ed1fe51084f90e8133b424e486bc81289c7
Deleted: sha256:5b7429d186b01bf80a1841291e8d6164939b6a97fa64355f8933073e4bcda4ea
Deleted: sha256:39b2264153c2fa7a73daf3c2f89637e8772fa270866eb67e05691dd216eda1da
Deleted: sha256:5ce097b6cfda4de6958c9d2ddc45f4f978407a736e3a2f19f74e0752d29d25a4
Deleted: sha256:e9bce43f1449df7fee0a759547f034c1e7453fcf34cafe15ee03f0be385d46fe
Deleted: sha256:d62120515214af51b41c3349cc8c2ee99dbe85e80f2d30fc84d0799e9f9b46ab
Build step 'Execute shell' marked build as failure

Mime
View raw message