mesos-builds mailing list archives

Site index · List index
Message view « Date » · « Thread »
Top « Date » · « Thread »
From Apache Jenkins Server <jenk...@builds.apache.org>
Subject Build failed in Jenkins: Mesos » cmake,gcc,--verbose,GLOG_v=1 MESOS_VERBOSE=1,ubuntu:14.04,(docker||Hadoop)&&(!ubuntu-us1)&&(!ubuntu-6)&&(!ubuntu-eu2) #3015
Date Wed, 07 Dec 2016 06:46:00 GMT
See <https://builds.apache.org/job/Mesos/BUILDTOOL=cmake,COMPILER=gcc,CONFIGURATION=--verbose,ENVIRONMENT=GLOG_v=1%20MESOS_VERBOSE=1,OS=ubuntu%3A14.04,label_exp=(docker%7C%7CHadoop)&&(!ubuntu-us1)&&(!ubuntu-6)&&(!ubuntu-eu2)/3015/changes>

Changes:

[yujie.jay] Waited for the domain socket file in IOSwitchboard::connect.

------------------------------------------
[...truncated 214902 lines...]
I1207 06:44:25.132361 26734 http.cpp:874] Authorizing principal 'test-principal' to GET the
'/monitor/statistics' endpoint
I1207 06:44:25.133554 26727 slave.cpp:790] Agent terminating
[       OK ] Endpoint/SlaveEndpointTest.AuthorizedRequest/0 (12 ms)
[ RUN      ] Endpoint/SlaveEndpointTest.AuthorizedRequest/1
I1207 06:44:25.147238 26720 containerizer.cpp:207] Using isolation: posix/cpu,posix/mem,filesystem/posix,network/cni
W1207 06:44:25.147646 26720 backend.cpp:76] Failed to create 'aufs' backend: AufsBackend requires
root privileges, but is running as user mesos
W1207 06:44:25.147752 26720 backend.cpp:76] Failed to create 'bind' backend: BindBackend requires
root privileges
I1207 06:44:25.148977 26725 slave.cpp:208] Mesos agent started on (652)@172.17.0.3:34436
I1207 06:44:25.148995 26725 slave.cpp:209] Flags at startup: --acls="" --appc_simple_discovery_uri_prefix="http://"
--appc_store_dir="/tmp/mesos/store/appc" --authenticate_http_readonly="true" --authenticate_http_readwrite="true"
--authenticatee="crammd5" --authentication_backoff_factor="1secs" --authorizer="local" --cgroups_cpu_enable_pids_and_tids_count="false"
--cgroups_enable_cfs="false" --cgroups_hierarchy="/sys/fs/cgroup" --cgroups_limit_swap="false"
--cgroups_root="mesos" --container_disk_watch_interval="15secs" --containerizers="mesos" --credential="/tmp/Endpoint_SlaveEndpointTest_AuthorizedRequest_1_LQPUEq/credential"
--default_role="*" --disk_watch_interval="1mins" --docker="docker" --docker_kill_orphans="true"
--docker_registry="https://registry-1.docker.io" --docker_remove_delay="6hrs" --docker_socket="/var/run/docker.sock"
--docker_stop_timeout="0ns" --docker_store_dir="/tmp/mesos/store/docker" --docker_volume_checkpoint_dir="/var/run/mesos/isolators/docker/volume"
--enforce_container_disk_quota="false" --executor_registration_timeout="1mins" --executor_shutdown_grace_period="5secs"
--fetcher_cache_dir="/tmp/Endpoint_SlaveEndpointTest_AuthorizedRequest_1_LQPUEq/fetch" --fetcher_cache_size="2GB"
--frameworks_home="" --gc_delay="1weeks" --gc_disk_headroom="0.1" --hadoop_home="" --help="false"
--hostname_lookup="true" --http_authenticators="basic" --http_command_executor="false" --http_credentials="/tmp/Endpoint_SlaveEndpointTest_AuthorizedRequest_1_LQPUEq/http_credentials"
--image_provisioner_backend="copy" --initialize_driver_logging="true" --io_switchboard_enable_server="true"
--isolation="posix/cpu,posix/mem" --launcher="posix" --launcher_dir="/mesos/build/src" --logbufsecs="0"
--logging_level="INFO" --max_completed_executors_per_framework="150" --oversubscribed_resources_interval="15secs"
--perf_duration="10secs" --perf_interval="1mins" --qos_correction_interval_min="0ns" --quiet="false"
--recover="reconnect" --recovery_timeout="15mins" --registration_backoff_factor="10ms" --resources="cpus:2;gpus:0;mem:1024;disk:1024;ports:[31000-32000]"
--revocable_cpu_low_priority="true" --runtime_dir="/tmp/Endpoint_SlaveEndpointTest_AuthorizedRequest_1_LQPUEq"
--sandbox_directory="/mnt/mesos/sandbox" --strict="true" --switch_user="true" --systemd_enable_support="true"
--systemd_runtime_directory="/run/systemd/system" --version="false" --work_dir="/tmp/Endpoint_SlaveEndpointTest_AuthorizedRequest_1_hdwtV4"
I1207 06:44:25.149384 26725 credentials.hpp:86] Loading credential for authentication from
'/tmp/Endpoint_SlaveEndpointTest_AuthorizedRequest_1_LQPUEq/credential'
I1207 06:44:25.149493 26725 slave.cpp:346] Agent using credential for: test-principal
I1207 06:44:25.149513 26725 credentials.hpp:37] Loading credentials for authentication from
'/tmp/Endpoint_SlaveEndpointTest_AuthorizedRequest_1_LQPUEq/http_credentials'
I1207 06:44:25.149647 26725 http.cpp:922] Using default 'basic' HTTP authenticator for realm
'mesos-agent-readonly'
I1207 06:44:25.149704 26725 http.cpp:922] Using default 'basic' HTTP authenticator for realm
'mesos-agent-readwrite'
I1207 06:44:25.150218 26725 slave.cpp:533] Agent resources: cpus(*):2; mem(*):1024; disk(*):1024;
ports(*):[31000-32000]
I1207 06:44:25.150256 26725 slave.cpp:541] Agent attributes: [  ]
I1207 06:44:25.150264 26725 slave.cpp:546] Agent hostname: c59481c2ee67
I1207 06:44:25.150598 26727 state.cpp:57] Recovering state from '/tmp/Endpoint_SlaveEndpointTest_AuthorizedRequest_1_hdwtV4/meta'
I1207 06:44:25.150851 26723 status_update_manager.cpp:203] Recovering status update manager
I1207 06:44:25.150943 26723 containerizer.cpp:581] Recovering containerizer
I1207 06:44:25.151468 26732 provisioner.cpp:253] Provisioner recovery complete
I1207 06:44:25.151788 26724 slave.cpp:5414] Finished recovery
I1207 06:44:25.152150 26724 slave.cpp:5588] Querying resource estimator for oversubscribable
resources
I1207 06:44:25.152323 26727 slave.cpp:5602] Received oversubscribable resources {} from the
resource estimator
I1207 06:44:25.153015 26729 process.cpp:3679] Handling HTTP event for process 'slave(652)'
with path: '/slave(652)/monitor/statistics.json'
I1207 06:44:25.153465 26723 http.cpp:874] Authorizing principal 'test-principal' to GET the
'/monitor/statistics.json' endpoint
I1207 06:44:25.154907 26732 slave.cpp:790] Agent terminating
[       OK ] Endpoint/SlaveEndpointTest.AuthorizedRequest/1 (13 ms)
[ RUN      ] Endpoint/SlaveEndpointTest.AuthorizedRequest/2
I1207 06:44:25.163993 26720 containerizer.cpp:207] Using isolation: posix/cpu,posix/mem,filesystem/posix,network/cni
W1207 06:44:25.164386 26720 backend.cpp:76] Failed to create 'aufs' backend: AufsBackend requires
root privileges, but is running as user mesos
W1207 06:44:25.164490 26720 backend.cpp:76] Failed to create 'bind' backend: BindBackend requires
root privileges
I1207 06:44:25.165892 26730 slave.cpp:208] Mesos agent started on (653)@172.17.0.3:34436
I1207 06:44:25.165913 26730 slave.cpp:209] Flags at startup: --acls="" --appc_simple_discovery_uri_prefix="http://"
--appc_store_dir="/tmp/mesos/store/appc" --authenticate_http_readonly="true" --authenticate_http_readwrite="true"
--authenticatee="crammd5" --authentication_backoff_factor="1secs" --authorizer="local" --cgroups_cpu_enable_pids_and_tids_count="false"
--cgroups_enable_cfs="false" --cgroups_hierarchy="/sys/fs/cgroup" --cgroups_limit_swap="false"
--cgroups_root="mesos" --container_disk_watch_interval="15secs" --containerizers="mesos" --credential="/tmp/Endpoint_SlaveEndpointTest_AuthorizedRequest_2_xtZFJP/credential"
--default_role="*" --disk_watch_interval="1mins" --docker="docker" --docker_kill_orphans="true"
--docker_registry="https://registry-1.docker.io" --docker_remove_delay="6hrs" --docker_socket="/var/run/docker.sock"
--docker_stop_timeout="0ns" --docker_store_dir="/tmp/mesos/store/docker" --docker_volume_checkpoint_dir="/var/run/mesos/isolators/docker/volume"
--enforce_container_disk_quota="false" --executor_registration_timeout="1mins" --executor_shutdown_grace_period="5secs"
--fetcher_cache_dir="/tmp/Endpoint_SlaveEndpointTest_AuthorizedRequest_2_xtZFJP/fetch" --fetcher_cache_size="2GB"
--frameworks_home="" --gc_delay="1weeks" --gc_disk_headroom="0.1" --hadoop_home="" --help="false"
--hostname_lookup="true" --http_authenticators="basic" --http_command_executor="false" --http_credentials="/tmp/Endpoint_SlaveEndpointTest_AuthorizedRequest_2_xtZFJP/http_credentials"
--image_provisioner_backend="copy" --initialize_driver_logging="true" --io_switchboard_enable_server="true"
--isolation="posix/cpu,posix/mem" --launcher="posix" --launcher_dir="/mesos/build/src" --logbufsecs="0"
--logging_level="INFO" --max_completed_executors_per_framework="150" --oversubscribed_resources_interval="15secs"
--perf_duration="10secs" --perf_interval="1mins" --qos_correction_interval_min="0ns" --quiet="false"
--recover="reconnect" --recovery_timeout="15mins" --registration_backoff_factor="10ms" --resources="cpus:2;gpus:0;mem:1024;disk:1024;ports:[31000-32000]"
--revocable_cpu_low_priority="true" --runtime_dir="/tmp/Endpoint_SlaveEndpointTest_AuthorizedRequest_2_xtZFJP"
--sandbox_directory="/mnt/mesos/sandbox" --strict="true" --switch_user="true" --systemd_enable_support="true"
--systemd_runtime_directory="/run/systemd/system" --version="false" --work_dir="/tmp/Endpoint_SlaveEndpointTest_AuthorizedRequest_2_RbEvXt"
I1207 06:44:25.166286 26730 credentials.hpp:86] Loading credential for authentication from
'/tmp/Endpoint_SlaveEndpointTest_AuthorizedRequest_2_xtZFJP/credential'
I1207 06:44:25.166388 26730 slave.cpp:346] Agent using credential for: test-principal
I1207 06:44:25.166405 26730 credentials.hpp:37] Loading credentials for authentication from
'/tmp/Endpoint_SlaveEndpointTest_AuthorizedRequest_2_xtZFJP/http_credentials'
I1207 06:44:25.166517 26730 http.cpp:922] Using default 'basic' HTTP authenticator for realm
'mesos-agent-readonly'
I1207 06:44:25.166564 26730 http.cpp:922] Using default 'basic' HTTP authenticator for realm
'mesos-agent-readwrite'
I1207 06:44:25.166967 26730 slave.cpp:533] Agent resources: cpus(*):2; mem(*):1024; disk(*):1024;
ports(*):[31000-32000]
I1207 06:44:25.167012 26730 slave.cpp:541] Agent attributes: [  ]
I1207 06:44:25.167024 26730 slave.cpp:546] Agent hostname: c59481c2ee67
I1207 06:44:25.167421 26732 state.cpp:57] Recovering state from '/tmp/Endpoint_SlaveEndpointTest_AuthorizedRequest_2_RbEvXt/meta'
I1207 06:44:25.167569 26726 status_update_manager.cpp:203] Recovering status update manager
I1207 06:44:25.167798 26729 containerizer.cpp:581] Recovering containerizer
I1207 06:44:25.168506 26726 provisioner.cpp:253] Provisioner recovery complete
I1207 06:44:25.168783 26732 slave.cpp:5414] Finished recovery
I1207 06:44:25.169200 26732 slave.cpp:5588] Querying resource estimator for oversubscribable
resources
I1207 06:44:25.169335 26724 slave.cpp:5602] Received oversubscribable resources {} from the
resource estimator
I1207 06:44:25.169966 26736 process.cpp:3679] Handling HTTP event for process 'slave(653)'
with path: '/slave(653)/containers'
I1207 06:44:25.170413 26735 http.cpp:874] Authorizing principal 'test-principal' to GET the
'/containers' endpoint
I1207 06:44:25.171824 26722 slave.cpp:790] Agent terminating
[       OK ] Endpoint/SlaveEndpointTest.AuthorizedRequest/2 (13 ms)
[ RUN      ] Endpoint/SlaveEndpointTest.UnauthorizedRequest/0
I1207 06:44:25.180661 26720 containerizer.cpp:207] Using isolation: posix/cpu,posix/mem,filesystem/posix,network/cni
W1207 06:44:25.181066 26720 backend.cpp:76] Failed to create 'aufs' backend: AufsBackend requires
root privileges, but is running as user mesos
W1207 06:44:25.181157 26720 backend.cpp:76] Failed to create 'bind' backend: BindBackend requires
root privileges
I1207 06:44:25.182196 26731 slave.cpp:208] Mesos agent started on (654)@172.17.0.3:34436
I1207 06:44:25.182219 26731 slave.cpp:209] Flags at startup: --acls="" --appc_simple_discovery_uri_prefix="http://"
--appc_store_dir="/tmp/mesos/store/appc" --authenticate_http_readonly="true" --authenticate_http_readwrite="true"
--authenticatee="crammd5" --authentication_backoff_factor="1secs" --authorizer="local" --cgroups_cpu_enable_pids_and_tids_count="false"
--cgroups_enable_cfs="false" --cgroups_hierarchy="/sys/fs/cgroup" --cgroups_limit_swap="false"
--cgroups_root="mesos" --container_disk_watch_interval="15secs" --containerizers="mesos" --credential="/tmp/Endpoint_SlaveEndpointTest_UnauthorizedRequest_0_PgejZe/credential"
--default_role="*" --disk_watch_interval="1mins" --docker="docker" --docker_kill_orphans="true"
--docker_registry="https://registry-1.docker.io" --docker_remove_delay="6hrs" --docker_socket="/var/run/docker.sock"
--docker_stop_timeout="0ns" --docker_store_dir="/tmp/mesos/store/docker" --docker_volume_checkpoint_dir="/var/run/mesos/isolators/docker/volume"
--enforce_container_disk_quota="false" --executor_registration_timeout="1mins" --executor_shutdown_grace_period="5secs"
--fetcher_cache_dir="/tmp/Endpoint_SlaveEndpointTest_UnauthorizedRequest_0_PgejZe/fetch" --fetcher_cache_size="2GB"
--frameworks_home="" --gc_delay="1weeks" --gc_disk_headroom="0.1" --hadoop_home="" --help="false"
--hostname_lookup="true" --http_authenticators="basic" --http_command_executor="false" --http_credentials="/tmp/Endpoint_SlaveEndpointTest_UnauthorizedRequest_0_PgejZe/http_credentials"
--image_provisioner_backend="copy" --initialize_driver_logging="true" --io_switchboard_enable_server="true"
--isolation="posix/cpu,posix/mem" --launcher="posix" --launcher_dir="/mesos/build/src" --logbufsecs="0"
--logging_level="INFO" --max_completed_executors_per_framework="150" --oversubscribed_resources_interval="15secs"
--perf_duration="10secs" --perf_interval="1mins" --qos_correction_interval_min="0ns" --quiet="false"
--recover="reconnect" --recovery_timeout="15mins" --registration_backoff_factor="10ms" --resources="cpus:2;gpus:0;mem:1024;disk:1024;ports:[31000-32000]"
--revocable_cpu_low_priority="true" --runtime_dir="/tmp/Endpoint_SlaveEndpointTest_UnauthorizedRequest_0_PgejZe"
--sandbox_directory="/mnt/mesos/sandbox" --strict="true" --switch_user="true" --systemd_enable_support="true"
--systemd_runtime_directory="/run/systemd/system" --version="false" --work_dir="/tmp/Endpoint_SlaveEndpointTest_UnauthorizedRequest_0_PFiraT"
I1207 06:44:25.182659 26731 credentials.hpp:86] Loading credential for authentication from
'/tmp/Endpoint_SlaveEndpointTest_UnauthorizedRequest_0_PgejZe/credential'
I1207 06:44:25.182770 26731 slave.cpp:346] Agent using credential for: test-principal
I1207 06:44:25.182790 26731 credentials.hpp:37] Loading credentials for authentication from
'/tmp/Endpoint_SlaveEndpointTest_UnauthorizedRequest_0_PgejZe/http_credentials'
I1207 06:44:25.182936 26731 http.cpp:922] Using default 'basic' HTTP authenticator for realm
'mesos-agent-readonly'
I1207 06:44:25.182996 26731 http.cpp:922] Using default 'basic' HTTP authenticator for realm
'mesos-agent-readwrite'
I1207 06:44:25.183459 26731 slave.cpp:533] Agent resources: cpus(*):2; mem(*):1024; disk(*):1024;
ports(*):[31000-32000]
I1207 06:44:25.183502 26731 slave.cpp:541] Agent attributes: [  ]
I1207 06:44:25.183511 26731 slave.cpp:546] Agent hostname: c59481c2ee67
I1207 06:44:25.183969 26726 state.cpp:57] Recovering state from '/tmp/Endpoint_SlaveEndpointTest_UnauthorizedRequest_0_PFiraT/meta'
I1207 06:44:25.184120 26733 status_update_manager.cpp:203] Recovering status update manager
I1207 06:44:25.184331 26721 containerizer.cpp:581] Recovering containerizer
I1207 06:44:25.184926 26721 provisioner.cpp:253] Provisioner recovery complete
I1207 06:44:25.185164 26723 slave.cpp:5414] Finished recovery
I1207 06:44:25.185575 26723 slave.cpp:5588] Querying resource estimator for oversubscribable
resources
I1207 06:44:25.185802 26733 slave.cpp:5602] Received oversubscribable resources {} from the
resource estimator
I1207 06:44:25.186492 26729 process.cpp:3679] Handling HTTP event for process 'slave(654)'
with path: '/slave(654)/monitor/statistics'
I1207 06:44:25.186997 26733 http.cpp:874] Authorizing principal 'test-principal' to GET the
'/monitor/statistics' endpoint
I1207 06:44:25.188009 26723 slave.cpp:790] Agent terminating
[       OK ] Endpoint/SlaveEndpointTest.UnauthorizedRequest/0 (12 ms)
[ RUN      ] Endpoint/SlaveEndpointTest.UnauthorizedRequest/1
I1207 06:44:25.197584 26720 containerizer.cpp:207] Using isolation: posix/cpu,posix/mem,filesystem/posix,network/cni
W1207 06:44:25.197959 26720 backend.cpp:76] Failed to create 'aufs' backend: AufsBackend requires
root privileges, but is running as user mesos
W1207 06:44:25.198119 26720 backend.cpp:76] Failed to create 'bind' backend: BindBackend requires
root privileges
I1207 06:44:25.199414 26727 slave.cpp:208] Mesos agent started on (655)@172.17.0.3:34436
I1207 06:44:25.199437 26727 slave.cpp:209] Flags at startup: --acls="" --appc_simple_discovery_uri_prefix="http://"
--appc_store_dir="/tmp/mesos/store/appc" --authenticate_http_readonly="true" --authenticate_http_readwrite="true"
--authenticatee="crammd5" --authentication_backoff_factor="1secs" --authorizer="local" --cgroups_cpu_enable_pids_and_tids_count="false"
--cgroups_enable_cfs="false" --cgroups_hierarchy="/sys/fs/cgroup" --cgroups_limit_swap="false"
--cgroups_root="mesos" --container_disk_watch_interval="15secs" --containerizers="mesos" --credential="/tmp/Endpoint_SlaveEndpointTest_UnauthorizedRequest_1_bbPNpE/credential"
--default_role="*" --disk_watch_interval="1mins" --docker="docker" --docker_kill_orphans="true"
--docker_registry="https://registry-1.docker.io" --docker_remove_delay="6hrs" --docker_socket="/var/run/docker.sock"
--docker_stop_timeout="0ns" --docker_store_dir="/tmp/mesos/store/docker" --docker_volume_checkpoint_dir="/var/run/mesos/isolators/docker/volume"
--enforce_container_disk_quota="false" --executor_registration_timeout="1mins" --executor_shutdown_grace_period="5secs"
--fetcher_cache_dir="/tmp/Endpoint_SlaveEndpointTest_UnauthorizedRequest_1_bbPNpE/fetch" --fetcher_cache_size="2GB"
--frameworks_home="" --gc_delay="1weeks" --gc_disk_headroom="0.1" --hadoop_home="" --help="false"
--hostname_lookup="true" --http_authenticators="basic" --http_command_executor="false" --http_credentials="/tmp/Endpoint_SlaveEndpointTest_UnauthorizedRequest_1_bbPNpE/http_credentials"
--image_provisioner_backend="copy" --initialize_driver_logging="true" --io_switchboard_enable_server="true"
--isolation="posix/cpu,posix/mem" --launcher="posix" --launcher_dir="/mesos/build/src" --logbufsecs="0"
--logging_level="INFO" --max_completed_executors_per_framework="150" --oversubscribed_resources_interval="15secs"
--perf_duration="10secs" --perf_interval="1mins" --qos_correction_interval_min="0ns" --quiet="false"
--recover="reconnect" --recovery_timeout="15mins" --registration_backoff_factor="10ms" --resources="cpus:2;gpus:0;mem:1024;disk:1024;ports:[31000-32000]"
--revocable_cpu_low_priority="true" --runtime_dir="/tmp/Endpoint_SlaveEndpointTest_UnauthorizedRequest_1_bbPNpE"
--sandbox_directory="/mnt/mesos/sandbox" --strict="true" --switch_user="true" --systemd_enable_support="true"
--systemd_runtime_directory="/run/systemd/system" --version="false" --work_dir="/tmp/Endpoint_SlaveEndpointTest_UnauthorizedRequest_1_Z1gcyi"
I1207 06:44:25.199842 26727 credentials.hpp:86] Loading credential for authentication from
'/tmp/Endpoint_SlaveEndpointTest_UnauthorizedRequest_1_bbPNpE/credential'
I1207 06:44:25.199965 26727 slave.cpp:346] Agent using credential for: test-principal
I1207 06:44:25.199985 26727 credentials.hpp:37] Loading credentials for authentication from
'/tmp/Endpoint_SlaveEndpointTest_UnauthorizedRequest_1_bbPNpE/http_credentials'
I1207 06:44:25.200121 26727 http.cpp:922] Using default 'basic' HTTP authenticator for realm
'mesos-agent-readonly'
I1207 06:44:25.200197 26727 http.cpp:922] Using default 'basic' HTTP authenticator for realm
'mesos-agent-readwrite'
I1207 06:44:25.200717 26727 slave.cpp:533] Agent resources: cpus(*):2; mem(*):1024; disk(*):1024;
ports(*):[31000-32000]
I1207 06:44:25.200763 26727 slave.cpp:541] Agent attributes: [  ]
I1207 06:44:25.200776 26727 slave.cpp:546] Agent hostname: c59481c2ee67
I1207 06:44:25.201158 26731 state.cpp:57] Recovering state from '/tmp/Endpoint_SlaveEndpointTest_UnauthorizedRequest_1_Z1gcyi/meta'
I1207 06:44:25.201422 26722 status_update_manager.cpp:203] Recovering status update manager
I1207 06:44:25.201539 26736 containerizer.cpp:581] Recovering containerizer
I1207 06:44:25.202148 26721 provisioner.cpp:253] Provisioner recovery complete
I1207 06:44:25.202415 26727 slave.cpp:5414] Finished recovery
I1207 06:44:25.202813 26727 slave.cpp:5588] Querying resource estimator for oversubscribable
resources
I1207 06:44:25.202927 26730 slave.cpp:5602] Received oversubscribable resources {} from the
resource estimator
I1207 06:44:25.203662 26732 process.cpp:3679] Handling HTTP event for process 'slave(655)'
with path: '/slave(655)/monitor/statistics.json'
I1207 06:44:25.204156 26733 http.cpp:874] Authorizing principal 'test-principal' to GET the
'/monitor/statistics.json' endpoint
I1207 06:44:25.205184 26725 slave.cpp:790] Agent terminating
[       OK ] Endpoint/SlaveEndpointTest.UnauthorizedRequest/1 (12 ms)
[ RUN      ] Endpoint/SlaveEndpointTest.UnauthorizedRequest/2
I1207 06:44:25.213989 26720 containerizer.cpp:207] Using isolation: posix/cpu,posix/mem,filesystem/posix,network/cni
W1207 06:44:25.214365 26720 backend.cpp:76] Failed to create 'aufs' backend: AufsBackend requires
root privileges, but is running as user mesos
W1207 06:44:25.214449 26720 backend.cpp:76] Failed to create 'bind' backend: BindBackend requires
root privileges
I1207 06:44:25.215629 26724 slave.cpp:208] Mesos agent started on (656)@172.17.0.3:34436
I1207 06:44:25.215648 26724 slave.cpp:209] Flags at startup: --acls="" --appc_simple_discovery_uri_prefix="http://"
--appc_store_dir="/tmp/mesos/store/appc" --authenticate_http_readonly="true" --authenticate_http_readwrite="true"
--authenticatee="crammd5" --authentication_backoff_factor="1secs" --authorizer="local" --cgroups_cpu_enable_pids_and_tids_count="false"
--cgroups_enable_cfs="false" --cgroups_hierarchy="/sys/fs/cgroup" --cgroups_limit_swap="false"
--cgroups_root="mesos" --container_disk_watch_interval="15secs" --containerizers="mesos" --credential="/tmp/Endpoint_SlaveEndpointTest_UnauthorizedRequest_2_Pcua13/credential"
--default_role="*" --disk_watch_interval="1mins" --docker="docker" --docker_kill_orphans="true"
--docker_registry="https://registry-1.docker.io" --docker_remove_delay="6hrs" --docker_socket="/var/run/docker.sock"
--docker_stop_timeout="0ns" --docker_store_dir="/tmp/mesos/store/docker" --docker_volume_checkpoint_dir="/var/run/mesos/isolators/docker/volume"
--enforce_container_disk_quota="false" --executor_registration_timeout="1mins" --executor_shutdown_grace_period="5secs"
--fetcher_cache_dir="/tmp/Endpoint_SlaveEndpointTest_UnauthorizedRequest_2_Pcua13/fetch" --fetcher_cache_size="2GB"
--frameworks_home="" --gc_delay="1weeks" --gc_disk_headroom="0.1" --hadoop_home="" --help="false"
--hostname_lookup="true" --http_authenticators="basic" --http_command_executor="false" --http_credentials="/tmp/Endpoint_SlaveEndpointTest_UnauthorizedRequest_2_Pcua13/http_credentials"
--image_provisioner_backend="copy" --initialize_driver_logging="true" --io_switchboard_enable_server="true"
--isolation="posix/cpu,posix/mem" --launcher="posix" --launcher_dir="/mesos/build/src" --logbufsecs="0"
--logging_level="INFO" --max_completed_executors_per_framework="150" --oversubscribed_resources_interval="15secs"
--perf_duration="10secs" --perf_interval="1mins" --qos_correction_interval_min="0ns" --quiet="false"
--recover="reconnect" --recovery_timeout="15mins" --registration_backoff_factor="10ms" --resources="cpus:2;gpus:0;mem:1024;disk:1024;ports:[31000-32000]"
--revocable_cpu_low_priority="true" --runtime_dir="/tmp/Endpoint_SlaveEndpointTest_UnauthorizedRequest_2_Pcua13"
--sandbox_directory="/mnt/mesos/sandbox" --strict="true" --switch_user="true" --systemd_enable_support="true"
--systemd_runtime_directory="/run/systemd/system" --version="false" --work_dir="/tmp/Endpoint_SlaveEndpointTest_UnauthorizedRequest_2_jzwS6H"
I1207 06:44:25.216047 26724 credentials.hpp:86] Loading credential for authentication from
'/tmp/Endpoint_SlaveEndpointTest_UnauthorizedRequest_2_Pcua13/credential'
I1207 06:44:25.216130 26724 slave.cpp:346] Agent using credential for: test-principal
I1207 06:44:25.216148 26724 credentials.hpp:37] Loading credentials for authentication from
'/tmp/Endpoint_SlaveEndpointTest_UnauthorizedRequest_2_Pcua13/http_credentials'
I1207 06:44:25.216277 26724 http.cpp:922] Using default 'basic' HTTP authenticator for realm
'mesos-agent-readonly'
I1207 06:44:25.216327 26724 http.cpp:922] Using default 'basic' HTTP authenticator for realm
'mesos-agent-readwrite'
I1207 06:44:25.216709 26724 slave.cpp:533] Agent resources: cpus(*):2; mem(*):1024; disk(*):1024;
ports(*):[31000-32000]
I1207 06:44:25.216751 26724 slave.cpp:541] Agent attributes: [  ]
I1207 06:44:25.216768 26724 slave.cpp:546] Agent hostname: c59481c2ee67
I1207 06:44:25.217104 26726 state.cpp:57] Recovering state from '/tmp/Endpoint_SlaveEndpointTest_UnauthorizedRequest_2_jzwS6H/meta'
I1207 06:44:25.217326 26734 status_update_manager.cpp:203] Recovering status update manager
I1207 06:44:25.217445 26726 containerizer.cpp:581] Recovering containerizer
I1207 06:44:25.218086 26726 provisioner.cpp:253] Provisioner recovery complete
I1207 06:44:25.218237 26722 slave.cpp:5414] Finished recovery
I1207 06:44:25.218641 26722 slave.cpp:5588] Querying resource estimator for oversubscribable
resources
I1207 06:44:25.218773 26731 slave.cpp:5602] Received oversubscribable resources {} from the
resource estimator
I1207 06:44:25.219357 26734 process.cpp:3679] Handling HTTP event for process 'slave(656)'
with path: '/slave(656)/containers'
I1207 06:44:25.219801 26724 http.cpp:874] Authorizing principal 'test-principal' to GET the
'/containers' endpoint
I1207 06:44:25.221055 26721 slave.cpp:790] Agent terminating
[       OK ] Endpoint/SlaveEndpointTest.UnauthorizedRequest/2 (11 ms)
[ RUN      ] Endpoint/SlaveEndpointTest.NoAuthorizer/0
I1207 06:44:25.230866 26720 containerizer.cpp:207] Using isolation: posix/cpu,posix/mem,filesystem/posix,network/cni
W1207 06:44:25.231271 26720 backend.cpp:76] Failed to create 'aufs' backend: AufsBackend requires
root privileges, but is running as user mesos
W1207 06:44:25.231356 26720 backend.cpp:76] Failed to create 'bind' backend: BindBackend requires
root privileges
I1207 06:44:25.232144 26720 cluster.cpp:446] Creating default 'local' authorizer
I1207 06:44:25.232756 26736 slave.cpp:208] Mesos agent started on (657)@172.17.0.3:34436
I1207 06:44:25.232780 26736 slave.cpp:209] Flags at startup: --acls="" --appc_simple_discovery_uri_prefix="http://"
--appc_store_dir="/tmp/mesos/store/appc" --authenticate_http_readonly="true" --authenticate_http_readwrite="true"
--authenticatee="crammd5" --authentication_backoff_factor="1secs" --authorizer="local" --cgroups_cpu_enable_pids_and_tids_count="false"
--cgroups_enable_cfs="false" --cgroups_hierarchy="/sys/fs/cgroup" --cgroups_limit_swap="false"
--cgroups_root="mesos" --container_disk_watch_interval="15secs" --containerizers="mesos" --credential="/tmp/Endpoint_SlaveEndpointTest_NoAuthorizer_0_NzmgNt/credential"
--default_role="*" --disk_watch_interval="1mins" --docker="docker" --docker_kill_orphans="true"
--docker_registry="https://registry-1.docker.io" --docker_remove_delay="6hrs" --docker_socket="/var/run/docker.sock"
--docker_stop_timeout="0ns" --docker_store_dir="/tmp/mesos/store/docker" --docker_volume_checkpoint_dir="/var/run/mesos/isolators/docker/volume"
--enforce_container_disk_quota="false" --executor_registration_timeout="1mins" --executor_shutdown_grace_period="5secs"
--fetcher_cache_dir="/tmp/Endpoint_SlaveEndpointTest_NoAuthorizer_0_NzmgNt/fetch" --fetcher_cache_size="2GB"
--frameworks_home="" --gc_delay="1weeks" --gc_disk_headroom="0.1" --hadoop_home="" --help="false"
--hostname_lookup="true" --http_authenticators="basic" --http_command_executor="false" --http_credentials="/tmp/Endpoint_SlaveEndpointTest_NoAuthorizer_0_NzmgNt/http_credentials"
--image_provisioner_backend="copy" --initialize_driver_logging="true" --io_switchboard_enable_server="true"
--isolation="posix/cpu,posix/mem" --launcher="posix" --launcher_dir="/mesos/build/src" --logbufsecs="0"
--logging_level="INFO" --max_completed_executors_per_framework="150" --oversubscribed_resources_interval="15secs"
--perf_duration="10secs" --perf_interval="1mins" --qos_correction_interval_min="0ns" --quiet="false"
--recover="reconnect" --recovery_timeout="15mins" --registration_backoff_factor="10ms" --resources="cpus:2;gpus:0;mem:1024;disk:1024;ports:[31000-32000]"
--revocable_cpu_low_priority="true" --runtime_dir="/tmp/Endpoint_SlaveEndpointTest_NoAuthorizer_0_NzmgNt"
--sandbox_directory="/mnt/mesos/sandbox" --strict="true" --switch_user="true" --systemd_enable_support="true"
--systemd_runtime_directory="/run/systemd/system" --version="false" --work_dir="/tmp/Endpoint_SlaveEndpointTest_NoAuthorizer_0_POIfQ7"
I1207 06:44:25.233368 26736 credentials.hpp:86] Loading credential for authentication from
'/tmp/Endpoint_SlaveEndpointTest_NoAuthorizer_0_NzmgNt/credential'
I1207 06:44:25.233474 26736 slave.cpp:346] Agent using credential for: test-principal
I1207 06:44:25.233491 26736 credentials.hpp:37] Loading credentials for authentication from
'/tmp/Endpoint_SlaveEndpointTest_NoAuthorizer_0_NzmgNt/http_credentials'
I1207 06:44:25.233603 26736 http.cpp:922] Using default 'basic' HTTP authenticator for realm
'mesos-agent-readonly'
I1207 06:44:25.233650 26736 http.cpp:922] Using default 'basic' HTTP authenticator for realm
'mesos-agent-readwrite'
I1207 06:44:25.234040 26736 slave.cpp:533] Agent resources: cpus(*):2; mem(*):1024; disk(*):1024;
ports(*):[31000-32000]
I1207 06:44:25.234082 26736 slave.cpp:541] Agent attributes: [  ]
I1207 06:44:25.234093 26736 slave.cpp:546] Agent hostname: c59481c2ee67
I1207 06:44:25.234465 26724 state.cpp:57] Recovering state from '/tmp/Endpoint_SlaveEndpointTest_NoAuthorizer_0_POIfQ7/meta'
I1207 06:44:25.234594 26736 status_update_manager.cpp:203] Recovering status update manager
I1207 06:44:25.234789 26727 containerizer.cpp:581] Recovering containerizer
I1207 06:44:25.235401 26732 provisioner.cpp:253] Provisioner recovery complete
I1207 06:44:25.235607 26723 slave.cpp:5414] Finished recovery
I1207 06:44:25.236045 26723 slave.cpp:5588] Querying resource estimator for oversubscribable
resources
I1207 06:44:25.236155 26733 slave.cpp:5602] Received oversubscribable resources {} from the
resource estimator
I1207 06:44:25.236804 26723 process.cpp:3679] Handling HTTP event for process 'slave(657)'
with path: '/slave(657)/monitor/statistics'
I1207 06:44:25.237284 26721 http.cpp:874] Authorizing principal 'test-principal' to GET the
'/monitor/statistics' endpoint
I1207 06:44:25.238692 26730 slave.cpp:790] Agent terminating
[       OK ] Endpoint/SlaveEndpointTest.NoAuthorizer/0 (13 ms)
[ RUN      ] Endpoint/SlaveEndpointTest.NoAuthorizer/1
I1207 06:44:25.253021 26720 containerizer.cpp:207] Using isolation: posix/cpu,posix/mem,filesystem/posix,network/cni
W1207 06:44:25.253428 26720 backend.cpp:76] Failed to create 'aufs' backend: AufsBackend requires
root privileges, but is running as user mesos
W1207 06:44:25.253530 26720 backend.cpp:76] Failed to create 'bind' backend: BindBackend requires
root privileges
I1207 06:44:25.254257 26720 cluster.cpp:446] Creating default 'local' authorizer
I1207 06:44:25.254796 26729 slave.cpp:208] Mesos agent started on (658)@172.17.0.3:34436
I1207 06:44:25.254817 26729 slave.cpp:209] Flags at startup: --acls="" --appc_simple_discovery_uri_prefix="http://"
--appc_store_dir="/tmp/mesos/store/appc" --authenticate_http_readonly="true" --authenticate_http_readwrite="true"
--authenticatee="crammd5" --authentication_backoff_factor="1secs" --authorizer="local" --cgroups_cpu_enable_pids_and_tids_count="false"
--cgroups_enable_cfs="false" --cgroups_hierarchy="/sys/fs/cgroup" --cgroups_limit_swap="false"
--cgroups_root="mesos" --container_disk_watch_interval="15secs" --containerizers="mesos" --credential="/tmp/Endpoint_SlaveEndpointTest_NoAuthorizer_1_3kkVMT/credential"
--default_role="*" --disk_watch_interval="1mins" --docker="docker" --docker_kill_orphans="true"
--docker_registry="https://registry-1.docker.io" --docker_remove_delay="6hrs" --docker_socket="/var/run/docker.sock"
--docker_stop_timeout="0ns" --docker_store_dir="/tmp/mesos/store/docker" --docker_volume_checkpoint_dir="/var/run/mesos/isolators/docker/volume"
--enforce_container_disk_quota="false" --executor_registration_timeout="1mins" --executor_shutdown_grace_period="5secs"
--fetcher_cache_dir="/tmp/Endpoint_SlaveEndpointTest_NoAuthorizer_1_3kkVMT/fetch" --fetcher_cache_size="2GB"
--frameworks_home="" --gc_delay="1weeks" --gc_disk_headroom="0.1" --hadoop_home="" --help="false"
--hostname_lookup="true" --http_authenticators="basic" --http_command_executor="false" --http_credentials="/tmp/Endpoint_SlaveEndpointTest_NoAuthorizer_1_3kkVMT/http_credentials"
--image_provisioner_backend="copy" --initialize_driver_logging="true" --io_switchboard_enable_server="true"
--isolation="posix/cpu,posix/mem" --launcher="posix" --launcher_dir="/mesos/build/src" --logbufsecs="0"
--logging_level="INFO" --max_completed_executors_per_framework="150" --oversubscribed_resources_interval="15secs"
--perf_duration="10secs" --perf_interval="1mins" --qos_correction_interval_min="0ns" --quiet="false"
--recover="reconnect" --recovery_timeout="15mins" --registration_backoff_factor="10ms" --resources="cpus:2;gpus:0;mem:1024;disk:1024;ports:[31000-32000]"
--revocable_cpu_low_priority="true" --runtime_dir="/tmp/Endpoint_SlaveEndpointTest_NoAuthorizer_1_3kkVMT"
--sandbox_directory="/mnt/mesos/sandbox" --strict="true" --switch_user="true" --systemd_enable_support="true"
--systemd_runtime_directory="/run/systemd/system" --version="false" --work_dir="/tmp/Endpoint_SlaveEndpointTest_NoAuthorizer_1_LKdkMx"
I1207 06:44:25.255275 26729 credentials.hpp:86] Loading credential for authentication from
'/tmp/Endpoint_SlaveEndpointTest_NoAuthorizer_1_3kkVMT/credential'
I1207 06:44:25.255388 26729 slave.cpp:346] Agent using credential for: test-principal
I1207 06:44:25.255411 26729 credentials.hpp:37] Loading credentials for authentication from
'/tmp/Endpoint_SlaveEndpointTest_NoAuthorizer_1_3kkVMT/http_credentials'
I1207 06:44:25.255542 26729 http.cpp:922] Using default 'basic' HTTP authenticator for realm
'mesos-agent-readonly'
I1207 06:44:25.255594 26729 http.cpp:922] Using default 'basic' HTTP authenticator for realm
'mesos-agent-readwrite'
I1207 06:44:25.256062 26729 slave.cpp:533] Agent resources: cpus(*):2; mem(*):1024; disk(*):1024;
ports(*):[31000-32000]
I1207 06:44:25.256104 26729 slave.cpp:541] Agent attributes: [  ]
I1207 06:44:25.256115 26729 slave.cpp:546] Agent hostname: c59481c2ee67
I1207 06:44:25.256588 26728 state.cpp:57] Recovering state from '/tmp/Endpoint_SlaveEndpointTest_NoAuthorizer_1_LKdkMx/meta'
I1207 06:44:25.256736 26725 status_update_manager.cpp:203] Recovering status update manager
I1207 06:44:25.256868 26730 containerizer.cpp:581] Recovering containerizer
I1207 06:44:25.257496 26734 provisioner.cpp:253] Provisioner recovery complete
I1207 06:44:25.257753 26732 slave.cpp:5414] Finished recovery
I1207 06:44:25.258170 26732 slave.cpp:5588] Querying resource estimator for oversubscribable
resources
I1207 06:44:25.258311 26729 slave.cpp:5602] Received oversubscribable resources {} from the
resource estimator
I1207 06:44:25.258924 26723 process.cpp:3679] Handling HTTP event for process 'slave(658)'
with path: '/slave(658)/monitor/statistics.json'
I1207 06:44:25.259377 26731 http.cpp:874] Authorizing principal 'test-principal' to GET the
'/monitor/statistics.json' endpoint
I1207 06:44:25.260931 26720 slave.cpp:790] Agent terminating
[       OK ] Endpoint/SlaveEndpointTest.NoAuthorizer/1 (13 ms)
[ RUN      ] Endpoint/SlaveEndpointTest.NoAuthorizer/2
I1207 06:44:25.266949 26720 containerizer.cpp:207] Using isolation: posix/cpu,posix/mem,filesystem/posix,network/cni
W1207 06:44:25.267334 26720 backend.cpp:76] Failed to create 'aufs' backend: AufsBackend requires
root privileges, but is running as user mesos
W1207 06:44:25.267421 26720 backend.cpp:76] Failed to create 'bind' backend: BindBackend requires
root privileges
I1207 06:44:25.268075 26720 cluster.cpp:446] Creating default 'local' authorizer
I1207 06:44:25.268618 26723 slave.cpp:208] Mesos agent started on (659)@172.17.0.3:34436
I1207 06:44:25.268637 26723 slave.cpp:209] Flags at startup: --acls="" --appc_simple_discovery_uri_prefix="http://"
--appc_store_dir="/tmp/mesos/store/appc" --authenticate_http_readonly="true" --authenticate_http_readwrite="true"
--authenticatee="crammd5" --authentication_backoff_factor="1secs" --authorizer="local" --cgroups_cpu_enable_pids_and_tids_count="false"
--cgroups_enable_cfs="false" --cgroups_hierarchy="/sys/fs/cgroup" --cgroups_limit_swap="false"
--cgroups_root="mesos" --container_disk_watch_interval="15secs" --containerizers="mesos" --credential="/tmp/Endpoint_SlaveEndpointTest_NoAuthorizer_2_dQ11Wj/credential"
--default_role="*" --disk_watch_interval="1mins" --docker="docker" --docker_kill_orphans="true"
--docker_registry="https://registry-1.docker.io" --docker_remove_delay="6hrs" --docker_socket="/var/run/docker.sock"
--docker_stop_timeout="0ns" --docker_store_dir="/tmp/mesos/store/docker" --docker_volume_checkpoint_dir="/var/run/mesos/isolators/docker/volume"
--enforce_container_disk_quota="false" --executor_registration_timeout="1mins" --executor_shutdown_grace_period="5secs"
--fetcher_cache_dir="/tmp/Endpoint_SlaveEndpointTest_NoAuthorizer_2_dQ11Wj/fetch" --fetcher_cache_size="2GB"
--frameworks_home="" --gc_delay="1weeks" --gc_disk_headroom="0.1" --hadoop_home="" --help="false"
--hostname_lookup="true" --http_authenticators="basic" --http_command_executor="false" --http_credentials="/tmp/Endpoint_SlaveEndpointTest_NoAuthorizer_2_dQ11Wj/http_credentials"
--image_provisioner_backend="copy" --initialize_driver_logging="true" --io_switchboard_enable_server="true"
--isolation="posix/cpu,posix/mem" --launcher="posix" --launcher_dir="/mesos/build/src" --logbufsecs="0"
--logging_level="INFO" --max_completed_executors_per_framework="150" --oversubscribed_resources_interval="15secs"
--perf_duration="10secs" --perf_interval="1mins" --qos_correction_interval_min="0ns" --quiet="false"
--recover="reconnect" --recovery_timeout="15mins" --registration_backoff_factor="10ms" --resources="cpus:2;gpus:0;mem:1024;disk:1024;ports:[31000-32000]"
--revocable_cpu_low_priority="true" --runtime_dir="/tmp/Endpoint_SlaveEndpointTest_NoAuthorizer_2_dQ11Wj"
--sandbox_directory="/mnt/mesos/sandbox" --strict="true" --switch_user="true" --systemd_enable_support="true"
--systemd_runtime_directory="/run/systemd/system" --version="false" --work_dir="/tmp/Endpoint_SlaveEndpointTest_NoAuthorizer_2_pPR9TX"
I1207 06:44:25.269074 26723 credentials.hpp:86] Loading credential for authentication from
'/tmp/Endpoint_SlaveEndpointTest_NoAuthorizer_2_dQ11Wj/credential'
I1207 06:44:25.269178 26723 slave.cpp:346] Agent using credential for: test-principal
I1207 06:44:25.269197 26723 credentials.hpp:37] Loading credentials for authentication from
'/tmp/Endpoint_SlaveEndpointTest_NoAuthorizer_2_dQ11Wj/http_credentials'
I1207 06:44:25.269331 26723 http.cpp:922] Using default 'basic' HTTP authenticator for realm
'mesos-agent-readonly'
I1207 06:44:25.269381 26723 http.cpp:922] Using default 'basic' HTTP authenticator for realm
'mesos-agent-readwrite'
I1207 06:44:25.269778 26723 slave.cpp:533] Agent resources: cpus(*):2; mem(*):1024; disk(*):1024;
ports(*):[31000-32000]
I1207 06:44:25.269820 26723 slave.cpp:541] Agent attributes: [  ]
I1207 06:44:25.269827 26723 slave.cpp:546] Agent hostname: c59481c2ee67
I1207 06:44:25.270246 26726 state.cpp:57] Recovering state from '/tmp/Endpoint_SlaveEndpointTest_NoAuthorizer_2_pPR9TX/meta'
I1207 06:44:25.270480 26732 status_update_manager.cpp:203] Recovering status update manager
I1207 06:44:25.270658 26728 containerizer.cpp:581] Recovering containerizer
I1207 06:44:25.271268 26732 provisioner.cpp:253] Provisioner recovery complete
I1207 06:44:25.271513 26722 slave.cpp:5414] Finished recovery
I1207 06:44:25.271986 26722 slave.cpp:5588] Querying resource estimator for oversubscribable
resources
I1207 06:44:25.272315 26728 slave.cpp:5602] Received oversubscribable resources {} from the
resource estimator
I1207 06:44:25.273051 26733 process.cpp:3679] Handling HTTP event for process 'slave(659)'
with path: '/slave(659)/containers'
I1207 06:44:25.273633 26725 http.cpp:874] Authorizing principal 'test-principal' to GET the
'/containers' endpoint
I1207 06:44:25.275205 26723 slave.cpp:790] Agent terminating
[       OK ] Endpoint/SlaveEndpointTest.NoAuthorizer/2 (13 ms)
[----------] 9 tests from Endpoint/SlaveEndpointTest (155 ms total)

[----------] Global test environment tear-down
[==========] 1367 tests from 155 test cases ran. (765693 ms total)
[  PASSED  ] 1367 tests.

  YOU HAVE 9 DISABLED TESTS

Inconsistency detected by ld.so: dl-close.c: 762: _dl_close: Assertion `map->l_init_called'
failed!
make[3]: Leaving directory `/mesos/build'
make[3]: *** [CMakeFiles/check] Error 127
make[2]: *** [CMakeFiles/check.dir/all] Error 2
make[2]: Leaving directory `/mesos/build'
make[1]: Leaving directory `/mesos/build'
make[1]: *** [CMakeFiles/check.dir/rule] Error 2
make: *** [check] Error 2
+ docker rmi mesos-1481089330-15140
Untagged: mesos-1481089330-15140:latest
Deleted: sha256:d833b92b356216faf5f188869e88bd97f827d7f587a5d10bdaf7982bd1228d84
Deleted: sha256:0f1e106ac0105d2af62f8c7d34de8b874f82ce62db5e6dd4eea933ee8c4cd11f
Deleted: sha256:e6570d8e63fcee4f8f923353621dc60e9610dddafc3641defed871bf52fa2d96
Deleted: sha256:df0b82994bb439a4e6e232ecb5cd06d1c1054c9c5ee77f930c4f9587fbb0e007
Deleted: sha256:16a1a11b6a475ce3e12987581cac5362640c38b7945428e04770b945b600a585
Deleted: sha256:414b350727ffe6b3809a29de24c292560d9e3522bddd3be4e9cf4799517e78d5
Deleted: sha256:caae6d44c79af3f1d12b4d1085efdd06d94e49a4b0a098ddb7079884aab8445a
Deleted: sha256:86724048a04afda538d389454a152ed5de9fdc7f9f2ac8d131cb1d7e5d142906
Deleted: sha256:44d85341252747d43582375135acdfc9030fd8aa3c0f84c620a090c6fd551f44
Deleted: sha256:26ccb5ada4415b70f56a90ae434ac123be77bae88ca9a3e1b0dd97518d9ae73e
Deleted: sha256:0614b24eb094abc81017d10eb055354f700a536a9c0037ec9bd78587573d785d
Deleted: sha256:36e8958b14aea0c52afbd8150d97980d613ed18df0b31c880d3e584ca8840646
Deleted: sha256:758fb44e333e9931726de8e1227f145a7ca5acb05cd64564a9f42527e7b014b3
Deleted: sha256:aec2dda9aa183232d42cfacdd60c507c36e1bdb2510be9ee409bf9ddd03c8366
Deleted: sha256:6fbacd7f93b8f245d266a06b673c3f65979ae616940a7773c9213911f3caec30
Deleted: sha256:f69ea39a6b34ee580105da1fc7b46ce0ea6c827bfe844e35d5f1ead3e50c9d8f
Deleted: sha256:c3251f10895a83033b64eba1196b82ac3daaec861f5d5f1d5ba321e424fac161
Deleted: sha256:d783e10cf9727f632346ab67d01147ed575b77b697b333d3bd885b924aaa48d0
Deleted: sha256:8ec494e8ce49cc584ce3d12ce3abf4f12b8a7529203d2ad9c6c847a70d8fcaca
Deleted: sha256:a37a2c7ba8502728840a720c9161d4e9b80c62717b0b057bb9eef2df71e77816
Deleted: sha256:99b9052b8e7d55820756731427cc7d4fce549f5249a7b6f07e5843a56da85a15
Deleted: sha256:7dcd4e386f82eae686e0b75b57b80bb8f2b32d8c949253f947d121546c1b9c53
Deleted: sha256:898230e1339b2acd88ac3b1ea5a95d11047028b4d51aebaeb3e6f2c3dd39ca3f
Deleted: sha256:35d7c887465354f43d9a54c13580ffd906354574995db5de683ec4633004a190
Build step 'Execute shell' marked build as failure

Mime
View raw message