mesos-builds mailing list archives

Site index · List index
Message view « Date » · « Thread »
Top « Date » · « Thread »
From Apache Jenkins Server <jenk...@builds.apache.org>
Subject Build failed in Jenkins: Mesos » cmake,clang,--verbose --enable-libevent --enable-ssl,GLOG_v=1 MESOS_VERBOSE=1,ubuntu:14.04,(docker||Hadoop)&&(!ubuntu-us1)&&(!ubuntu-6)&&(!ubuntu-eu2) #3040
Date Fri, 16 Dec 2016 01:36:33 GMT
See <https://builds.apache.org/job/Mesos/BUILDTOOL=cmake,COMPILER=clang,CONFIGURATION=--verbose%20--enable-libevent%20--enable-ssl,ENVIRONMENT=GLOG_v=1%20MESOS_VERBOSE=1,OS=ubuntu%3A14.04,label_exp=(docker%7C%7CHadoop)&&(!ubuntu-us1)&&(!ubuntu-6)&&(!ubuntu-eu2)/3040/changes>

Changes:

[mpark] Specified that we search for the query parameter in the request body.

[josephwu] Fixed builds with HAS_AUTHENTICATION=false.

[josephwu] Windows: Added `recordio_tests.cpp` to test build.

[josephwu] Windows: Added Mesos tests to the build helper.

[josephwu] Windows: Disambiguated `os::write` by adding another overload.

------------------------------------------
[...truncated 167515 lines...]
[       OK ] Endpoint/SlaveEndpointTest.AuthorizedRequest/0 (15 ms)
[ RUN      ] Endpoint/SlaveEndpointTest.AuthorizedRequest/1
I1216 01:36:24.485561 25230 containerizer.cpp:220] Using isolation: posix/cpu,posix/mem,filesystem/posix,network/cni
W1216 01:36:24.485899 25230 backend.cpp:76] Failed to create 'aufs' backend: AufsBackend requires
root privileges, but is running as user mesos
W1216 01:36:24.485972 25230 backend.cpp:76] Failed to create 'bind' backend: BindBackend requires
root privileges
I1216 01:36:24.487208 25241 slave.cpp:209] Mesos agent started on (667)@172.17.0.4:55768
I1216 01:36:24.487293 25241 slave.cpp:210] Flags at startup: --acls="" --appc_simple_discovery_uri_prefix="http://"
--appc_store_dir="/tmp/mesos/store/appc" --authenticate_http_readonly="true" --authenticate_http_readwrite="true"
--authenticatee="crammd5" --authentication_backoff_factor="1secs" --authorizer="local" --cgroups_cpu_enable_pids_and_tids_count="false"
--cgroups_enable_cfs="false" --cgroups_hierarchy="/sys/fs/cgroup" --cgroups_limit_swap="false"
--cgroups_root="mesos" --container_disk_watch_interval="15secs" --containerizers="mesos" --credential="/tmp/Endpoint_SlaveEndpointTest_AuthorizedRequest_1_LG8Lwl/credential"
--default_role="*" --disk_watch_interval="1mins" --docker="docker" --docker_kill_orphans="true"
--docker_registry="https://registry-1.docker.io" --docker_remove_delay="6hrs" --docker_socket="/var/run/docker.sock"
--docker_stop_timeout="0ns" --docker_store_dir="/tmp/mesos/store/docker" --docker_volume_checkpoint_dir="/var/run/mesos/isolators/docker/volume"
--enforce_container_disk_quota="false" --executor_registration_timeout="1mins" --executor_shutdown_grace_period="5secs"
--fetcher_cache_dir="/tmp/Endpoint_SlaveEndpointTest_AuthorizedRequest_1_LG8Lwl/fetch" --fetcher_cache_size="2GB"
--frameworks_home="" --gc_delay="1weeks" --gc_disk_headroom="0.1" --hadoop_home="" --help="false"
--hostname_lookup="true" --http_authenticators="basic" --http_command_executor="false" --http_credentials="/tmp/Endpoint_SlaveEndpointTest_AuthorizedRequest_1_LG8Lwl/http_credentials"
--http_heartbeat_interval="30secs" --image_provisioner_backend="copy" --initialize_driver_logging="true"
--isolation="posix/cpu,posix/mem" --launcher="posix" --launcher_dir="/mesos/build/src" --logbufsecs="0"
--logging_level="INFO" --max_completed_executors_per_framework="150" --oversubscribed_resources_interval="15secs"
--perf_duration="10secs" --perf_interval="1mins" --qos_correction_interval_min="0ns" --quiet="false"
--recover="reconnect" --recovery_timeout="15mins" --registration_backoff_factor="10ms" --resources="cpus:2;gpus:0;mem:1024;disk:1024;ports:[31000-32000]"
--revocable_cpu_low_priority="true" --runtime_dir="/tmp/Endpoint_SlaveEndpointTest_AuthorizedRequest_1_LG8Lwl"
--sandbox_directory="/mnt/mesos/sandbox" --strict="true" --switch_user="true" --systemd_enable_support="true"
--systemd_runtime_directory="/run/systemd/system" --version="false" --work_dir="/tmp/Endpoint_SlaveEndpointTest_AuthorizedRequest_1_STHyLK"
I1216 01:36:24.487741 25241 credentials.hpp:86] Loading credential for authentication from
'/tmp/Endpoint_SlaveEndpointTest_AuthorizedRequest_1_LG8Lwl/credential'
I1216 01:36:24.487900 25241 slave.cpp:352] Agent using credential for: test-principal
I1216 01:36:24.487915 25241 credentials.hpp:37] Loading credentials for authentication from
'/tmp/Endpoint_SlaveEndpointTest_AuthorizedRequest_1_LG8Lwl/http_credentials'
I1216 01:36:24.488045 25241 http.cpp:922] Using default 'basic' HTTP authenticator for realm
'mesos-agent-readonly'
I1216 01:36:24.488106 25241 http.cpp:922] Using default 'basic' HTTP authenticator for realm
'mesos-agent-readwrite'
I1216 01:36:24.488521 25241 slave.cpp:539] Agent resources: cpus(*):2; mem(*):1024; disk(*):1024;
ports(*):[31000-32000]
I1216 01:36:24.488566 25241 slave.cpp:547] Agent attributes: [  ]
I1216 01:36:24.488576 25241 slave.cpp:552] Agent hostname: 996f3eb2ebf0
I1216 01:36:24.489030 25241 state.cpp:57] Recovering state from '/tmp/Endpoint_SlaveEndpointTest_AuthorizedRequest_1_STHyLK/meta'
I1216 01:36:24.489194 25233 status_update_manager.cpp:203] Recovering status update manager
I1216 01:36:24.489271 25233 containerizer.cpp:594] Recovering containerizer
I1216 01:36:24.489811 25233 provisioner.cpp:253] Provisioner recovery complete
I1216 01:36:24.489946 25233 slave.cpp:5408] Finished recovery
I1216 01:36:24.490373 25233 slave.cpp:5582] Querying resource estimator for oversubscribable
resources
I1216 01:36:24.490527 25233 slave.cpp:5596] Received oversubscribable resources {} from the
resource estimator
I1216 01:36:24.491500 25246 process.cpp:3679] Handling HTTP event for process 'slave(667)'
with path: '/slave(667)/monitor/statistics.json'
I1216 01:36:24.491906 25246 http.cpp:874] Authorizing principal 'test-principal' to GET the
'/monitor/statistics.json' endpoint
I1216 01:36:24.492981 25241 slave.cpp:796] Agent terminating
[       OK ] Endpoint/SlaveEndpointTest.AuthorizedRequest/1 (11 ms)
[ RUN      ] Endpoint/SlaveEndpointTest.AuthorizedRequest/2
I1216 01:36:24.497107 25230 containerizer.cpp:220] Using isolation: posix/cpu,posix/mem,filesystem/posix,network/cni
W1216 01:36:24.497490 25230 backend.cpp:76] Failed to create 'aufs' backend: AufsBackend requires
root privileges, but is running as user mesos
W1216 01:36:24.497668 25230 backend.cpp:76] Failed to create 'bind' backend: BindBackend requires
root privileges
I1216 01:36:24.499050 25232 slave.cpp:209] Mesos agent started on (668)@172.17.0.4:55768
I1216 01:36:24.499186 25232 slave.cpp:210] Flags at startup: --acls="" --appc_simple_discovery_uri_prefix="http://"
--appc_store_dir="/tmp/mesos/store/appc" --authenticate_http_readonly="true" --authenticate_http_readwrite="true"
--authenticatee="crammd5" --authentication_backoff_factor="1secs" --authorizer="local" --cgroups_cpu_enable_pids_and_tids_count="false"
--cgroups_enable_cfs="false" --cgroups_hierarchy="/sys/fs/cgroup" --cgroups_limit_swap="false"
--cgroups_root="mesos" --container_disk_watch_interval="15secs" --containerizers="mesos" --credential="/tmp/Endpoint_SlaveEndpointTest_AuthorizedRequest_2_nIrbGI/credential"
--default_role="*" --disk_watch_interval="1mins" --docker="docker" --docker_kill_orphans="true"
--docker_registry="https://registry-1.docker.io" --docker_remove_delay="6hrs" --docker_socket="/var/run/docker.sock"
--docker_stop_timeout="0ns" --docker_store_dir="/tmp/mesos/store/docker" --docker_volume_checkpoint_dir="/var/run/mesos/isolators/docker/volume"
--enforce_container_disk_quota="false" --executor_registration_timeout="1mins" --executor_shutdown_grace_period="5secs"
--fetcher_cache_dir="/tmp/Endpoint_SlaveEndpointTest_AuthorizedRequest_2_nIrbGI/fetch" --fetcher_cache_size="2GB"
--frameworks_home="" --gc_delay="1weeks" --gc_disk_headroom="0.1" --hadoop_home="" --help="false"
--hostname_lookup="true" --http_authenticators="basic" --http_command_executor="false" --http_credentials="/tmp/Endpoint_SlaveEndpointTest_AuthorizedRequest_2_nIrbGI/http_credentials"
--http_heartbeat_interval="30secs" --image_provisioner_backend="copy" --initialize_driver_logging="true"
--isolation="posix/cpu,posix/mem" --launcher="posix" --launcher_dir="/mesos/build/src" --logbufsecs="0"
--logging_level="INFO" --max_completed_executors_per_framework="150" --oversubscribed_resources_interval="15secs"
--perf_duration="10secs" --perf_interval="1mins" --qos_correction_interval_min="0ns" --quiet="false"
--recover="reconnect" --recovery_timeout="15mins" --registration_backoff_factor="10ms" --resources="cpus:2;gpus:0;mem:1024;disk:1024;ports:[31000-32000]"
--revocable_cpu_low_priority="true" --runtime_dir="/tmp/Endpoint_SlaveEndpointTest_AuthorizedRequest_2_nIrbGI"
--sandbox_directory="/mnt/mesos/sandbox" --strict="true" --switch_user="true" --systemd_enable_support="true"
--systemd_runtime_directory="/run/systemd/system" --version="false" --work_dir="/tmp/Endpoint_SlaveEndpointTest_AuthorizedRequest_2_sYR2S7"
I1216 01:36:24.499630 25232 credentials.hpp:86] Loading credential for authentication from
'/tmp/Endpoint_SlaveEndpointTest_AuthorizedRequest_2_nIrbGI/credential'
I1216 01:36:24.499836 25232 slave.cpp:352] Agent using credential for: test-principal
I1216 01:36:24.499933 25232 credentials.hpp:37] Loading credentials for authentication from
'/tmp/Endpoint_SlaveEndpointTest_AuthorizedRequest_2_nIrbGI/http_credentials'
I1216 01:36:24.500079 25232 http.cpp:922] Using default 'basic' HTTP authenticator for realm
'mesos-agent-readonly'
I1216 01:36:24.500180 25232 http.cpp:922] Using default 'basic' HTTP authenticator for realm
'mesos-agent-readwrite'
I1216 01:36:24.500618 25232 slave.cpp:539] Agent resources: cpus(*):2; mem(*):1024; disk(*):1024;
ports(*):[31000-32000]
I1216 01:36:24.500669 25232 slave.cpp:547] Agent attributes: [  ]
I1216 01:36:24.500680 25232 slave.cpp:552] Agent hostname: 996f3eb2ebf0
I1216 01:36:24.501422 25232 state.cpp:57] Recovering state from '/tmp/Endpoint_SlaveEndpointTest_AuthorizedRequest_2_sYR2S7/meta'
I1216 01:36:24.501583 25232 status_update_manager.cpp:203] Recovering status update manager
I1216 01:36:24.501646 25232 containerizer.cpp:594] Recovering containerizer
I1216 01:36:24.502248 25232 provisioner.cpp:253] Provisioner recovery complete
I1216 01:36:24.502405 25232 slave.cpp:5408] Finished recovery
I1216 01:36:24.502851 25232 slave.cpp:5582] Querying resource estimator for oversubscribable
resources
I1216 01:36:24.503017 25233 slave.cpp:5596] Received oversubscribable resources {} from the
resource estimator
I1216 01:36:24.503821 25238 process.cpp:3679] Handling HTTP event for process 'slave(668)'
with path: '/slave(668)/containers'
I1216 01:36:24.504190 25238 http.cpp:874] Authorizing principal 'test-principal' to GET the
'/containers' endpoint
I1216 01:36:24.505604 25240 slave.cpp:796] Agent terminating
[       OK ] Endpoint/SlaveEndpointTest.AuthorizedRequest/2 (14 ms)
[ RUN      ] Endpoint/SlaveEndpointTest.UnauthorizedRequest/0
I1216 01:36:24.511046 25230 containerizer.cpp:220] Using isolation: posix/cpu,posix/mem,filesystem/posix,network/cni
W1216 01:36:24.511437 25230 backend.cpp:76] Failed to create 'aufs' backend: AufsBackend requires
root privileges, but is running as user mesos
W1216 01:36:24.511538 25230 backend.cpp:76] Failed to create 'bind' backend: BindBackend requires
root privileges
I1216 01:36:24.513514 25239 slave.cpp:209] Mesos agent started on (669)@172.17.0.4:55768
I1216 01:36:24.513793 25239 slave.cpp:210] Flags at startup: --acls="" --appc_simple_discovery_uri_prefix="http://"
--appc_store_dir="/tmp/mesos/store/appc" --authenticate_http_readonly="true" --authenticate_http_readwrite="true"
--authenticatee="crammd5" --authentication_backoff_factor="1secs" --authorizer="local" --cgroups_cpu_enable_pids_and_tids_count="false"
--cgroups_enable_cfs="false" --cgroups_hierarchy="/sys/fs/cgroup" --cgroups_limit_swap="false"
--cgroups_root="mesos" --container_disk_watch_interval="15secs" --containerizers="mesos" --credential="/tmp/Endpoint_SlaveEndpointTest_UnauthorizedRequest_0_EoBlY5/credential"
--default_role="*" --disk_watch_interval="1mins" --docker="docker" --docker_kill_orphans="true"
--docker_registry="https://registry-1.docker.io" --docker_remove_delay="6hrs" --docker_socket="/var/run/docker.sock"
--docker_stop_timeout="0ns" --docker_store_dir="/tmp/mesos/store/docker" --docker_volume_checkpoint_dir="/var/run/mesos/isolators/docker/volume"
--enforce_container_disk_quota="false" --executor_registration_timeout="1mins" --executor_shutdown_grace_period="5secs"
--fetcher_cache_dir="/tmp/Endpoint_SlaveEndpointTest_UnauthorizedRequest_0_EoBlY5/fetch" --fetcher_cache_size="2GB"
--frameworks_home="" --gc_delay="1weeks" --gc_disk_headroom="0.1" --hadoop_home="" --help="false"
--hostname_lookup="true" --http_authenticators="basic" --http_command_executor="false" --http_credentials="/tmp/Endpoint_SlaveEndpointTest_UnauthorizedRequest_0_EoBlY5/http_credentials"
--http_heartbeat_interval="30secs" --image_provisioner_backend="copy" --initialize_driver_logging="true"
--isolation="posix/cpu,posix/mem" --launcher="posix" --launcher_dir="/mesos/build/src" --logbufsecs="0"
--logging_level="INFO" --max_completed_executors_per_framework="150" --oversubscribed_resources_interval="15secs"
--perf_duration="10secs" --perf_interval="1mins" --qos_correction_interval_min="0ns" --quiet="false"
--recover="reconnect" --recovery_timeout="15mins" --registration_backoff_factor="10ms" --resources="cpus:2;gpus:0;mem:1024;disk:1024;ports:[31000-32000]"
--revocable_cpu_low_priority="true" --runtime_dir="/tmp/Endpoint_SlaveEndpointTest_UnauthorizedRequest_0_EoBlY5"
--sandbox_directory="/mnt/mesos/sandbox" --strict="true" --switch_user="true" --systemd_enable_support="true"
--systemd_runtime_directory="/run/systemd/system" --version="false" --work_dir="/tmp/Endpoint_SlaveEndpointTest_UnauthorizedRequest_0_1QIX8u"
I1216 01:36:24.514058 25239 credentials.hpp:86] Loading credential for authentication from
'/tmp/Endpoint_SlaveEndpointTest_UnauthorizedRequest_0_EoBlY5/credential'
I1216 01:36:24.514204 25239 slave.cpp:352] Agent using credential for: test-principal
I1216 01:36:24.514238 25239 credentials.hpp:37] Loading credentials for authentication from
'/tmp/Endpoint_SlaveEndpointTest_UnauthorizedRequest_0_EoBlY5/http_credentials'
I1216 01:36:24.514384 25239 http.cpp:922] Using default 'basic' HTTP authenticator for realm
'mesos-agent-readonly'
I1216 01:36:24.514523 25239 http.cpp:922] Using default 'basic' HTTP authenticator for realm
'mesos-agent-readwrite'
I1216 01:36:24.514958 25239 slave.cpp:539] Agent resources: cpus(*):2; mem(*):1024; disk(*):1024;
ports(*):[31000-32000]
I1216 01:36:24.514993 25239 slave.cpp:547] Agent attributes: [  ]
I1216 01:36:24.515002 25239 slave.cpp:552] Agent hostname: 996f3eb2ebf0
I1216 01:36:24.515535 25234 state.cpp:57] Recovering state from '/tmp/Endpoint_SlaveEndpointTest_UnauthorizedRequest_0_1QIX8u/meta'
I1216 01:36:24.515735 25234 status_update_manager.cpp:203] Recovering status update manager
I1216 01:36:24.515801 25234 containerizer.cpp:594] Recovering containerizer
I1216 01:36:24.516234 25234 provisioner.cpp:253] Provisioner recovery complete
I1216 01:36:24.516360 25234 slave.cpp:5408] Finished recovery
I1216 01:36:24.516757 25234 slave.cpp:5582] Querying resource estimator for oversubscribable
resources
I1216 01:36:24.516934 25234 slave.cpp:5596] Received oversubscribable resources {} from the
resource estimator
I1216 01:36:24.517886 25241 process.cpp:3679] Handling HTTP event for process 'slave(669)'
with path: '/slave(669)/monitor/statistics'
I1216 01:36:24.518373 25238 http.cpp:874] Authorizing principal 'test-principal' to GET the
'/monitor/statistics' endpoint
I1216 01:36:24.519119 25234 slave.cpp:796] Agent terminating
[       OK ] Endpoint/SlaveEndpointTest.UnauthorizedRequest/0 (13 ms)
[ RUN      ] Endpoint/SlaveEndpointTest.UnauthorizedRequest/1
I1216 01:36:24.524811 25230 containerizer.cpp:220] Using isolation: posix/cpu,posix/mem,filesystem/posix,network/cni
W1216 01:36:24.525264 25230 backend.cpp:76] Failed to create 'aufs' backend: AufsBackend requires
root privileges, but is running as user mesos
W1216 01:36:24.525526 25230 backend.cpp:76] Failed to create 'bind' backend: BindBackend requires
root privileges
I1216 01:36:24.527482 25236 slave.cpp:209] Mesos agent started on (670)@172.17.0.4:55768
I1216 01:36:24.527508 25236 slave.cpp:210] Flags at startup: --acls="" --appc_simple_discovery_uri_prefix="http://"
--appc_store_dir="/tmp/mesos/store/appc" --authenticate_http_readonly="true" --authenticate_http_readwrite="true"
--authenticatee="crammd5" --authentication_backoff_factor="1secs" --authorizer="local" --cgroups_cpu_enable_pids_and_tids_count="false"
--cgroups_enable_cfs="false" --cgroups_hierarchy="/sys/fs/cgroup" --cgroups_limit_swap="false"
--cgroups_root="mesos" --container_disk_watch_interval="15secs" --containerizers="mesos" --credential="/tmp/Endpoint_SlaveEndpointTest_UnauthorizedRequest_1_80edpt/credential"
--default_role="*" --disk_watch_interval="1mins" --docker="docker" --docker_kill_orphans="true"
--docker_registry="https://registry-1.docker.io" --docker_remove_delay="6hrs" --docker_socket="/var/run/docker.sock"
--docker_stop_timeout="0ns" --docker_store_dir="/tmp/mesos/store/docker" --docker_volume_checkpoint_dir="/var/run/mesos/isolators/docker/volume"
--enforce_container_disk_quota="false" --executor_registration_timeout="1mins" --executor_shutdown_grace_period="5secs"
--fetcher_cache_dir="/tmp/Endpoint_SlaveEndpointTest_UnauthorizedRequest_1_80edpt/fetch" --fetcher_cache_size="2GB"
--frameworks_home="" --gc_delay="1weeks" --gc_disk_headroom="0.1" --hadoop_home="" --help="false"
--hostname_lookup="true" --http_authenticators="basic" --http_command_executor="false" --http_credentials="/tmp/Endpoint_SlaveEndpointTest_UnauthorizedRequest_1_80edpt/http_credentials"
--http_heartbeat_interval="30secs" --image_provisioner_backend="copy" --initialize_driver_logging="true"
--isolation="posix/cpu,posix/mem" --launcher="posix" --launcher_dir="/mesos/build/src" --logbufsecs="0"
--logging_level="INFO" --max_completed_executors_per_framework="150" --oversubscribed_resources_interval="15secs"
--perf_duration="10secs" --perf_interval="1mins" --qos_correction_interval_min="0ns" --quiet="false"
--recover="reconnect" --recovery_timeout="15mins" --registration_backoff_factor="10ms" --resources="cpus:2;gpus:0;mem:1024;disk:1024;ports:[31000-32000]"
--revocable_cpu_low_priority="true" --runtime_dir="/tmp/Endpoint_SlaveEndpointTest_UnauthorizedRequest_1_80edpt"
--sandbox_directory="/mnt/mesos/sandbox" --strict="true" --switch_user="true" --systemd_enable_support="true"
--systemd_runtime_directory="/run/systemd/system" --version="false" --work_dir="/tmp/Endpoint_SlaveEndpointTest_UnauthorizedRequest_1_wEGFxS"
I1216 01:36:24.527815 25236 credentials.hpp:86] Loading credential for authentication from
'/tmp/Endpoint_SlaveEndpointTest_UnauthorizedRequest_1_80edpt/credential'
I1216 01:36:24.527925 25236 slave.cpp:352] Agent using credential for: test-principal
I1216 01:36:24.527941 25236 credentials.hpp:37] Loading credentials for authentication from
'/tmp/Endpoint_SlaveEndpointTest_UnauthorizedRequest_1_80edpt/http_credentials'
I1216 01:36:24.528069 25236 http.cpp:922] Using default 'basic' HTTP authenticator for realm
'mesos-agent-readonly'
I1216 01:36:24.528138 25236 http.cpp:922] Using default 'basic' HTTP authenticator for realm
'mesos-agent-readwrite'
I1216 01:36:24.528470 25236 slave.cpp:539] Agent resources: cpus(*):2; mem(*):1024; disk(*):1024;
ports(*):[31000-32000]
I1216 01:36:24.528502 25236 slave.cpp:547] Agent attributes: [  ]
I1216 01:36:24.528511 25236 slave.cpp:552] Agent hostname: 996f3eb2ebf0
I1216 01:36:24.528910 25233 state.cpp:57] Recovering state from '/tmp/Endpoint_SlaveEndpointTest_UnauthorizedRequest_1_wEGFxS/meta'
I1216 01:36:24.529068 25233 status_update_manager.cpp:203] Recovering status update manager
I1216 01:36:24.529139 25233 containerizer.cpp:594] Recovering containerizer
I1216 01:36:24.529711 25233 provisioner.cpp:253] Provisioner recovery complete
I1216 01:36:24.529860 25233 slave.cpp:5408] Finished recovery
I1216 01:36:24.530534 25233 slave.cpp:5582] Querying resource estimator for oversubscribable
resources
I1216 01:36:24.530648 25233 slave.cpp:5596] Received oversubscribable resources {} from the
resource estimator
I1216 01:36:24.531440 25234 process.cpp:3679] Handling HTTP event for process 'slave(670)'
with path: '/slave(670)/monitor/statistics.json'
I1216 01:36:24.531883 25234 http.cpp:874] Authorizing principal 'test-principal' to GET the
'/monitor/statistics.json' endpoint
I1216 01:36:24.532811 25230 slave.cpp:796] Agent terminating
[       OK ] Endpoint/SlaveEndpointTest.UnauthorizedRequest/1 (24 ms)
[ RUN      ] Endpoint/SlaveEndpointTest.UnauthorizedRequest/2
I1216 01:36:24.549154 25230 containerizer.cpp:220] Using isolation: posix/cpu,posix/mem,filesystem/posix,network/cni
W1216 01:36:24.549584 25230 backend.cpp:76] Failed to create 'aufs' backend: AufsBackend requires
root privileges, but is running as user mesos
W1216 01:36:24.549690 25230 backend.cpp:76] Failed to create 'bind' backend: BindBackend requires
root privileges
I1216 01:36:24.551532 25244 slave.cpp:209] Mesos agent started on (671)@172.17.0.4:55768
I1216 01:36:24.551565 25244 slave.cpp:210] Flags at startup: --acls="" --appc_simple_discovery_uri_prefix="http://"
--appc_store_dir="/tmp/mesos/store/appc" --authenticate_http_readonly="true" --authenticate_http_readwrite="true"
--authenticatee="crammd5" --authentication_backoff_factor="1secs" --authorizer="local" --cgroups_cpu_enable_pids_and_tids_count="false"
--cgroups_enable_cfs="false" --cgroups_hierarchy="/sys/fs/cgroup" --cgroups_limit_swap="false"
--cgroups_root="mesos" --container_disk_watch_interval="15secs" --containerizers="mesos" --credential="/tmp/Endpoint_SlaveEndpointTest_UnauthorizedRequest_2_vR063Q/credential"
--default_role="*" --disk_watch_interval="1mins" --docker="docker" --docker_kill_orphans="true"
--docker_registry="https://registry-1.docker.io" --docker_remove_delay="6hrs" --docker_socket="/var/run/docker.sock"
--docker_stop_timeout="0ns" --docker_store_dir="/tmp/mesos/store/docker" --docker_volume_checkpoint_dir="/var/run/mesos/isolators/docker/volume"
--enforce_container_disk_quota="false" --executor_registration_timeout="1mins" --executor_shutdown_grace_period="5secs"
--fetcher_cache_dir="/tmp/Endpoint_SlaveEndpointTest_UnauthorizedRequest_2_vR063Q/fetch" --fetcher_cache_size="2GB"
--frameworks_home="" --gc_delay="1weeks" --gc_disk_headroom="0.1" --hadoop_home="" --help="false"
--hostname_lookup="true" --http_authenticators="basic" --http_command_executor="false" --http_credentials="/tmp/Endpoint_SlaveEndpointTest_UnauthorizedRequest_2_vR063Q/http_credentials"
--http_heartbeat_interval="30secs" --image_provisioner_backend="copy" --initialize_driver_logging="true"
--isolation="posix/cpu,posix/mem" --launcher="posix" --launcher_dir="/mesos/build/src" --logbufsecs="0"
--logging_level="INFO" --max_completed_executors_per_framework="150" --oversubscribed_resources_interval="15secs"
--perf_duration="10secs" --perf_interval="1mins" --qos_correction_interval_min="0ns" --quiet="false"
--recover="reconnect" --recovery_timeout="15mins" --registration_backoff_factor="10ms" --resources="cpus:2;gpus:0;mem:1024;disk:1024;ports:[31000-32000]"
--revocable_cpu_low_priority="true" --runtime_dir="/tmp/Endpoint_SlaveEndpointTest_UnauthorizedRequest_2_vR063Q"
--sandbox_directory="/mnt/mesos/sandbox" --strict="true" --switch_user="true" --systemd_enable_support="true"
--systemd_runtime_directory="/run/systemd/system" --version="false" --work_dir="/tmp/Endpoint_SlaveEndpointTest_UnauthorizedRequest_2_kd6C8f"
I1216 01:36:24.551913 25244 credentials.hpp:86] Loading credential for authentication from
'/tmp/Endpoint_SlaveEndpointTest_UnauthorizedRequest_2_vR063Q/credential'
I1216 01:36:24.552048 25244 slave.cpp:352] Agent using credential for: test-principal
I1216 01:36:24.552064 25244 credentials.hpp:37] Loading credentials for authentication from
'/tmp/Endpoint_SlaveEndpointTest_UnauthorizedRequest_2_vR063Q/http_credentials'
I1216 01:36:24.552191 25244 http.cpp:922] Using default 'basic' HTTP authenticator for realm
'mesos-agent-readonly'
I1216 01:36:24.552245 25244 http.cpp:922] Using default 'basic' HTTP authenticator for realm
'mesos-agent-readwrite'
I1216 01:36:24.552624 25244 slave.cpp:539] Agent resources: cpus(*):2; mem(*):1024; disk(*):1024;
ports(*):[31000-32000]
I1216 01:36:24.552657 25244 slave.cpp:547] Agent attributes: [  ]
I1216 01:36:24.552661 25244 slave.cpp:552] Agent hostname: 996f3eb2ebf0
I1216 01:36:24.553261 25244 state.cpp:57] Recovering state from '/tmp/Endpoint_SlaveEndpointTest_UnauthorizedRequest_2_kd6C8f/meta'
I1216 01:36:24.553411 25244 status_update_manager.cpp:203] Recovering status update manager
I1216 01:36:24.553478 25244 containerizer.cpp:594] Recovering containerizer
I1216 01:36:24.553972 25244 provisioner.cpp:253] Provisioner recovery complete
I1216 01:36:24.554116 25244 slave.cpp:5408] Finished recovery
I1216 01:36:24.554559 25244 slave.cpp:5582] Querying resource estimator for oversubscribable
resources
I1216 01:36:24.554718 25244 slave.cpp:5596] Received oversubscribable resources {} from the
resource estimator
I1216 01:36:24.555763 25240 process.cpp:3679] Handling HTTP event for process 'slave(671)'
with path: '/slave(671)/containers'
I1216 01:36:24.556249 25232 http.cpp:874] Authorizing principal 'test-principal' to GET the
'/containers' endpoint
I1216 01:36:24.557485 25230 slave.cpp:796] Agent terminating
[       OK ] Endpoint/SlaveEndpointTest.UnauthorizedRequest/2 (14 ms)
[ RUN      ] Endpoint/SlaveEndpointTest.NoAuthorizer/0
I1216 01:36:24.562950 25230 containerizer.cpp:220] Using isolation: posix/cpu,posix/mem,filesystem/posix,network/cni
W1216 01:36:24.563364 25230 backend.cpp:76] Failed to create 'aufs' backend: AufsBackend requires
root privileges, but is running as user mesos
W1216 01:36:24.563454 25230 backend.cpp:76] Failed to create 'bind' backend: BindBackend requires
root privileges
I1216 01:36:24.564373 25230 cluster.cpp:446] Creating default 'local' authorizer
I1216 01:36:24.565454 25235 slave.cpp:209] Mesos agent started on (672)@172.17.0.4:55768
I1216 01:36:24.565524 25235 slave.cpp:210] Flags at startup: --acls="" --appc_simple_discovery_uri_prefix="http://"
--appc_store_dir="/tmp/mesos/store/appc" --authenticate_http_readonly="true" --authenticate_http_readwrite="true"
--authenticatee="crammd5" --authentication_backoff_factor="1secs" --authorizer="local" --cgroups_cpu_enable_pids_and_tids_count="false"
--cgroups_enable_cfs="false" --cgroups_hierarchy="/sys/fs/cgroup" --cgroups_limit_swap="false"
--cgroups_root="mesos" --container_disk_watch_interval="15secs" --containerizers="mesos" --credential="/tmp/Endpoint_SlaveEndpointTest_NoAuthorizer_0_zzJDTe/credential"
--default_role="*" --disk_watch_interval="1mins" --docker="docker" --docker_kill_orphans="true"
--docker_registry="https://registry-1.docker.io" --docker_remove_delay="6hrs" --docker_socket="/var/run/docker.sock"
--docker_stop_timeout="0ns" --docker_store_dir="/tmp/mesos/store/docker" --docker_volume_checkpoint_dir="/var/run/mesos/isolators/docker/volume"
--enforce_container_disk_quota="false" --executor_registration_timeout="1mins" --executor_shutdown_grace_period="5secs"
--fetcher_cache_dir="/tmp/Endpoint_SlaveEndpointTest_NoAuthorizer_0_zzJDTe/fetch" --fetcher_cache_size="2GB"
--frameworks_home="" --gc_delay="1weeks" --gc_disk_headroom="0.1" --hadoop_home="" --help="false"
--hostname_lookup="true" --http_authenticators="basic" --http_command_executor="false" --http_credentials="/tmp/Endpoint_SlaveEndpointTest_NoAuthorizer_0_zzJDTe/http_credentials"
--http_heartbeat_interval="30secs" --image_provisioner_backend="copy" --initialize_driver_logging="true"
--isolation="posix/cpu,posix/mem" --launcher="posix" --launcher_dir="/mesos/build/src" --logbufsecs="0"
--logging_level="INFO" --max_completed_executors_per_framework="150" --oversubscribed_resources_interval="15secs"
--perf_duration="10secs" --perf_interval="1mins" --qos_correction_interval_min="0ns" --quiet="false"
--recover="reconnect" --recovery_timeout="15mins" --registration_backoff_factor="10ms" --resources="cpus:2;gpus:0;mem:1024;disk:1024;ports:[31000-32000]"
--revocable_cpu_low_priority="true" --runtime_dir="/tmp/Endpoint_SlaveEndpointTest_NoAuthorizer_0_zzJDTe"
--sandbox_directory="/mnt/mesos/sandbox" --strict="true" --switch_user="true" --systemd_enable_support="true"
--systemd_runtime_directory="/run/systemd/system" --version="false" --work_dir="/tmp/Endpoint_SlaveEndpointTest_NoAuthorizer_0_G2VUVD"
I1216 01:36:24.565964 25235 credentials.hpp:86] Loading credential for authentication from
'/tmp/Endpoint_SlaveEndpointTest_NoAuthorizer_0_zzJDTe/credential'
I1216 01:36:24.566157 25235 slave.cpp:352] Agent using credential for: test-principal
I1216 01:36:24.566336 25235 credentials.hpp:37] Loading credentials for authentication from
'/tmp/Endpoint_SlaveEndpointTest_NoAuthorizer_0_zzJDTe/http_credentials'
I1216 01:36:24.566582 25235 http.cpp:922] Using default 'basic' HTTP authenticator for realm
'mesos-agent-readonly'
I1216 01:36:24.566757 25235 http.cpp:922] Using default 'basic' HTTP authenticator for realm
'mesos-agent-readwrite'
I1216 01:36:24.567258 25235 slave.cpp:539] Agent resources: cpus(*):2; mem(*):1024; disk(*):1024;
ports(*):[31000-32000]
I1216 01:36:24.567291 25235 slave.cpp:547] Agent attributes: [  ]
I1216 01:36:24.567299 25235 slave.cpp:552] Agent hostname: 996f3eb2ebf0
I1216 01:36:24.567806 25242 state.cpp:57] Recovering state from '/tmp/Endpoint_SlaveEndpointTest_NoAuthorizer_0_G2VUVD/meta'
I1216 01:36:24.567914 25242 status_update_manager.cpp:203] Recovering status update manager
I1216 01:36:24.568155 25235 containerizer.cpp:594] Recovering containerizer
I1216 01:36:24.568738 25240 provisioner.cpp:253] Provisioner recovery complete
I1216 01:36:24.568964 25240 slave.cpp:5408] Finished recovery
I1216 01:36:24.569542 25240 slave.cpp:5582] Querying resource estimator for oversubscribable
resources
I1216 01:36:24.569784 25241 slave.cpp:5596] Received oversubscribable resources {} from the
resource estimator
I1216 01:36:24.570613 25240 process.cpp:3679] Handling HTTP event for process 'slave(672)'
with path: '/slave(672)/monitor/statistics'
I1216 01:36:24.571089 25232 http.cpp:874] Authorizing principal 'test-principal' to GET the
'/monitor/statistics' endpoint
I1216 01:36:24.572635 25232 slave.cpp:796] Agent terminating
[       OK ] Endpoint/SlaveEndpointTest.NoAuthorizer/0 (18 ms)
[ RUN      ] Endpoint/SlaveEndpointTest.NoAuthorizer/1
I1216 01:36:24.580322 25230 containerizer.cpp:220] Using isolation: posix/cpu,posix/mem,filesystem/posix,network/cni
W1216 01:36:24.580626 25230 backend.cpp:76] Failed to create 'aufs' backend: AufsBackend requires
root privileges, but is running as user mesos
W1216 01:36:24.580718 25230 backend.cpp:76] Failed to create 'bind' backend: BindBackend requires
root privileges
I1216 01:36:24.581411 25230 cluster.cpp:446] Creating default 'local' authorizer
I1216 01:36:24.582087 25246 slave.cpp:209] Mesos agent started on (673)@172.17.0.4:55768
I1216 01:36:24.582125 25246 slave.cpp:210] Flags at startup: --acls="" --appc_simple_discovery_uri_prefix="http://"
--appc_store_dir="/tmp/mesos/store/appc" --authenticate_http_readonly="true" --authenticate_http_readwrite="true"
--authenticatee="crammd5" --authentication_backoff_factor="1secs" --authorizer="local" --cgroups_cpu_enable_pids_and_tids_count="false"
--cgroups_enable_cfs="false" --cgroups_hierarchy="/sys/fs/cgroup" --cgroups_limit_swap="false"
--cgroups_root="mesos" --container_disk_watch_interval="15secs" --containerizers="mesos" --credential="/tmp/Endpoint_SlaveEndpointTest_NoAuthorizer_1_IPVoUC/credential"
--default_role="*" --disk_watch_interval="1mins" --docker="docker" --docker_kill_orphans="true"
--docker_registry="https://registry-1.docker.io" --docker_remove_delay="6hrs" --docker_socket="/var/run/docker.sock"
--docker_stop_timeout="0ns" --docker_store_dir="/tmp/mesos/store/docker" --docker_volume_checkpoint_dir="/var/run/mesos/isolators/docker/volume"
--enforce_container_disk_quota="false" --executor_registration_timeout="1mins" --executor_shutdown_grace_period="5secs"
--fetcher_cache_dir="/tmp/Endpoint_SlaveEndpointTest_NoAuthorizer_1_IPVoUC/fetch" --fetcher_cache_size="2GB"
--frameworks_home="" --gc_delay="1weeks" --gc_disk_headroom="0.1" --hadoop_home="" --help="false"
--hostname_lookup="true" --http_authenticators="basic" --http_command_executor="false" --http_credentials="/tmp/Endpoint_SlaveEndpointTest_NoAuthorizer_1_IPVoUC/http_credentials"
--http_heartbeat_interval="30secs" --image_provisioner_backend="copy" --initialize_driver_logging="true"
--isolation="posix/cpu,posix/mem" --launcher="posix" --launcher_dir="/mesos/build/src" --logbufsecs="0"
--logging_level="INFO" --max_completed_executors_per_framework="150" --oversubscribed_resources_interval="15secs"
--perf_duration="10secs" --perf_interval="1mins" --qos_correction_interval_min="0ns" --quiet="false"
--recover="reconnect" --recovery_timeout="15mins" --registration_backoff_factor="10ms" --resources="cpus:2;gpus:0;mem:1024;disk:1024;ports:[31000-32000]"
--revocable_cpu_low_priority="true" --runtime_dir="/tmp/Endpoint_SlaveEndpointTest_NoAuthorizer_1_IPVoUC"
--sandbox_directory="/mnt/mesos/sandbox" --strict="true" --switch_user="true" --systemd_enable_support="true"
--systemd_runtime_directory="/run/systemd/system" --version="false" --work_dir="/tmp/Endpoint_SlaveEndpointTest_NoAuthorizer_1_mo7LT1"
I1216 01:36:24.582557 25246 credentials.hpp:86] Loading credential for authentication from
'/tmp/Endpoint_SlaveEndpointTest_NoAuthorizer_1_IPVoUC/credential'
I1216 01:36:24.582717 25246 slave.cpp:352] Agent using credential for: test-principal
I1216 01:36:24.582837 25246 credentials.hpp:37] Loading credentials for authentication from
'/tmp/Endpoint_SlaveEndpointTest_NoAuthorizer_1_IPVoUC/http_credentials'
I1216 01:36:24.583055 25246 http.cpp:922] Using default 'basic' HTTP authenticator for realm
'mesos-agent-readonly'
I1216 01:36:24.583134 25246 http.cpp:922] Using default 'basic' HTTP authenticator for realm
'mesos-agent-readwrite'
I1216 01:36:24.583645 25246 slave.cpp:539] Agent resources: cpus(*):2; mem(*):1024; disk(*):1024;
ports(*):[31000-32000]
I1216 01:36:24.583679 25246 slave.cpp:547] Agent attributes: [  ]
I1216 01:36:24.583688 25246 slave.cpp:552] Agent hostname: 996f3eb2ebf0
I1216 01:36:24.584367 25243 state.cpp:57] Recovering state from '/tmp/Endpoint_SlaveEndpointTest_NoAuthorizer_1_mo7LT1/meta'
I1216 01:36:24.584528 25235 status_update_manager.cpp:203] Recovering status update manager
I1216 01:36:24.584822 25243 containerizer.cpp:594] Recovering containerizer
I1216 01:36:24.585346 25237 provisioner.cpp:253] Provisioner recovery complete
I1216 01:36:24.585490 25234 slave.cpp:5408] Finished recovery
I1216 01:36:24.585883 25234 slave.cpp:5582] Querying resource estimator for oversubscribable
resources
I1216 01:36:24.586002 25234 slave.cpp:5596] Received oversubscribable resources {} from the
resource estimator
I1216 01:36:24.586869 25246 process.cpp:3679] Handling HTTP event for process 'slave(673)'
with path: '/slave(673)/monitor/statistics.json'
I1216 01:36:24.587365 25238 http.cpp:874] Authorizing principal 'test-principal' to GET the
'/monitor/statistics.json' endpoint
I1216 01:36:24.588836 25230 slave.cpp:796] Agent terminating
[       OK ] Endpoint/SlaveEndpointTest.NoAuthorizer/1 (12 ms)
[ RUN      ] Endpoint/SlaveEndpointTest.NoAuthorizer/2
I1216 01:36:24.593763 25230 containerizer.cpp:220] Using isolation: posix/cpu,posix/mem,filesystem/posix,network/cni
W1216 01:36:24.594123 25230 backend.cpp:76] Failed to create 'aufs' backend: AufsBackend requires
root privileges, but is running as user mesos
W1216 01:36:24.594216 25230 backend.cpp:76] Failed to create 'bind' backend: BindBackend requires
root privileges
I1216 01:36:24.594985 25230 cluster.cpp:446] Creating default 'local' authorizer
I1216 01:36:24.595465 25242 slave.cpp:209] Mesos agent started on (674)@172.17.0.4:55768
I1216 01:36:24.595494 25242 slave.cpp:210] Flags at startup: --acls="" --appc_simple_discovery_uri_prefix="http://"
--appc_store_dir="/tmp/mesos/store/appc" --authenticate_http_readonly="true" --authenticate_http_readwrite="true"
--authenticatee="crammd5" --authentication_backoff_factor="1secs" --authorizer="local" --cgroups_cpu_enable_pids_and_tids_count="false"
--cgroups_enable_cfs="false" --cgroups_hierarchy="/sys/fs/cgroup" --cgroups_limit_swap="false"
--cgroups_root="mesos" --container_disk_watch_interval="15secs" --containerizers="mesos" --credential="/tmp/Endpoint_SlaveEndpointTest_NoAuthorizer_2_oBte40/credential"
--default_role="*" --disk_watch_interval="1mins" --docker="docker" --docker_kill_orphans="true"
--docker_registry="https://registry-1.docker.io" --docker_remove_delay="6hrs" --docker_socket="/var/run/docker.sock"
--docker_stop_timeout="0ns" --docker_store_dir="/tmp/mesos/store/docker" --docker_volume_checkpoint_dir="/var/run/mesos/isolators/docker/volume"
--enforce_container_disk_quota="false" --executor_registration_timeout="1mins" --executor_shutdown_grace_period="5secs"
--fetcher_cache_dir="/tmp/Endpoint_SlaveEndpointTest_NoAuthorizer_2_oBte40/fetch" --fetcher_cache_size="2GB"
--frameworks_home="" --gc_delay="1weeks" --gc_disk_headroom="0.1" --hadoop_home="" --help="false"
--hostname_lookup="true" --http_authenticators="basic" --http_command_executor="false" --http_credentials="/tmp/Endpoint_SlaveEndpointTest_NoAuthorizer_2_oBte40/http_credentials"
--http_heartbeat_interval="30secs" --image_provisioner_backend="copy" --initialize_driver_logging="true"
--isolation="posix/cpu,posix/mem" --launcher="posix" --launcher_dir="/mesos/build/src" --logbufsecs="0"
--logging_level="INFO" --max_completed_executors_per_framework="150" --oversubscribed_resources_interval="15secs"
--perf_duration="10secs" --perf_interval="1mins" --qos_correction_interval_min="0ns" --quiet="false"
--recover="reconnect" --recovery_timeout="15mins" --registration_backoff_factor="10ms" --resources="cpus:2;gpus:0;mem:1024;disk:1024;ports:[31000-32000]"
--revocable_cpu_low_priority="true" --runtime_dir="/tmp/Endpoint_SlaveEndpointTest_NoAuthorizer_2_oBte40"
--sandbox_directory="/mnt/mesos/sandbox" --strict="true" --switch_user="true" --systemd_enable_support="true"
--systemd_runtime_directory="/run/systemd/system" --version="false" --work_dir="/tmp/Endpoint_SlaveEndpointTest_NoAuthorizer_2_9Vts1p"
I1216 01:36:24.595954 25242 credentials.hpp:86] Loading credential for authentication from
'/tmp/Endpoint_SlaveEndpointTest_NoAuthorizer_2_oBte40/credential'
I1216 01:36:24.596223 25242 slave.cpp:352] Agent using credential for: test-principal
I1216 01:36:24.596261 25242 credentials.hpp:37] Loading credentials for authentication from
'/tmp/Endpoint_SlaveEndpointTest_NoAuthorizer_2_oBte40/http_credentials'
I1216 01:36:24.596585 25242 http.cpp:922] Using default 'basic' HTTP authenticator for realm
'mesos-agent-readonly'
I1216 01:36:24.596693 25242 http.cpp:922] Using default 'basic' HTTP authenticator for realm
'mesos-agent-readwrite'
I1216 01:36:24.597160 25242 slave.cpp:539] Agent resources: cpus(*):2; mem(*):1024; disk(*):1024;
ports(*):[31000-32000]
I1216 01:36:24.597203 25242 slave.cpp:547] Agent attributes: [  ]
I1216 01:36:24.597213 25242 slave.cpp:552] Agent hostname: 996f3eb2ebf0
I1216 01:36:24.597774 25231 state.cpp:57] Recovering state from '/tmp/Endpoint_SlaveEndpointTest_NoAuthorizer_2_9Vts1p/meta'
I1216 01:36:24.597931 25237 status_update_manager.cpp:203] Recovering status update manager
I1216 01:36:24.598096 25245 containerizer.cpp:594] Recovering containerizer
I1216 01:36:24.598644 25234 provisioner.cpp:253] Provisioner recovery complete
I1216 01:36:24.599006 25243 slave.cpp:5408] Finished recovery
I1216 01:36:24.599464 25243 slave.cpp:5582] Querying resource estimator for oversubscribable
resources
I1216 01:36:24.599743 25243 slave.cpp:5596] Received oversubscribable resources {} from the
resource estimator
I1216 01:36:24.600469 25242 process.cpp:3679] Handling HTTP event for process 'slave(674)'
with path: '/slave(674)/containers'
I1216 01:36:24.600852 25242 http.cpp:874] Authorizing principal 'test-principal' to GET the
'/containers' endpoint
I1216 01:36:24.602133 25230 slave.cpp:796] Agent terminating
[       OK ] Endpoint/SlaveEndpointTest.NoAuthorizer/2 (13 ms)
[----------] 9 tests from Endpoint/SlaveEndpointTest (138 ms total)

[----------] Global test environment tear-down
[==========] 1390 tests from 158 test cases ran. (176575 ms total)
[  PASSED  ] 1389 tests.
[  FAILED  ] 1 test, listed below:
[  FAILED  ] IOSwitchboardTest.KillSwitchboardContainerDestroyed

 1 FAILED TEST
  YOU HAVE 9 DISABLED TESTS

make[3]: *** [CMakeFiles/check] Error 1
make[3]: Leaving directory `/mesos/build'
make[2]: Leaving directory `/mesos/build'
make[2]: *** [CMakeFiles/check.dir/all] Error 2
make[1]: *** [CMakeFiles/check.dir/rule] Error 2
make[1]: Leaving directory `/mesos/build'
make: *** [check] Error 2
+ docker rmi mesos-1481850064-5240
Untagged: mesos-1481850064-5240:latest
Deleted: sha256:350abd5854e482c8aa7953125604f824729f9d44f70d9d4da73d3f52d708559a
Deleted: sha256:6be6ec26426812f9a9fa0eff6cd4d2119279f4e18dd7ab5fd6a6978ce764ea5b
Deleted: sha256:8ca93ec58f3f3356eb5e228a07970997657aa91c59c844b78e29ac9763f338b3
Deleted: sha256:17ef99e4a806ccd238e600a787518a36bce203112269520a2df06852e9290ba7
Deleted: sha256:d26cc24c247c50b40d4ae32cf9b4a182ab7ac413d677d8a8deeac512502d191f
Deleted: sha256:4afe2f3f313963d627b816886edbd4e6810f416dbc742afd74de4e90d7af7c79
Deleted: sha256:d4fe07644ed11de48ea3997cb6c452344fe61987081f1ace8b0d3adbfa5afb7a
Deleted: sha256:d0796b756018f5d3e6715a1c7e9d2419a3eed545383ba6e3d4ce106b76539f85
Deleted: sha256:e86790b4c212173c14e0532aadcae6b7f2905f805d4919d2d3805b84ef294d4e
Deleted: sha256:068d7be70925549b809ea577d457f615d357e403adff53c402160db429088499
Deleted: sha256:40dff8b76a8d9abfd7d5e32407a7fc0b1aa7324cb4e0073262523761d87be5d9
Deleted: sha256:f1e99d97a3d3d74d58e69bd66ee9e4185219e94584a6bba69a6ba07cb95f78c9
Deleted: sha256:250ae33ae6a4a83dcdbeb288385e7ec4ca671e2c45d360c416f41582027ddd9e
Deleted: sha256:3c2a80bbb8cf62dff685498c602255014f46551ebd7a99e6c5c75d6c4d186f8f
Deleted: sha256:22ba29651401550ceeb12393700c7e1ae62fc537ccb4f15b99f5b5565e76197c
Deleted: sha256:29fe7726916ea231d22e73e85d0557de63d5c2719e210ed8c7d40c62b7a7d4a0
Deleted: sha256:8b1f09b9150f49f97455a89e49e25280fe424c5873909079ab88f895d538135c
Deleted: sha256:4bb16152b649b82c23d92bcac2787983978fe22295ab89c5aca901989fe4a608
Deleted: sha256:cf2f8d9e5876e944a2084c29e85f90c4f4e2a89693cbe04f911eab1de75b58d4
Deleted: sha256:3f05d3eca7c26bf1e5c9be98c38a66f4e2b0d51a10ae662ec17aff98501f9b9f
Deleted: sha256:8139d52b1d635db2767ee7a042d346562807692ab06c37f6b1da917ecd6f2ce0
Deleted: sha256:a876ca40b4524f6871de33f17a600a899d6462b016ae19cdf4b947383b0a8184
Deleted: sha256:4fba2d931d9cec647e84fe71a7790b026f22653d24e3ad5091a2dce6a98c69f8
Deleted: sha256:87b1fcab95520db4c0715242d4dc9bd0fd908008d17184041868a7fbe7a701e1
Build step 'Execute shell' marked build as failure

Mime
View raw message