mesos-builds mailing list archives

Site index · List index
Message view « Date » · « Thread »
Top « Date » · « Thread »
From Apache Jenkins Server <jenk...@builds.apache.org>
Subject Build failed in Jenkins: Mesos » cmake,clang,--verbose,GLOG_v=1 MESOS_VERBOSE=1,ubuntu:14.04,(docker||Hadoop)&&(!ubuntu-us1)&&(!ubuntu-6)&&(!ubuntu-eu2) #3000
Date Thu, 01 Dec 2016 19:21:22 GMT
See <https://builds.apache.org/job/Mesos/BUILDTOOL=cmake,COMPILER=clang,CONFIGURATION=--verbose,ENVIRONMENT=GLOG_v=1%20MESOS_VERBOSE=1,OS=ubuntu%3A14.04,label_exp=(docker%7C%7CHadoop)&&(!ubuntu-us1)&&(!ubuntu-6)&&(!ubuntu-eu2)/3000/changes>

Changes:

[anand] Introduced streaming content types.

[anand] Made `serialize()`/`deserialize()` handle streaming content types.

[anand] Added validation for the attach container input call on the agent.

[anand] Made the agent's `api/v1` handler handle request streaming.

[anand] Added the v1 \`ATTACH_CONTAINER_INPUT\` call handler on the agent.

[anand] Added a test for the `ATTACH_CONTAINER_INPUT` call on the Agent API.

[anand] Fixed the attach output container test to use the mock containerizer.

[adam] Added authorization actions for Nested Container and Debug API.

[adam] Added authorization to Nested Container API.

[benjamin.hindman] Added `process::loop` abstraction.

[benjamin.hindman] Added an http::serve abstraction.

[yujie.jay] Updated 'io::redirect()' to take an optional vector of callback hooks.

[yujie.jay] Added a server side component for the IOSwitchboard.

[yujie.jay] Updated the io switchboard to launch an external io switchboard server.

[yujie.jay] Added `getContainerIOSwitchboardAddress` helper to containerizer paths.

[yujie.jay] Added implementation for containerizer 'attach()' call.

[yujie.jay] Added support to handle ATTACH_CONTAINER_OUPUT in the io switchbaord.

[yujie.jay] Enabled the IO switchboard server by default for tests.

------------------------------------------
[...truncated 7822 lines...]
/usr/bin/cmake -E cmake_progress_report /mesos/build/CMakeFiles 
[ 24%] Building CXX object src/CMakeFiles/mesos-protobufs.dir/__/include/mesos/master/master.pb.cc.o
cd /mesos/build/src && /usr/bin/clang++-3.5   -DBUILD_DATE="\"2016-3-3 10:20\"" -DBUILD_FLAGS=\"\" -DBUILD_JAVA_JVM_LIBRARY=\"\" -DBUILD_TIME=\"1111100\" -DBUILD_USER=\"frank\" -DHAS_AUTHENTICATION=1 -DLIBDIR=\"/usr/local/libmesos\" -DPICOJSON_USE_INT64 -DPKGDATADIR=\"/usr/local/share/mesos\" -DPKGLIBEXECDIR=\"/usr/local/libexec/mesos\" -DUSE_STATIC_LIB -DVERSION=\"1.2.0\" -D__STDC_FORMAT_MACROS -Dmesos_protobufs_EXPORTS -O2 -std=c++11 -g -fPIC -I/mesos/build/include -I/mesos/build/include/mesos -I/mesos/build/src -I/mesos/src -I/mesos/build/3rdparty/protobuf-2.6.1/src/protobuf-2.6.1-lib/lib/include -I/mesos/include -I/mesos/3rdparty/stout/include -I/usr/include/apr-1.0 -I/mesos/build/3rdparty/boost-1.53.0/src/boost-1.53.0 -I/mesos/build/3rdparty/elfio-3.2/src/elfio-3.2 -I/mesos/build/3rdparty/glog-0.3.3/src/glog-0.3.3-lib/lib/include -I/mesos/build/3rdparty/nvml-352.79/src/nvml-352.79 -I/mesos/build/3rdparty/picojson-1.3.0/src/picojson-1.3.0 -I/usr/include/subversion-1 -I/mesos/src/src -I/mesos/3rdparty/libprocess/include -I/mesos/build/3rdparty/http_parser-2.6.2/src/http_parser-2.6.2 -I/mesos/build/3rdparty/libev-4.22/src/libev-4.22 -I/mesos/build/3rdparty/zookeeper-3.4.8/src/zookeeper-3.4.8/src/c/include -I/mesos/build/3rdparty/zookeeper-3.4.8/src/zookeeper-3.4.8/src/c/generated -I/mesos/build/3rdparty/leveldb-1.4/src/leveldb-1.4/include    -o CMakeFiles/mesos-protobufs.dir/__/include/mesos/master/master.pb.cc.o -c /mesos/build/include/mesos/master/master.pb.cc
/usr/bin/cmake -E cmake_progress_report /mesos/build/CMakeFiles 
[ 24%] Building CXX object src/CMakeFiles/mesos-protobufs.dir/__/include/mesos/mesos.pb.cc.o
cd /mesos/build/src && /usr/bin/clang++-3.5   -DBUILD_DATE="\"2016-3-3 10:20\"" -DBUILD_FLAGS=\"\" -DBUILD_JAVA_JVM_LIBRARY=\"\" -DBUILD_TIME=\"1111100\" -DBUILD_USER=\"frank\" -DHAS_AUTHENTICATION=1 -DLIBDIR=\"/usr/local/libmesos\" -DPICOJSON_USE_INT64 -DPKGDATADIR=\"/usr/local/share/mesos\" -DPKGLIBEXECDIR=\"/usr/local/libexec/mesos\" -DUSE_STATIC_LIB -DVERSION=\"1.2.0\" -D__STDC_FORMAT_MACROS -Dmesos_protobufs_EXPORTS -O2 -std=c++11 -g -fPIC -I/mesos/build/include -I/mesos/build/include/mesos -I/mesos/build/src -I/mesos/src -I/mesos/build/3rdparty/protobuf-2.6.1/src/protobuf-2.6.1-lib/lib/include -I/mesos/include -I/mesos/3rdparty/stout/include -I/usr/include/apr-1.0 -I/mesos/build/3rdparty/boost-1.53.0/src/boost-1.53.0 -I/mesos/build/3rdparty/elfio-3.2/src/elfio-3.2 -I/mesos/build/3rdparty/glog-0.3.3/src/glog-0.3.3-lib/lib/include -I/mesos/build/3rdparty/nvml-352.79/src/nvml-352.79 -I/mesos/build/3rdparty/picojson-1.3.0/src/picojson-1.3.0 -I/usr/include/subversion-1 -I/mesos/src/src -I/mesos/3rdparty/libprocess/include -I/mesos/build/3rdparty/http_parser-2.6.2/src/http_parser-2.6.2 -I/mesos/build/3rdparty/libev-4.22/src/libev-4.22 -I/mesos/build/3rdparty/zookeeper-3.4.8/src/zookeeper-3.4.8/src/c/include -I/mesos/build/3rdparty/zookeeper-3.4.8/src/zookeeper-3.4.8/src/c/generated -I/mesos/build/3rdparty/leveldb-1.4/src/leveldb-1.4/include    -o CMakeFiles/mesos-protobufs.dir/__/include/mesos/mesos.pb.cc.o -c /mesos/build/include/mesos/mesos.pb.cc
/usr/bin/cmake -E cmake_progress_report /mesos/build/CMakeFiles 
[ 24%] Building CXX object 3rdparty/libprocess/src/CMakeFiles/process-0.0.1.dir/clock.cpp.o
cd /mesos/build/3rdparty/libprocess/src && /usr/bin/clang++-3.5   -DHAS_AUTHENTICATION=1 -DLIBDIR=\"/usr/local/libmesos\" -DPICOJSON_USE_INT64 -DPKGDATADIR=\"/usr/local/share/mesos\" -DPKGLIBEXECDIR=\"/usr/local/libexec/mesos\" -DVERSION=\"1.2.0\" -D__STDC_FORMAT_MACROS -Dprocess_0_0_1_EXPORTS -O2 -std=c++11 -g -fPIC -I/mesos/3rdparty/stout/include -I/usr/include/apr-1.0 -I/mesos/build/3rdparty/boost-1.53.0/src/boost-1.53.0 -I/mesos/build/3rdparty/elfio-3.2/src/elfio-3.2 -I/mesos/build/3rdparty/glog-0.3.3/src/glog-0.3.3-lib/lib/include -I/mesos/build/3rdparty/nvml-352.79/src/nvml-352.79 -I/mesos/build/3rdparty/picojson-1.3.0/src/picojson-1.3.0 -I/mesos/build/3rdparty/protobuf-2.6.1/src/protobuf-2.6.1-lib/lib/include -I/usr/include/subversion-1 -I/mesos/3rdparty/libprocess/src/src -I/mesos/3rdparty/libprocess/include -I/mesos/build/3rdparty/http_parser-2.6.2/src/http_parser-2.6.2 -I/mesos/build/3rdparty/libev-4.22/src/libev-4.22    -o CMakeFiles/process-0.0.1.dir/clock.cpp.o -c /mesos/3rdparty/libprocess/src/clock.cpp
/usr/bin/cmake -E cmake_progress_report /mesos/build/CMakeFiles 51
[ 25%] Building CXX object src/CMakeFiles/mesos-protobufs.dir/__/include/mesos/module/module.pb.cc.o
cd /mesos/build/src && /usr/bin/clang++-3.5   -DBUILD_DATE="\"2016-3-3 10:20\"" -DBUILD_FLAGS=\"\" -DBUILD_JAVA_JVM_LIBRARY=\"\" -DBUILD_TIME=\"1111100\" -DBUILD_USER=\"frank\" -DHAS_AUTHENTICATION=1 -DLIBDIR=\"/usr/local/libmesos\" -DPICOJSON_USE_INT64 -DPKGDATADIR=\"/usr/local/share/mesos\" -DPKGLIBEXECDIR=\"/usr/local/libexec/mesos\" -DUSE_STATIC_LIB -DVERSION=\"1.2.0\" -D__STDC_FORMAT_MACROS -Dmesos_protobufs_EXPORTS -O2 -std=c++11 -g -fPIC -I/mesos/build/include -I/mesos/build/include/mesos -I/mesos/build/src -I/mesos/src -I/mesos/build/3rdparty/protobuf-2.6.1/src/protobuf-2.6.1-lib/lib/include -I/mesos/include -I/mesos/3rdparty/stout/include -I/usr/include/apr-1.0 -I/mesos/build/3rdparty/boost-1.53.0/src/boost-1.53.0 -I/mesos/build/3rdparty/elfio-3.2/src/elfio-3.2 -I/mesos/build/3rdparty/glog-0.3.3/src/glog-0.3.3-lib/lib/include -I/mesos/build/3rdparty/nvml-352.79/src/nvml-352.79 -I/mesos/build/3rdparty/picojson-1.3.0/src/picojson-1.3.0 -I/usr/include/subversion-1 -I/mesos/src/src -I/mesos/3rdparty/libprocess/include -I/mesos/build/3rdparty/http_parser-2.6.2/src/http_parser-2.6.2 -I/mesos/build/3rdparty/libev-4.22/src/libev-4.22 -I/mesos/build/3rdparty/zookeeper-3.4.8/src/zookeeper-3.4.8/src/c/include -I/mesos/build/3rdparty/zookeeper-3.4.8/src/zookeeper-3.4.8/src/c/generated -I/mesos/build/3rdparty/leveldb-1.4/src/leveldb-1.4/include    -o CMakeFiles/mesos-protobufs.dir/__/include/mesos/module/module.pb.cc.o -c /mesos/build/include/mesos/module/module.pb.cc
/usr/bin/cmake -E cmake_progress_report /mesos/build/CMakeFiles 
[ 25%] Building CXX object src/CMakeFiles/mesos-protobufs.dir/__/include/mesos/slave/oversubscription.pb.cc.o
cd /mesos/build/src && /usr/bin/clang++-3.5   -DBUILD_DATE="\"2016-3-3 10:20\"" -DBUILD_FLAGS=\"\" -DBUILD_JAVA_JVM_LIBRARY=\"\" -DBUILD_TIME=\"1111100\" -DBUILD_USER=\"frank\" -DHAS_AUTHENTICATION=1 -DLIBDIR=\"/usr/local/libmesos\" -DPICOJSON_USE_INT64 -DPKGDATADIR=\"/usr/local/share/mesos\" -DPKGLIBEXECDIR=\"/usr/local/libexec/mesos\" -DUSE_STATIC_LIB -DVERSION=\"1.2.0\" -D__STDC_FORMAT_MACROS -Dmesos_protobufs_EXPORTS -O2 -std=c++11 -g -fPIC -I/mesos/build/include -I/mesos/build/include/mesos -I/mesos/build/src -I/mesos/src -I/mesos/build/3rdparty/protobuf-2.6.1/src/protobuf-2.6.1-lib/lib/include -I/mesos/include -I/mesos/3rdparty/stout/include -I/usr/include/apr-1.0 -I/mesos/build/3rdparty/boost-1.53.0/src/boost-1.53.0 -I/mesos/build/3rdparty/elfio-3.2/src/elfio-3.2 -I/mesos/build/3rdparty/glog-0.3.3/src/glog-0.3.3-lib/lib/include -I/mesos/build/3rdparty/nvml-352.79/src/nvml-352.79 -I/mesos/build/3rdparty/picojson-1.3.0/src/picojson-1.3.0 -I/usr/include/subversion-1 -I/mesos/src/src -I/mesos/3rdparty/libprocess/include -I/mesos/build/3rdparty/http_parser-2.6.2/src/http_parser-2.6.2 -I/mesos/build/3rdparty/libev-4.22/src/libev-4.22 -I/mesos/build/3rdparty/zookeeper-3.4.8/src/zookeeper-3.4.8/src/c/include -I/mesos/build/3rdparty/zookeeper-3.4.8/src/zookeeper-3.4.8/src/c/generated -I/mesos/build/3rdparty/leveldb-1.4/src/leveldb-1.4/include    -o CMakeFiles/mesos-protobufs.dir/__/include/mesos/slave/oversubscription.pb.cc.o -c /mesos/build/include/mesos/slave/oversubscription.pb.cc
/usr/bin/cmake -E cmake_progress_report /mesos/build/CMakeFiles 79
[ 26%] Building CXX object 3rdparty/libprocess/src/CMakeFiles/process-0.0.1.dir/firewall.cpp.o
cd /mesos/build/3rdparty/libprocess/src && /usr/bin/clang++-3.5   -DHAS_AUTHENTICATION=1 -DLIBDIR=\"/usr/local/libmesos\" -DPICOJSON_USE_INT64 -DPKGDATADIR=\"/usr/local/share/mesos\" -DPKGLIBEXECDIR=\"/usr/local/libexec/mesos\" -DVERSION=\"1.2.0\" -D__STDC_FORMAT_MACROS -Dprocess_0_0_1_EXPORTS -O2 -std=c++11 -g -fPIC -I/mesos/3rdparty/stout/include -I/usr/include/apr-1.0 -I/mesos/build/3rdparty/boost-1.53.0/src/boost-1.53.0 -I/mesos/build/3rdparty/elfio-3.2/src/elfio-3.2 -I/mesos/build/3rdparty/glog-0.3.3/src/glog-0.3.3-lib/lib/include -I/mesos/build/3rdparty/nvml-352.79/src/nvml-352.79 -I/mesos/build/3rdparty/picojson-1.3.0/src/picojson-1.3.0 -I/mesos/build/3rdparty/protobuf-2.6.1/src/protobuf-2.6.1-lib/lib/include -I/usr/include/subversion-1 -I/mesos/3rdparty/libprocess/src/src -I/mesos/3rdparty/libprocess/include -I/mesos/build/3rdparty/http_parser-2.6.2/src/http_parser-2.6.2 -I/mesos/build/3rdparty/libev-4.22/src/libev-4.22    -o CMakeFiles/process-0.0.1.dir/firewall.cpp.o -c /mesos/3rdparty/libprocess/src/firewall.cpp
/usr/bin/cmake -E cmake_progress_report /mesos/build/CMakeFiles 
[ 26%] Building CXX object 3rdparty/libprocess/src/CMakeFiles/process-0.0.1.dir/help.cpp.o
cd /mesos/build/3rdparty/libprocess/src && /usr/bin/clang++-3.5   -DHAS_AUTHENTICATION=1 -DLIBDIR=\"/usr/local/libmesos\" -DPICOJSON_USE_INT64 -DPKGDATADIR=\"/usr/local/share/mesos\" -DPKGLIBEXECDIR=\"/usr/local/libexec/mesos\" -DVERSION=\"1.2.0\" -D__STDC_FORMAT_MACROS -Dprocess_0_0_1_EXPORTS -O2 -std=c++11 -g -fPIC -I/mesos/3rdparty/stout/include -I/usr/include/apr-1.0 -I/mesos/build/3rdparty/boost-1.53.0/src/boost-1.53.0 -I/mesos/build/3rdparty/elfio-3.2/src/elfio-3.2 -I/mesos/build/3rdparty/glog-0.3.3/src/glog-0.3.3-lib/lib/include -I/mesos/build/3rdparty/nvml-352.79/src/nvml-352.79 -I/mesos/build/3rdparty/picojson-1.3.0/src/picojson-1.3.0 -I/mesos/build/3rdparty/protobuf-2.6.1/src/protobuf-2.6.1-lib/lib/include -I/usr/include/subversion-1 -I/mesos/3rdparty/libprocess/src/src -I/mesos/3rdparty/libprocess/include -I/mesos/build/3rdparty/http_parser-2.6.2/src/http_parser-2.6.2 -I/mesos/build/3rdparty/libev-4.22/src/libev-4.22    -o CMakeFiles/process-0.0.1.dir/help.cpp.o -c /mesos/3rdparty/libprocess/src/help.cpp
/usr/bin/cmake -E cmake_progress_report /mesos/build/CMakeFiles 
[ 26%] Building CXX object src/CMakeFiles/mesos-protobufs.dir/__/include/mesos/quota/quota.pb.cc.o
cd /mesos/build/src && /usr/bin/clang++-3.5   -DBUILD_DATE="\"2016-3-3 10:20\"" -DBUILD_FLAGS=\"\" -DBUILD_JAVA_JVM_LIBRARY=\"\" -DBUILD_TIME=\"1111100\" -DBUILD_USER=\"frank\" -DHAS_AUTHENTICATION=1 -DLIBDIR=\"/usr/local/libmesos\" -DPICOJSON_USE_INT64 -DPKGDATADIR=\"/usr/local/share/mesos\" -DPKGLIBEXECDIR=\"/usr/local/libexec/mesos\" -DUSE_STATIC_LIB -DVERSION=\"1.2.0\" -D__STDC_FORMAT_MACROS -Dmesos_protobufs_EXPORTS -O2 -std=c++11 -g -fPIC -I/mesos/build/include -I/mesos/build/include/mesos -I/mesos/build/src -I/mesos/src -I/mesos/build/3rdparty/protobuf-2.6.1/src/protobuf-2.6.1-lib/lib/include -I/mesos/include -I/mesos/3rdparty/stout/include -I/usr/include/apr-1.0 -I/mesos/build/3rdparty/boost-1.53.0/src/boost-1.53.0 -I/mesos/build/3rdparty/elfio-3.2/src/elfio-3.2 -I/mesos/build/3rdparty/glog-0.3.3/src/glog-0.3.3-lib/lib/include -I/mesos/build/3rdparty/nvml-352.79/src/nvml-352.79 -I/mesos/build/3rdparty/picojson-1.3.0/src/picojson-1.3.0 -I/usr/include/subversion-1 -I/mesos/src/src -I/mesos/3rdparty/libprocess/include -I/mesos/build/3rdparty/http_parser-2.6.2/src/http_parser-2.6.2 -I/mesos/build/3rdparty/libev-4.22/src/libev-4.22 -I/mesos/build/3rdparty/zookeeper-3.4.8/src/zookeeper-3.4.8/src/c/include -I/mesos/build/3rdparty/zookeeper-3.4.8/src/zookeeper-3.4.8/src/c/generated -I/mesos/build/3rdparty/leveldb-1.4/src/leveldb-1.4/include    -o CMakeFiles/mesos-protobufs.dir/__/include/mesos/quota/quota.pb.cc.o -c /mesos/build/include/mesos/quota/quota.pb.cc
/usr/bin/cmake -E cmake_progress_report /mesos/build/CMakeFiles 
[ 26%] Building CXX object 3rdparty/libprocess/src/CMakeFiles/process-0.0.1.dir/http.cpp.o
cd /mesos/build/3rdparty/libprocess/src && /usr/bin/clang++-3.5   -DHAS_AUTHENTICATION=1 -DLIBDIR=\"/usr/local/libmesos\" -DPICOJSON_USE_INT64 -DPKGDATADIR=\"/usr/local/share/mesos\" -DPKGLIBEXECDIR=\"/usr/local/libexec/mesos\" -DVERSION=\"1.2.0\" -D__STDC_FORMAT_MACROS -Dprocess_0_0_1_EXPORTS -O2 -std=c++11 -g -fPIC -I/mesos/3rdparty/stout/include -I/usr/include/apr-1.0 -I/mesos/build/3rdparty/boost-1.53.0/src/boost-1.53.0 -I/mesos/build/3rdparty/elfio-3.2/src/elfio-3.2 -I/mesos/build/3rdparty/glog-0.3.3/src/glog-0.3.3-lib/lib/include -I/mesos/build/3rdparty/nvml-352.79/src/nvml-352.79 -I/mesos/build/3rdparty/picojson-1.3.0/src/picojson-1.3.0 -I/mesos/build/3rdparty/protobuf-2.6.1/src/protobuf-2.6.1-lib/lib/include -I/usr/include/subversion-1 -I/mesos/3rdparty/libprocess/src/src -I/mesos/3rdparty/libprocess/include -I/mesos/build/3rdparty/http_parser-2.6.2/src/http_parser-2.6.2 -I/mesos/build/3rdparty/libev-4.22/src/libev-4.22    -o CMakeFiles/process-0.0.1.dir/http.cpp.o -c /mesos/3rdparty/libprocess/src/http.cpp
/usr/bin/cmake -E cmake_progress_report /mesos/build/CMakeFiles 
[ 26%] Building CXX object 3rdparty/stout/tests/CMakeFiles/stout_tests.dir/interval_tests.cpp.o
cd /mesos/build/3rdparty/stout/tests && /usr/bin/clang++-3.5   -DHAS_AUTHENTICATION=1 -DLIBDIR=\"/usr/local/libmesos\" -DPICOJSON_USE_INT64 -DPKGDATADIR=\"/usr/local/share/mesos\" -DPKGLIBEXECDIR=\"/usr/local/libexec/mesos\" -DVERSION=\"1.2.0\" -D__STDC_FORMAT_MACROS -O2 -std=c++11 -g -fPIE -I/mesos/3rdparty/stout/include -I/usr/include/apr-1.0 -I/mesos/build/3rdparty/boost-1.53.0/src/boost-1.53.0 -I/mesos/build/3rdparty/elfio-3.2/src/elfio-3.2 -I/mesos/build/3rdparty/glog-0.3.3/src/glog-0.3.3-lib/lib/include -I/mesos/build/3rdparty/nvml-352.79/src/nvml-352.79 -I/mesos/build/3rdparty/picojson-1.3.0/src/picojson-1.3.0 -I/mesos/build/3rdparty/protobuf-2.6.1/src/protobuf-2.6.1-lib/lib/include -I/usr/include/subversion-1 -I/mesos/3rdparty/stout/tests/src -I/mesos/build/3rdparty/gmock-1.7.0/src/gmock-1.7.0/include -I/mesos/build/3rdparty/gmock-1.7.0/src/gmock-1.7.0/gtest/include    -o CMakeFiles/stout_tests.dir/interval_tests.cpp.o -c /mesos/3rdparty/stout/tests/interval_tests.cpp
/usr/bin/cmake -E cmake_progress_report /mesos/build/CMakeFiles 
[ 26%] Building CXX object 3rdparty/stout/tests/CMakeFiles/stout_tests.dir/ip_tests.cpp.o
cd /mesos/build/3rdparty/stout/tests && /usr/bin/clang++-3.5   -DHAS_AUTHENTICATION=1 -DLIBDIR=\"/usr/local/libmesos\" -DPICOJSON_USE_INT64 -DPKGDATADIR=\"/usr/local/share/mesos\" -DPKGLIBEXECDIR=\"/usr/local/libexec/mesos\" -DVERSION=\"1.2.0\" -D__STDC_FORMAT_MACROS -O2 -std=c++11 -g -fPIE -I/mesos/3rdparty/stout/include -I/usr/include/apr-1.0 -I/mesos/build/3rdparty/boost-1.53.0/src/boost-1.53.0 -I/mesos/build/3rdparty/elfio-3.2/src/elfio-3.2 -I/mesos/build/3rdparty/glog-0.3.3/src/glog-0.3.3-lib/lib/include -I/mesos/build/3rdparty/nvml-352.79/src/nvml-352.79 -I/mesos/build/3rdparty/picojson-1.3.0/src/picojson-1.3.0 -I/mesos/build/3rdparty/protobuf-2.6.1/src/protobuf-2.6.1-lib/lib/include -I/usr/include/subversion-1 -I/mesos/3rdparty/stout/tests/src -I/mesos/build/3rdparty/gmock-1.7.0/src/gmock-1.7.0/include -I/mesos/build/3rdparty/gmock-1.7.0/src/gmock-1.7.0/gtest/include    -o CMakeFiles/stout_tests.dir/ip_tests.cpp.o -c /mesos/3rdparty/stout/tests/ip_tests.cpp
/usr/bin/cmake -E cmake_progress_report /mesos/build/CMakeFiles 
[ 26%] Building CXX object src/CMakeFiles/mesos-protobufs.dir/__/include/mesos/scheduler/scheduler.pb.cc.o
cd /mesos/build/src && /usr/bin/clang++-3.5   -DBUILD_DATE="\"2016-3-3 10:20\"" -DBUILD_FLAGS=\"\" -DBUILD_JAVA_JVM_LIBRARY=\"\" -DBUILD_TIME=\"1111100\" -DBUILD_USER=\"frank\" -DHAS_AUTHENTICATION=1 -DLIBDIR=\"/usr/local/libmesos\" -DPICOJSON_USE_INT64 -DPKGDATADIR=\"/usr/local/share/mesos\" -DPKGLIBEXECDIR=\"/usr/local/libexec/mesos\" -DUSE_STATIC_LIB -DVERSION=\"1.2.0\" -D__STDC_FORMAT_MACROS -Dmesos_protobufs_EXPORTS -O2 -std=c++11 -g -fPIC -I/mesos/build/include -I/mesos/build/include/mesos -I/mesos/build/src -I/mesos/src -I/mesos/build/3rdparty/protobuf-2.6.1/src/protobuf-2.6.1-lib/lib/include -I/mesos/include -I/mesos/3rdparty/stout/include -I/usr/include/apr-1.0 -I/mesos/build/3rdparty/boost-1.53.0/src/boost-1.53.0 -I/mesos/build/3rdparty/elfio-3.2/src/elfio-3.2 -I/mesos/build/3rdparty/glog-0.3.3/src/glog-0.3.3-lib/lib/include -I/mesos/build/3rdparty/nvml-352.79/src/nvml-352.79 -I/mesos/build/3rdparty/picojson-1.3.0/src/picojson-1.3.0 -I/usr/include/subversion-1 -I/mesos/src/src -I/mesos/3rdparty/libprocess/include -I/mesos/build/3rdparty/http_parser-2.6.2/src/http_parser-2.6.2 -I/mesos/build/3rdparty/libev-4.22/src/libev-4.22 -I/mesos/build/3rdparty/zookeeper-3.4.8/src/zookeeper-3.4.8/src/c/include -I/mesos/build/3rdparty/zookeeper-3.4.8/src/zookeeper-3.4.8/src/c/generated -I/mesos/build/3rdparty/leveldb-1.4/src/leveldb-1.4/include    -o CMakeFiles/mesos-protobufs.dir/__/include/mesos/scheduler/scheduler.pb.cc.o -c /mesos/build/include/mesos/scheduler/scheduler.pb.cc
/usr/bin/cmake -E cmake_progress_report /mesos/build/CMakeFiles 
[ 26%] Building CXX object src/CMakeFiles/mesos-protobufs.dir/__/include/mesos/state/state.pb.cc.o
cd /mesos/build/src && /usr/bin/clang++-3.5   -DBUILD_DATE="\"2016-3-3 10:20\"" -DBUILD_FLAGS=\"\" -DBUILD_JAVA_JVM_LIBRARY=\"\" -DBUILD_TIME=\"1111100\" -DBUILD_USER=\"frank\" -DHAS_AUTHENTICATION=1 -DLIBDIR=\"/usr/local/libmesos\" -DPICOJSON_USE_INT64 -DPKGDATADIR=\"/usr/local/share/mesos\" -DPKGLIBEXECDIR=\"/usr/local/libexec/mesos\" -DUSE_STATIC_LIB -DVERSION=\"1.2.0\" -D__STDC_FORMAT_MACROS -Dmesos_protobufs_EXPORTS -O2 -std=c++11 -g -fPIC -I/mesos/build/include -I/mesos/build/include/mesos -I/mesos/build/src -I/mesos/src -I/mesos/build/3rdparty/protobuf-2.6.1/src/protobuf-2.6.1-lib/lib/include -I/mesos/include -I/mesos/3rdparty/stout/include -I/usr/include/apr-1.0 -I/mesos/build/3rdparty/boost-1.53.0/src/boost-1.53.0 -I/mesos/build/3rdparty/elfio-3.2/src/elfio-3.2 -I/mesos/build/3rdparty/glog-0.3.3/src/glog-0.3.3-lib/lib/include -I/mesos/build/3rdparty/nvml-352.79/src/nvml-352.79 -I/mesos/build/3rdparty/picojson-1.3.0/src/picojson-1.3.0 -I/usr/include/subversion-1 -I/mesos/src/src -I/mesos/3rdparty/libprocess/include -I/mesos/build/3rdparty/http_parser-2.6.2/src/http_parser-2.6.2 -I/mesos/build/3rdparty/libev-4.22/src/libev-4.22 -I/mesos/build/3rdparty/zookeeper-3.4.8/src/zookeeper-3.4.8/src/c/include -I/mesos/build/3rdparty/zookeeper-3.4.8/src/zookeeper-3.4.8/src/c/generated -I/mesos/build/3rdparty/leveldb-1.4/src/leveldb-1.4/include    -o CMakeFiles/mesos-protobufs.dir/__/include/mesos/state/state.pb.cc.o -c /mesos/build/include/mesos/state/state.pb.cc
In file included from /mesos/3rdparty/libprocess/src/http.cpp:34:
In file included from /mesos/3rdparty/libprocess/include/process/collect.hpp:20:
In file included from /mesos/3rdparty/libprocess/include/process/check.hpp:21:
/mesos/3rdparty/libprocess/include/process/future.hpp:918:3: error: no matching member function for call to 'set'
  set(u);
  ^~~
/mesos/3rdparty/libprocess/src/http.cpp:1495:10: note: in instantiation of function template specialization 'process::Future<Nothing>::Future<process::Future<const process::Future<Nothing> > >' requested here
  return send(socket, encoder)
         ^
/mesos/3rdparty/libprocess/include/process/future.hpp:463:8: note: candidate function not viable: no known conversion from 'const process::Future<const process::Future<Nothing> >' to 'const Nothing' for 1st argument
  bool set(const T& _t);
       ^
/mesos/3rdparty/libprocess/include/process/future.hpp:464:8: note: candidate function not viable: no known conversion from 'const process::Future<const process::Future<Nothing> >' to 'Nothing' for 1st argument
  bool set(T&& _t);
       ^
/usr/bin/cmake -E cmake_progress_report /mesos/build/CMakeFiles 
[ 26%] Building CXX object src/CMakeFiles/mesos-protobufs.dir/__/include/mesos/uri/uri.pb.cc.o
cd /mesos/build/src && /usr/bin/clang++-3.5   -DBUILD_DATE="\"2016-3-3 10:20\"" -DBUILD_FLAGS=\"\" -DBUILD_JAVA_JVM_LIBRARY=\"\" -DBUILD_TIME=\"1111100\" -DBUILD_USER=\"frank\" -DHAS_AUTHENTICATION=1 -DLIBDIR=\"/usr/local/libmesos\" -DPICOJSON_USE_INT64 -DPKGDATADIR=\"/usr/local/share/mesos\" -DPKGLIBEXECDIR=\"/usr/local/libexec/mesos\" -DUSE_STATIC_LIB -DVERSION=\"1.2.0\" -D__STDC_FORMAT_MACROS -Dmesos_protobufs_EXPORTS -O2 -std=c++11 -g -fPIC -I/mesos/build/include -I/mesos/build/include/mesos -I/mesos/build/src -I/mesos/src -I/mesos/build/3rdparty/protobuf-2.6.1/src/protobuf-2.6.1-lib/lib/include -I/mesos/include -I/mesos/3rdparty/stout/include -I/usr/include/apr-1.0 -I/mesos/build/3rdparty/boost-1.53.0/src/boost-1.53.0 -I/mesos/build/3rdparty/elfio-3.2/src/elfio-3.2 -I/mesos/build/3rdparty/glog-0.3.3/src/glog-0.3.3-lib/lib/include -I/mesos/build/3rdparty/nvml-352.79/src/nvml-352.79 -I/mesos/build/3rdparty/picojson-1.3.0/src/picojson-1.3.0 -I/usr/include/subversion-1 -I/mesos/src/src -I/mesos/3rdparty/libprocess/include -I/mesos/build/3rdparty/http_parser-2.6.2/src/http_parser-2.6.2 -I/mesos/build/3rdparty/libev-4.22/src/libev-4.22 -I/mesos/build/3rdparty/zookeeper-3.4.8/src/zookeeper-3.4.8/src/c/include -I/mesos/build/3rdparty/zookeeper-3.4.8/src/zookeeper-3.4.8/src/c/generated -I/mesos/build/3rdparty/leveldb-1.4/src/leveldb-1.4/include    -o CMakeFiles/mesos-protobufs.dir/__/include/mesos/uri/uri.pb.cc.o -c /mesos/build/include/mesos/uri/uri.pb.cc
/usr/bin/cmake -E cmake_progress_report /mesos/build/CMakeFiles 89
[ 27%] Building CXX object 3rdparty/stout/tests/CMakeFiles/stout_tests.dir/json_tests.cpp.o
cd /mesos/build/3rdparty/stout/tests && /usr/bin/clang++-3.5   -DHAS_AUTHENTICATION=1 -DLIBDIR=\"/usr/local/libmesos\" -DPICOJSON_USE_INT64 -DPKGDATADIR=\"/usr/local/share/mesos\" -DPKGLIBEXECDIR=\"/usr/local/libexec/mesos\" -DVERSION=\"1.2.0\" -D__STDC_FORMAT_MACROS -O2 -std=c++11 -g -fPIE -I/mesos/3rdparty/stout/include -I/usr/include/apr-1.0 -I/mesos/build/3rdparty/boost-1.53.0/src/boost-1.53.0 -I/mesos/build/3rdparty/elfio-3.2/src/elfio-3.2 -I/mesos/build/3rdparty/glog-0.3.3/src/glog-0.3.3-lib/lib/include -I/mesos/build/3rdparty/nvml-352.79/src/nvml-352.79 -I/mesos/build/3rdparty/picojson-1.3.0/src/picojson-1.3.0 -I/mesos/build/3rdparty/protobuf-2.6.1/src/protobuf-2.6.1-lib/lib/include -I/usr/include/subversion-1 -I/mesos/3rdparty/stout/tests/src -I/mesos/build/3rdparty/gmock-1.7.0/src/gmock-1.7.0/include -I/mesos/build/3rdparty/gmock-1.7.0/src/gmock-1.7.0/gtest/include    -o CMakeFiles/stout_tests.dir/json_tests.cpp.o -c /mesos/3rdparty/stout/tests/json_tests.cpp
/usr/bin/cmake -E cmake_progress_report /mesos/build/CMakeFiles 
[ 27%] Building CXX object 3rdparty/stout/tests/CMakeFiles/stout_tests.dir/jsonify_tests.cpp.o
cd /mesos/build/3rdparty/stout/tests && /usr/bin/clang++-3.5   -DHAS_AUTHENTICATION=1 -DLIBDIR=\"/usr/local/libmesos\" -DPICOJSON_USE_INT64 -DPKGDATADIR=\"/usr/local/share/mesos\" -DPKGLIBEXECDIR=\"/usr/local/libexec/mesos\" -DVERSION=\"1.2.0\" -D__STDC_FORMAT_MACROS -O2 -std=c++11 -g -fPIE -I/mesos/3rdparty/stout/include -I/usr/include/apr-1.0 -I/mesos/build/3rdparty/boost-1.53.0/src/boost-1.53.0 -I/mesos/build/3rdparty/elfio-3.2/src/elfio-3.2 -I/mesos/build/3rdparty/glog-0.3.3/src/glog-0.3.3-lib/lib/include -I/mesos/build/3rdparty/nvml-352.79/src/nvml-352.79 -I/mesos/build/3rdparty/picojson-1.3.0/src/picojson-1.3.0 -I/mesos/build/3rdparty/protobuf-2.6.1/src/protobuf-2.6.1-lib/lib/include -I/usr/include/subversion-1 -I/mesos/3rdparty/stout/tests/src -I/mesos/build/3rdparty/gmock-1.7.0/src/gmock-1.7.0/include -I/mesos/build/3rdparty/gmock-1.7.0/src/gmock-1.7.0/gtest/include    -o CMakeFiles/stout_tests.dir/jsonify_tests.cpp.o -c /mesos/3rdparty/stout/tests/jsonify_tests.cpp
1 error generated.
make[3]: Leaving directory `/mesos/build'
make[3]: *** [3rdparty/libprocess/src/CMakeFiles/process-0.0.1.dir/http.cpp.o] Error 1
make[2]: *** [3rdparty/libprocess/src/CMakeFiles/process-0.0.1.dir/all] Error 2
make[2]: /usr/bin/cmake -E cmake_progress_report /mesos/build/CMakeFiles 
*** Waiting for unfinished jobs....
[ 27%] Building CXX object 3rdparty/stout/tests/CMakeFiles/stout_tests.dir/linkedhashmap_tests.cpp.o
cd /mesos/build/3rdparty/stout/tests && /usr/bin/clang++-3.5   -DHAS_AUTHENTICATION=1 -DLIBDIR=\"/usr/local/libmesos\" -DPICOJSON_USE_INT64 -DPKGDATADIR=\"/usr/local/share/mesos\" -DPKGLIBEXECDIR=\"/usr/local/libexec/mesos\" -DVERSION=\"1.2.0\" -D__STDC_FORMAT_MACROS -O2 -std=c++11 -g -fPIE -I/mesos/3rdparty/stout/include -I/usr/include/apr-1.0 -I/mesos/build/3rdparty/boost-1.53.0/src/boost-1.53.0 -I/mesos/build/3rdparty/elfio-3.2/src/elfio-3.2 -I/mesos/build/3rdparty/glog-0.3.3/src/glog-0.3.3-lib/lib/include -I/mesos/build/3rdparty/nvml-352.79/src/nvml-352.79 -I/mesos/build/3rdparty/picojson-1.3.0/src/picojson-1.3.0 -I/mesos/build/3rdparty/protobuf-2.6.1/src/protobuf-2.6.1-lib/lib/include -I/usr/include/subversion-1 -I/mesos/3rdparty/stout/tests/src -I/mesos/build/3rdparty/gmock-1.7.0/src/gmock-1.7.0/include -I/mesos/build/3rdparty/gmock-1.7.0/src/gmock-1.7.0/gtest/include    -o CMakeFiles/stout_tests.dir/linkedhashmap_tests.cpp.o -c /mesos/3rdparty/stout/tests/linkedhashmap_tests.cpp
/usr/bin/cmake -E cmake_progress_report /mesos/build/CMakeFiles 
[ 27%] Building CXX object 3rdparty/stout/tests/CMakeFiles/stout_tests.dir/mac_tests.cpp.o
cd /mesos/build/3rdparty/stout/tests && /usr/bin/clang++-3.5   -DHAS_AUTHENTICATION=1 -DLIBDIR=\"/usr/local/libmesos\" -DPICOJSON_USE_INT64 -DPKGDATADIR=\"/usr/local/share/mesos\" -DPKGLIBEXECDIR=\"/usr/local/libexec/mesos\" -DVERSION=\"1.2.0\" -D__STDC_FORMAT_MACROS -O2 -std=c++11 -g -fPIE -I/mesos/3rdparty/stout/include -I/usr/include/apr-1.0 -I/mesos/build/3rdparty/boost-1.53.0/src/boost-1.53.0 -I/mesos/build/3rdparty/elfio-3.2/src/elfio-3.2 -I/mesos/build/3rdparty/glog-0.3.3/src/glog-0.3.3-lib/lib/include -I/mesos/build/3rdparty/nvml-352.79/src/nvml-352.79 -I/mesos/build/3rdparty/picojson-1.3.0/src/picojson-1.3.0 -I/mesos/build/3rdparty/protobuf-2.6.1/src/protobuf-2.6.1-lib/lib/include -I/usr/include/subversion-1 -I/mesos/3rdparty/stout/tests/src -I/mesos/build/3rdparty/gmock-1.7.0/src/gmock-1.7.0/include -I/mesos/build/3rdparty/gmock-1.7.0/src/gmock-1.7.0/gtest/include    -o CMakeFiles/stout_tests.dir/mac_tests.cpp.o -c /mesos/3rdparty/stout/tests/mac_tests.cpp
/usr/bin/cmake -E cmake_progress_report /mesos/build/CMakeFiles 52
[ 28%] Building CXX object src/CMakeFiles/mesos-protobufs.dir/__/include/mesos/v1/agent/agent.pb.cc.o
cd /mesos/build/src && /usr/bin/clang++-3.5   -DBUILD_DATE="\"2016-3-3 10:20\"" -DBUILD_FLAGS=\"\" -DBUILD_JAVA_JVM_LIBRARY=\"\" -DBUILD_TIME=\"1111100\" -DBUILD_USER=\"frank\" -DHAS_AUTHENTICATION=1 -DLIBDIR=\"/usr/local/libmesos\" -DPICOJSON_USE_INT64 -DPKGDATADIR=\"/usr/local/share/mesos\" -DPKGLIBEXECDIR=\"/usr/local/libexec/mesos\" -DUSE_STATIC_LIB -DVERSION=\"1.2.0\" -D__STDC_FORMAT_MACROS -Dmesos_protobufs_EXPORTS -O2 -std=c++11 -g -fPIC -I/mesos/build/include -I/mesos/build/include/mesos -I/mesos/build/src -I/mesos/src -I/mesos/build/3rdparty/protobuf-2.6.1/src/protobuf-2.6.1-lib/lib/include -I/mesos/include -I/mesos/3rdparty/stout/include -I/usr/include/apr-1.0 -I/mesos/build/3rdparty/boost-1.53.0/src/boost-1.53.0 -I/mesos/build/3rdparty/elfio-3.2/src/elfio-3.2 -I/mesos/build/3rdparty/glog-0.3.3/src/glog-0.3.3-lib/lib/include -I/mesos/build/3rdparty/nvml-352.79/src/nvml-352.79 -I/mesos/build/3rdparty/picojson-1.3.0/src/picojson-1.3.0 -I/usr/include/subversion-1 -I/mesos/src/src -I/mesos/3rdparty/libprocess/include -I/mesos/build/3rdparty/http_parser-2.6.2/src/http_parser-2.6.2 -I/mesos/build/3rdparty/libev-4.22/src/libev-4.22 -I/mesos/build/3rdparty/zookeeper-3.4.8/src/zookeeper-3.4.8/src/c/include -I/mesos/build/3rdparty/zookeeper-3.4.8/src/zookeeper-3.4.8/src/c/generated -I/mesos/build/3rdparty/leveldb-1.4/src/leveldb-1.4/include    -o CMakeFiles/mesos-protobufs.dir/__/include/mesos/v1/agent/agent.pb.cc.o -c /mesos/build/include/mesos/v1/agent/agent.pb.cc
/usr/bin/cmake -E cmake_progress_report /mesos/build/CMakeFiles 
[ 28%] Building CXX object src/CMakeFiles/mesos-protobufs.dir/__/include/mesos/v1/allocator/allocator.pb.cc.o
cd /mesos/build/src && /usr/bin/clang++-3.5   -DBUILD_DATE="\"2016-3-3 10:20\"" -DBUILD_FLAGS=\"\" -DBUILD_JAVA_JVM_LIBRARY=\"\" -DBUILD_TIME=\"1111100\" -DBUILD_USER=\"frank\" -DHAS_AUTHENTICATION=1 -DLIBDIR=\"/usr/local/libmesos\" -DPICOJSON_USE_INT64 -DPKGDATADIR=\"/usr/local/share/mesos\" -DPKGLIBEXECDIR=\"/usr/local/libexec/mesos\" -DUSE_STATIC_LIB -DVERSION=\"1.2.0\" -D__STDC_FORMAT_MACROS -Dmesos_protobufs_EXPORTS -O2 -std=c++11 -g -fPIC -I/mesos/build/include -I/mesos/build/include/mesos -I/mesos/build/src -I/mesos/src -I/mesos/build/3rdparty/protobuf-2.6.1/src/protobuf-2.6.1-lib/lib/include -I/mesos/include -I/mesos/3rdparty/stout/include -I/usr/include/apr-1.0 -I/mesos/build/3rdparty/boost-1.53.0/src/boost-1.53.0 -I/mesos/build/3rdparty/elfio-3.2/src/elfio-3.2 -I/mesos/build/3rdparty/glog-0.3.3/src/glog-0.3.3-lib/lib/include -I/mesos/build/3rdparty/nvml-352.79/src/nvml-352.79 -I/mesos/build/3rdparty/picojson-1.3.0/src/picojson-1.3.0 -I/usr/include/subversion-1 -I/mesos/src/src -I/mesos/3rdparty/libprocess/include -I/mesos/build/3rdparty/http_parser-2.6.2/src/http_parser-2.6.2 -I/mesos/build/3rdparty/libev-4.22/src/libev-4.22 -I/mesos/build/3rdparty/zookeeper-3.4.8/src/zookeeper-3.4.8/src/c/include -I/mesos/build/3rdparty/zookeeper-3.4.8/src/zookeeper-3.4.8/src/c/generated -I/mesos/build/3rdparty/leveldb-1.4/src/leveldb-1.4/include    -o CMakeFiles/mesos-protobufs.dir/__/include/mesos/v1/allocator/allocator.pb.cc.o -c /mesos/build/include/mesos/v1/allocator/allocator.pb.cc
/usr/bin/cmake -E cmake_progress_report /mesos/build/CMakeFiles 
[ 28%] Building CXX object src/CMakeFiles/mesos-protobufs.dir/__/include/mesos/v1/executor/executor.pb.cc.o
cd /mesos/build/src && /usr/bin/clang++-3.5   -DBUILD_DATE="\"2016-3-3 10:20\"" -DBUILD_FLAGS=\"\" -DBUILD_JAVA_JVM_LIBRARY=\"\" -DBUILD_TIME=\"1111100\" -DBUILD_USER=\"frank\" -DHAS_AUTHENTICATION=1 -DLIBDIR=\"/usr/local/libmesos\" -DPICOJSON_USE_INT64 -DPKGDATADIR=\"/usr/local/share/mesos\" -DPKGLIBEXECDIR=\"/usr/local/libexec/mesos\" -DUSE_STATIC_LIB -DVERSION=\"1.2.0\" -D__STDC_FORMAT_MACROS -Dmesos_protobufs_EXPORTS -O2 -std=c++11 -g -fPIC -I/mesos/build/include -I/mesos/build/include/mesos -I/mesos/build/src -I/mesos/src -I/mesos/build/3rdparty/protobuf-2.6.1/src/protobuf-2.6.1-lib/lib/include -I/mesos/include -I/mesos/3rdparty/stout/include -I/usr/include/apr-1.0 -I/mesos/build/3rdparty/boost-1.53.0/src/boost-1.53.0 -I/mesos/build/3rdparty/elfio-3.2/src/elfio-3.2 -I/mesos/build/3rdparty/glog-0.3.3/src/glog-0.3.3-lib/lib/include -I/mesos/build/3rdparty/nvml-352.79/src/nvml-352.79 -I/mesos/build/3rdparty/picojson-1.3.0/src/picojson-1.3.0 -I/usr/include/subversion-1 -I/mesos/src/src -I/mesos/3rdparty/libprocess/include -I/mesos/build/3rdparty/http_parser-2.6.2/src/http_parser-2.6.2 -I/mesos/build/3rdparty/libev-4.22/src/libev-4.22 -I/mesos/build/3rdparty/zookeeper-3.4.8/src/zookeeper-3.4.8/src/c/include -I/mesos/build/3rdparty/zookeeper-3.4.8/src/zookeeper-3.4.8/src/c/generated -I/mesos/build/3rdparty/leveldb-1.4/src/leveldb-1.4/include    -o CMakeFiles/mesos-protobufs.dir/__/include/mesos/v1/executor/executor.pb.cc.o -c /mesos/build/include/mesos/v1/executor/executor.pb.cc
/usr/bin/cmake -E cmake_progress_report /mesos/build/CMakeFiles 
[ 28%] Building CXX object src/CMakeFiles/mesos-protobufs.dir/__/include/mesos/v1/maintenance/maintenance.pb.cc.o
cd /mesos/build/src && /usr/bin/clang++-3.5   -DBUILD_DATE="\"2016-3-3 10:20\"" -DBUILD_FLAGS=\"\" -DBUILD_JAVA_JVM_LIBRARY=\"\" -DBUILD_TIME=\"1111100\" -DBUILD_USER=\"frank\" -DHAS_AUTHENTICATION=1 -DLIBDIR=\"/usr/local/libmesos\" -DPICOJSON_USE_INT64 -DPKGDATADIR=\"/usr/local/share/mesos\" -DPKGLIBEXECDIR=\"/usr/local/libexec/mesos\" -DUSE_STATIC_LIB -DVERSION=\"1.2.0\" -D__STDC_FORMAT_MACROS -Dmesos_protobufs_EXPORTS -O2 -std=c++11 -g -fPIC -I/mesos/build/include -I/mesos/build/include/mesos -I/mesos/build/src -I/mesos/src -I/mesos/build/3rdparty/protobuf-2.6.1/src/protobuf-2.6.1-lib/lib/include -I/mesos/include -I/mesos/3rdparty/stout/include -I/usr/include/apr-1.0 -I/mesos/build/3rdparty/boost-1.53.0/src/boost-1.53.0 -I/mesos/build/3rdparty/elfio-3.2/src/elfio-3.2 -I/mesos/build/3rdparty/glog-0.3.3/src/glog-0.3.3-lib/lib/include -I/mesos/build/3rdparty/nvml-352.79/src/nvml-352.79 -I/mesos/build/3rdparty/picojson-1.3.0/src/picojson-1.3.0 -I/usr/include/subversion-1 -I/mesos/src/src -I/mesos/3rdparty/libprocess/include -I/mesos/build/3rdparty/http_parser-2.6.2/src/http_parser-2.6.2 -I/mesos/build/3rdparty/libev-4.22/src/libev-4.22 -I/mesos/build/3rdparty/zookeeper-3.4.8/src/zookeeper-3.4.8/src/c/include -I/mesos/build/3rdparty/zookeeper-3.4.8/src/zookeeper-3.4.8/src/c/generated -I/mesos/build/3rdparty/leveldb-1.4/src/leveldb-1.4/include    -o CMakeFiles/mesos-protobufs.dir/__/include/mesos/v1/maintenance/maintenance.pb.cc.o -c /mesos/build/include/mesos/v1/maintenance/maintenance.pb.cc
/usr/bin/cmake -E cmake_progress_report /mesos/build/CMakeFiles 
[ 28%] Building CXX object src/CMakeFiles/mesos-protobufs.dir/__/include/mesos/v1/master/master.pb.cc.o
cd /mesos/build/src && /usr/bin/clang++-3.5   -DBUILD_DATE="\"2016-3-3 10:20\"" -DBUILD_FLAGS=\"\" -DBUILD_JAVA_JVM_LIBRARY=\"\" -DBUILD_TIME=\"1111100\" -DBUILD_USER=\"frank\" -DHAS_AUTHENTICATION=1 -DLIBDIR=\"/usr/local/libmesos\" -DPICOJSON_USE_INT64 -DPKGDATADIR=\"/usr/local/share/mesos\" -DPKGLIBEXECDIR=\"/usr/local/libexec/mesos\" -DUSE_STATIC_LIB -DVERSION=\"1.2.0\" -D__STDC_FORMAT_MACROS -Dmesos_protobufs_EXPORTS -O2 -std=c++11 -g -fPIC -I/mesos/build/include -I/mesos/build/include/mesos -I/mesos/build/src -I/mesos/src -I/mesos/build/3rdparty/protobuf-2.6.1/src/protobuf-2.6.1-lib/lib/include -I/mesos/include -I/mesos/3rdparty/stout/include -I/usr/include/apr-1.0 -I/mesos/build/3rdparty/boost-1.53.0/src/boost-1.53.0 -I/mesos/build/3rdparty/elfio-3.2/src/elfio-3.2 -I/mesos/build/3rdparty/glog-0.3.3/src/glog-0.3.3-lib/lib/include -I/mesos/build/3rdparty/nvml-352.79/src/nvml-352.79 -I/mesos/build/3rdparty/picojson-1.3.0/src/picojson-1.3.0 -I/usr/include/subversion-1 -I/mesos/src/src -I/mesos/3rdparty/libprocess/include -I/mesos/build/3rdparty/http_parser-2.6.2/src/http_parser-2.6.2 -I/mesos/build/3rdparty/libev-4.22/src/libev-4.22 -I/mesos/build/3rdparty/zookeeper-3.4.8/src/zookeeper-3.4.8/src/c/include -I/mesos/build/3rdparty/zookeeper-3.4.8/src/zookeeper-3.4.8/src/c/generated -I/mesos/build/3rdparty/leveldb-1.4/src/leveldb-1.4/include    -o CMakeFiles/mesos-protobufs.dir/__/include/mesos/v1/master/master.pb.cc.o -c /mesos/build/include/mesos/v1/master/master.pb.cc
/usr/bin/cmake -E cmake_progress_report /mesos/build/CMakeFiles 
[ 28%] Building CXX object src/CMakeFiles/mesos-protobufs.dir/__/include/mesos/v1/mesos.pb.cc.o
cd /mesos/build/src && /usr/bin/clang++-3.5   -DBUILD_DATE="\"2016-3-3 10:20\"" -DBUILD_FLAGS=\"\" -DBUILD_JAVA_JVM_LIBRARY=\"\" -DBUILD_TIME=\"1111100\" -DBUILD_USER=\"frank\" -DHAS_AUTHENTICATION=1 -DLIBDIR=\"/usr/local/libmesos\" -DPICOJSON_USE_INT64 -DPKGDATADIR=\"/usr/local/share/mesos\" -DPKGLIBEXECDIR=\"/usr/local/libexec/mesos\" -DUSE_STATIC_LIB -DVERSION=\"1.2.0\" -D__STDC_FORMAT_MACROS -Dmesos_protobufs_EXPORTS -O2 -std=c++11 -g -fPIC -I/mesos/build/include -I/mesos/build/include/mesos -I/mesos/build/src -I/mesos/src -I/mesos/build/3rdparty/protobuf-2.6.1/src/protobuf-2.6.1-lib/lib/include -I/mesos/include -I/mesos/3rdparty/stout/include -I/usr/include/apr-1.0 -I/mesos/build/3rdparty/boost-1.53.0/src/boost-1.53.0 -I/mesos/build/3rdparty/elfio-3.2/src/elfio-3.2 -I/mesos/build/3rdparty/glog-0.3.3/src/glog-0.3.3-lib/lib/include -I/mesos/build/3rdparty/nvml-352.79/src/nvml-352.79 -I/mesos/build/3rdparty/picojson-1.3.0/src/picojson-1.3.0 -I/usr/include/subversion-1 -I/mesos/src/src -I/mesos/3rdparty/libprocess/include -I/mesos/build/3rdparty/http_parser-2.6.2/src/http_parser-2.6.2 -I/mesos/build/3rdparty/libev-4.22/src/libev-4.22 -I/mesos/build/3rdparty/zookeeper-3.4.8/src/zookeeper-3.4.8/src/c/include -I/mesos/build/3rdparty/zookeeper-3.4.8/src/zookeeper-3.4.8/src/c/generated -I/mesos/build/3rdparty/leveldb-1.4/src/leveldb-1.4/include    -o CMakeFiles/mesos-protobufs.dir/__/include/mesos/v1/mesos.pb.cc.o -c /mesos/build/include/mesos/v1/mesos.pb.cc
/usr/bin/cmake -E cmake_progress_report /mesos/build/CMakeFiles 53
[ 29%] Building CXX object src/CMakeFiles/mesos-protobufs.dir/__/include/mesos/v1/quota/quota.pb.cc.o
cd /mesos/build/src && /usr/bin/clang++-3.5   -DBUILD_DATE="\"2016-3-3 10:20\"" -DBUILD_FLAGS=\"\" -DBUILD_JAVA_JVM_LIBRARY=\"\" -DBUILD_TIME=\"1111100\" -DBUILD_USER=\"frank\" -DHAS_AUTHENTICATION=1 -DLIBDIR=\"/usr/local/libmesos\" -DPICOJSON_USE_INT64 -DPKGDATADIR=\"/usr/local/share/mesos\" -DPKGLIBEXECDIR=\"/usr/local/libexec/mesos\" -DUSE_STATIC_LIB -DVERSION=\"1.2.0\" -D__STDC_FORMAT_MACROS -Dmesos_protobufs_EXPORTS -O2 -std=c++11 -g -fPIC -I/mesos/build/include -I/mesos/build/include/mesos -I/mesos/build/src -I/mesos/src -I/mesos/build/3rdparty/protobuf-2.6.1/src/protobuf-2.6.1-lib/lib/include -I/mesos/include -I/mesos/3rdparty/stout/include -I/usr/include/apr-1.0 -I/mesos/build/3rdparty/boost-1.53.0/src/boost-1.53.0 -I/mesos/build/3rdparty/elfio-3.2/src/elfio-3.2 -I/mesos/build/3rdparty/glog-0.3.3/src/glog-0.3.3-lib/lib/include -I/mesos/build/3rdparty/nvml-352.79/src/nvml-352.79 -I/mesos/build/3rdparty/picojson-1.3.0/src/picojson-1.3.0 -I/usr/include/subversion-1 -I/mesos/src/src -I/mesos/3rdparty/libprocess/include -I/mesos/build/3rdparty/http_parser-2.6.2/src/http_parser-2.6.2 -I/mesos/build/3rdparty/libev-4.22/src/libev-4.22 -I/mesos/build/3rdparty/zookeeper-3.4.8/src/zookeeper-3.4.8/src/c/include -I/mesos/build/3rdparty/zookeeper-3.4.8/src/zookeeper-3.4.8/src/c/generated -I/mesos/build/3rdparty/leveldb-1.4/src/leveldb-1.4/include    -o CMakeFiles/mesos-protobufs.dir/__/include/mesos/v1/quota/quota.pb.cc.o -c /mesos/build/include/mesos/v1/quota/quota.pb.cc
/usr/bin/cmake -E cmake_progress_report /mesos/build/CMakeFiles 
[ 29%] Building CXX object src/CMakeFiles/mesos-protobufs.dir/__/include/mesos/v1/scheduler/scheduler.pb.cc.o
cd /mesos/build/src && /usr/bin/clang++-3.5   -DBUILD_DATE="\"2016-3-3 10:20\"" -DBUILD_FLAGS=\"\" -DBUILD_JAVA_JVM_LIBRARY=\"\" -DBUILD_TIME=\"1111100\" -DBUILD_USER=\"frank\" -DHAS_AUTHENTICATION=1 -DLIBDIR=\"/usr/local/libmesos\" -DPICOJSON_USE_INT64 -DPKGDATADIR=\"/usr/local/share/mesos\" -DPKGLIBEXECDIR=\"/usr/local/libexec/mesos\" -DUSE_STATIC_LIB -DVERSION=\"1.2.0\" -D__STDC_FORMAT_MACROS -Dmesos_protobufs_EXPORTS -O2 -std=c++11 -g -fPIC -I/mesos/build/include -I/mesos/build/include/mesos -I/mesos/build/src -I/mesos/src -I/mesos/build/3rdparty/protobuf-2.6.1/src/protobuf-2.6.1-lib/lib/include -I/mesos/include -I/mesos/3rdparty/stout/include -I/usr/include/apr-1.0 -I/mesos/build/3rdparty/boost-1.53.0/src/boost-1.53.0 -I/mesos/build/3rdparty/elfio-3.2/src/elfio-3.2 -I/mesos/build/3rdparty/glog-0.3.3/src/glog-0.3.3-lib/lib/include -I/mesos/build/3rdparty/nvml-352.79/src/nvml-352.79 -I/mesos/build/3rdparty/picojson-1.3.0/src/picojson-1.3.0 -I/usr/include/subversion-1 -I/mesos/src/src -I/mesos/3rdparty/libprocess/include -I/mesos/build/3rdparty/http_parser-2.6.2/src/http_parser-2.6.2 -I/mesos/build/3rdparty/libev-4.22/src/libev-4.22 -I/mesos/build/3rdparty/zookeeper-3.4.8/src/zookeeper-3.4.8/src/c/include -I/mesos/build/3rdparty/zookeeper-3.4.8/src/zookeeper-3.4.8/src/c/generated -I/mesos/build/3rdparty/leveldb-1.4/src/leveldb-1.4/include    -o CMakeFiles/mesos-protobufs.dir/__/include/mesos/v1/scheduler/scheduler.pb.cc.o -c /mesos/build/include/mesos/v1/scheduler/scheduler.pb.cc
/usr/bin/cmake -E cmake_progress_report /mesos/build/CMakeFiles 
[ 29%] Building CXX object src/CMakeFiles/mesos-protobufs.dir/messages/flags.pb.cc.o
cd /mesos/build/src && /usr/bin/clang++-3.5   -DBUILD_DATE="\"2016-3-3 10:20\"" -DBUILD_FLAGS=\"\" -DBUILD_JAVA_JVM_LIBRARY=\"\" -DBUILD_TIME=\"1111100\" -DBUILD_USER=\"frank\" -DHAS_AUTHENTICATION=1 -DLIBDIR=\"/usr/local/libmesos\" -DPICOJSON_USE_INT64 -DPKGDATADIR=\"/usr/local/share/mesos\" -DPKGLIBEXECDIR=\"/usr/local/libexec/mesos\" -DUSE_STATIC_LIB -DVERSION=\"1.2.0\" -D__STDC_FORMAT_MACROS -Dmesos_protobufs_EXPORTS -O2 -std=c++11 -g -fPIC -I/mesos/build/include -I/mesos/build/include/mesos -I/mesos/build/src -I/mesos/src -I/mesos/build/3rdparty/protobuf-2.6.1/src/protobuf-2.6.1-lib/lib/include -I/mesos/include -I/mesos/3rdparty/stout/include -I/usr/include/apr-1.0 -I/mesos/build/3rdparty/boost-1.53.0/src/boost-1.53.0 -I/mesos/build/3rdparty/elfio-3.2/src/elfio-3.2 -I/mesos/build/3rdparty/glog-0.3.3/src/glog-0.3.3-lib/lib/include -I/mesos/build/3rdparty/nvml-352.79/src/nvml-352.79 -I/mesos/build/3rdparty/picojson-1.3.0/src/picojson-1.3.0 -I/usr/include/subversion-1 -I/mesos/src/src -I/mesos/3rdparty/libprocess/include -I/mesos/build/3rdparty/http_parser-2.6.2/src/http_parser-2.6.2 -I/mesos/build/3rdparty/libev-4.22/src/libev-4.22 -I/mesos/build/3rdparty/zookeeper-3.4.8/src/zookeeper-3.4.8/src/c/include -I/mesos/build/3rdparty/zookeeper-3.4.8/src/zookeeper-3.4.8/src/c/generated -I/mesos/build/3rdparty/leveldb-1.4/src/leveldb-1.4/include    -o CMakeFiles/mesos-protobufs.dir/messages/flags.pb.cc.o -c /mesos/build/src/messages/flags.pb.cc
/usr/bin/cmake -E cmake_progress_report /mesos/build/CMakeFiles 
[ 29%] Building CXX object src/CMakeFiles/mesos-protobufs.dir/messages/log.pb.cc.o
cd /mesos/build/src && /usr/bin/clang++-3.5   -DBUILD_DATE="\"2016-3-3 10:20\"" -DBUILD_FLAGS=\"\" -DBUILD_JAVA_JVM_LIBRARY=\"\" -DBUILD_TIME=\"1111100\" -DBUILD_USER=\"frank\" -DHAS_AUTHENTICATION=1 -DLIBDIR=\"/usr/local/libmesos\" -DPICOJSON_USE_INT64 -DPKGDATADIR=\"/usr/local/share/mesos\" -DPKGLIBEXECDIR=\"/usr/local/libexec/mesos\" -DUSE_STATIC_LIB -DVERSION=\"1.2.0\" -D__STDC_FORMAT_MACROS -Dmesos_protobufs_EXPORTS -O2 -std=c++11 -g -fPIC -I/mesos/build/include -I/mesos/build/include/mesos -I/mesos/build/src -I/mesos/src -I/mesos/build/3rdparty/protobuf-2.6.1/src/protobuf-2.6.1-lib/lib/include -I/mesos/include -I/mesos/3rdparty/stout/include -I/usr/include/apr-1.0 -I/mesos/build/3rdparty/boost-1.53.0/src/boost-1.53.0 -I/mesos/build/3rdparty/elfio-3.2/src/elfio-3.2 -I/mesos/build/3rdparty/glog-0.3.3/src/glog-0.3.3-lib/lib/include -I/mesos/build/3rdparty/nvml-352.79/src/nvml-352.79 -I/mesos/build/3rdparty/picojson-1.3.0/src/picojson-1.3.0 -I/usr/include/subversion-1 -I/mesos/src/src -I/mesos/3rdparty/libprocess/include -I/mesos/build/3rdparty/http_parser-2.6.2/src/http_parser-2.6.2 -I/mesos/build/3rdparty/libev-4.22/src/libev-4.22 -I/mesos/build/3rdparty/zookeeper-3.4.8/src/zookeeper-3.4.8/src/c/include -I/mesos/build/3rdparty/zookeeper-3.4.8/src/zookeeper-3.4.8/src/c/generated -I/mesos/build/3rdparty/leveldb-1.4/src/leveldb-1.4/include    -o CMakeFiles/mesos-protobufs.dir/messages/log.pb.cc.o -c /mesos/build/src/messages/log.pb.cc
/usr/bin/cmake -E cmake_progress_report /mesos/build/CMakeFiles 
[ 29%] Building CXX object 3rdparty/stout/tests/CMakeFiles/stout_tests.dir/main.cpp.o
cd /mesos/build/3rdparty/stout/tests && /usr/bin/clang++-3.5   -DHAS_AUTHENTICATION=1 -DLIBDIR=\"/usr/local/libmesos\" -DPICOJSON_USE_INT64 -DPKGDATADIR=\"/usr/local/share/mesos\" -DPKGLIBEXECDIR=\"/usr/local/libexec/mesos\" -DVERSION=\"1.2.0\" -D__STDC_FORMAT_MACROS -O2 -std=c++11 -g -fPIE -I/mesos/3rdparty/stout/include -I/usr/include/apr-1.0 -I/mesos/build/3rdparty/boost-1.53.0/src/boost-1.53.0 -I/mesos/build/3rdparty/elfio-3.2/src/elfio-3.2 -I/mesos/build/3rdparty/glog-0.3.3/src/glog-0.3.3-lib/lib/include -I/mesos/build/3rdparty/nvml-352.79/src/nvml-352.79 -I/mesos/build/3rdparty/picojson-1.3.0/src/picojson-1.3.0 -I/mesos/build/3rdparty/protobuf-2.6.1/src/protobuf-2.6.1-lib/lib/include -I/usr/include/subversion-1 -I/mesos/3rdparty/stout/tests/src -I/mesos/build/3rdparty/gmock-1.7.0/src/gmock-1.7.0/include -I/mesos/build/3rdparty/gmock-1.7.0/src/gmock-1.7.0/gtest/include    -o CMakeFiles/stout_tests.dir/main.cpp.o -c /mesos/3rdparty/stout/tests/main.cpp
/usr/bin/cmake -E cmake_progress_report /mesos/build/CMakeFiles 
[ 29%] Building CXX object src/CMakeFiles/mesos-protobufs.dir/messages/messages.pb.cc.o
cd /mesos/build/src && /usr/bin/clang++-3.5   -DBUILD_DATE="\"2016-3-3 10:20\"" -DBUILD_FLAGS=\"\" -DBUILD_JAVA_JVM_LIBRARY=\"\" -DBUILD_TIME=\"1111100\" -DBUILD_USER=\"frank\" -DHAS_AUTHENTICATION=1 -DLIBDIR=\"/usr/local/libmesos\" -DPICOJSON_USE_INT64 -DPKGDATADIR=\"/usr/local/share/mesos\" -DPKGLIBEXECDIR=\"/usr/local/libexec/mesos\" -DUSE_STATIC_LIB -DVERSION=\"1.2.0\" -D__STDC_FORMAT_MACROS -Dmesos_protobufs_EXPORTS -O2 -std=c++11 -g -fPIC -I/mesos/build/include -I/mesos/build/include/mesos -I/mesos/build/src -I/mesos/src -I/mesos/build/3rdparty/protobuf-2.6.1/src/protobuf-2.6.1-lib/lib/include -I/mesos/include -I/mesos/3rdparty/stout/include -I/usr/include/apr-1.0 -I/mesos/build/3rdparty/boost-1.53.0/src/boost-1.53.0 -I/mesos/build/3rdparty/elfio-3.2/src/elfio-3.2 -I/mesos/build/3rdparty/glog-0.3.3/src/glog-0.3.3-lib/lib/include -I/mesos/build/3rdparty/nvml-352.79/src/nvml-352.79 -I/mesos/build/3rdparty/picojson-1.3.0/src/picojson-1.3.0 -I/usr/include/subversion-1 -I/mesos/src/src -I/mesos/3rdparty/libprocess/include -I/mesos/build/3rdparty/http_parser-2.6.2/src/http_parser-2.6.2 -I/mesos/build/3rdparty/libev-4.22/src/libev-4.22 -I/mesos/build/3rdparty/zookeeper-3.4.8/src/zookeeper-3.4.8/src/c/include -I/mesos/build/3rdparty/zookeeper-3.4.8/src/zookeeper-3.4.8/src/c/generated -I/mesos/build/3rdparty/leveldb-1.4/src/leveldb-1.4/include    -o CMakeFiles/mesos-protobufs.dir/messages/messages.pb.cc.o -c /mesos/build/src/messages/messages.pb.cc
/usr/bin/cmake -E cmake_progress_report /mesos/build/CMakeFiles 
[ 29%] Building CXX object 3rdparty/stout/tests/CMakeFiles/stout_tests.dir/multimap_tests.cpp.o
cd /mesos/build/3rdparty/stout/tests && /usr/bin/clang++-3.5   -DHAS_AUTHENTICATION=1 -DLIBDIR=\"/usr/local/libmesos\" -DPICOJSON_USE_INT64 -DPKGDATADIR=\"/usr/local/share/mesos\" -DPKGLIBEXECDIR=\"/usr/local/libexec/mesos\" -DVERSION=\"1.2.0\" -D__STDC_FORMAT_MACROS -O2 -std=c++11 -g -fPIE -I/mesos/3rdparty/stout/include -I/usr/include/apr-1.0 -I/mesos/build/3rdparty/boost-1.53.0/src/boost-1.53.0 -I/mesos/build/3rdparty/elfio-3.2/src/elfio-3.2 -I/mesos/build/3rdparty/glog-0.3.3/src/glog-0.3.3-lib/lib/include -I/mesos/build/3rdparty/nvml-352.79/src/nvml-352.79 -I/mesos/build/3rdparty/picojson-1.3.0/src/picojson-1.3.0 -I/mesos/build/3rdparty/protobuf-2.6.1/src/protobuf-2.6.1-lib/lib/include -I/usr/include/subversion-1 -I/mesos/3rdparty/stout/tests/src -I/mesos/build/3rdparty/gmock-1.7.0/src/gmock-1.7.0/include -I/mesos/build/3rdparty/gmock-1.7.0/src/gmock-1.7.0/gtest/include    -o CMakeFiles/stout_tests.dir/multimap_tests.cpp.o -c /mesos/3rdparty/stout/tests/multimap_tests.cpp
/usr/bin/cmake -E cmake_progress_report /mesos/build/CMakeFiles 
[ 29%] Building CXX object src/CMakeFiles/mesos-protobufs.dir/messages/state.pb.cc.o
cd /mesos/build/src && /usr/bin/clang++-3.5   -DBUILD_DATE="\"2016-3-3 10:20\"" -DBUILD_FLAGS=\"\" -DBUILD_JAVA_JVM_LIBRARY=\"\" -DBUILD_TIME=\"1111100\" -DBUILD_USER=\"frank\" -DHAS_AUTHENTICATION=1 -DLIBDIR=\"/usr/local/libmesos\" -DPICOJSON_USE_INT64 -DPKGDATADIR=\"/usr/local/share/mesos\" -DPKGLIBEXECDIR=\"/usr/local/libexec/mesos\" -DUSE_STATIC_LIB -DVERSION=\"1.2.0\" -D__STDC_FORMAT_MACROS -Dmesos_protobufs_EXPORTS -O2 -std=c++11 -g -fPIC -I/mesos/build/include -I/mesos/build/include/mesos -I/mesos/build/src -I/mesos/src -I/mesos/build/3rdparty/protobuf-2.6.1/src/protobuf-2.6.1-lib/lib/include -I/mesos/include -I/mesos/3rdparty/stout/include -I/usr/include/apr-1.0 -I/mesos/build/3rdparty/boost-1.53.0/src/boost-1.53.0 -I/mesos/build/3rdparty/elfio-3.2/src/elfio-3.2 -I/mesos/build/3rdparty/glog-0.3.3/src/glog-0.3.3-lib/lib/include -I/mesos/build/3rdparty/nvml-352.79/src/nvml-352.79 -I/mesos/build/3rdparty/picojson-1.3.0/src/picojson-1.3.0 -I/usr/include/subversion-1 -I/mesos/src/src -I/mesos/3rdparty/libprocess/include -I/mesos/build/3rdparty/http_parser-2.6.2/src/http_parser-2.6.2 -I/mesos/build/3rdparty/libev-4.22/src/libev-4.22 -I/mesos/build/3rdparty/zookeeper-3.4.8/src/zookeeper-3.4.8/src/c/include -I/mesos/build/3rdparty/zookeeper-3.4.8/src/zookeeper-3.4.8/src/c/generated -I/mesos/build/3rdparty/leveldb-1.4/src/leveldb-1.4/include    -o CMakeFiles/mesos-protobufs.dir/messages/state.pb.cc.o -c /mesos/build/src/messages/state.pb.cc
/usr/bin/cmake -E cmake_progress_report /mesos/build/CMakeFiles 54
[ 30%] Building CXX object src/CMakeFiles/mesos-protobufs.dir/slave/containerizer/mesos/isolators/network/cni/spec.pb.cc.o
cd /mesos/build/src && /usr/bin/clang++-3.5   -DBUILD_DATE="\"2016-3-3 10:20\"" -DBUILD_FLAGS=\"\" -DBUILD_JAVA_JVM_LIBRARY=\"\" -DBUILD_TIME=\"1111100\" -DBUILD_USER=\"frank\" -DHAS_AUTHENTICATION=1 -DLIBDIR=\"/usr/local/libmesos\" -DPICOJSON_USE_INT64 -DPKGDATADIR=\"/usr/local/share/mesos\" -DPKGLIBEXECDIR=\"/usr/local/libexec/mesos\" -DUSE_STATIC_LIB -DVERSION=\"1.2.0\" -D__STDC_FORMAT_MACROS -Dmesos_protobufs_EXPORTS -O2 -std=c++11 -g -fPIC -I/mesos/build/include -I/mesos/build/include/mesos -I/mesos/build/src -I/mesos/src -I/mesos/build/3rdparty/protobuf-2.6.1/src/protobuf-2.6.1-lib/lib/include -I/mesos/include -I/mesos/3rdparty/stout/include -I/usr/include/apr-1.0 -I/mesos/build/3rdparty/boost-1.53.0/src/boost-1.53.0 -I/mesos/build/3rdparty/elfio-3.2/src/elfio-3.2 -I/mesos/build/3rdparty/glog-0.3.3/src/glog-0.3.3-lib/lib/include -I/mesos/build/3rdparty/nvml-352.79/src/nvml-352.79 -I/mesos/build/3rdparty/picojson-1.3.0/src/picojson-1.3.0 -I/usr/include/subversion-1 -I/mesos/src/src -I/mesos/3rdparty/libprocess/include -I/mesos/build/3rdparty/http_parser-2.6.2/src/http_parser-2.6.2 -I/mesos/build/3rdparty/libev-4.22/src/libev-4.22 -I/mesos/build/3rdparty/zookeeper-3.4.8/src/zookeeper-3.4.8/src/c/include -I/mesos/build/3rdparty/zookeeper-3.4.8/src/zookeeper-3.4.8/src/c/generated -I/mesos/build/3rdparty/leveldb-1.4/src/leveldb-1.4/include    -o CMakeFiles/mesos-protobufs.dir/slave/containerizer/mesos/isolators/network/cni/spec.pb.cc.o -c /mesos/build/src/slave/containerizer/mesos/isolators/network/cni/spec.pb.cc
/usr/bin/cmake -E cmake_progress_report /mesos/build/CMakeFiles 
[ 30%] Building CXX object src/CMakeFiles/mesos-protobufs.dir/slave/containerizer/mesos/isolators/docker/volume/state.pb.cc.o
cd /mesos/build/src && /usr/bin/clang++-3.5   -DBUILD_DATE="\"2016-3-3 10:20\"" -DBUILD_FLAGS=\"\" -DBUILD_JAVA_JVM_LIBRARY=\"\" -DBUILD_TIME=\"1111100\" -DBUILD_USER=\"frank\" -DHAS_AUTHENTICATION=1 -DLIBDIR=\"/usr/local/libmesos\" -DPICOJSON_USE_INT64 -DPKGDATADIR=\"/usr/local/share/mesos\" -DPKGLIBEXECDIR=\"/usr/local/libexec/mesos\" -DUSE_STATIC_LIB -DVERSION=\"1.2.0\" -D__STDC_FORMAT_MACROS -Dmesos_protobufs_EXPORTS -O2 -std=c++11 -g -fPIC -I/mesos/build/include -I/mesos/build/include/mesos -I/mesos/build/src -I/mesos/src -I/mesos/build/3rdparty/protobuf-2.6.1/src/protobuf-2.6.1-lib/lib/include -I/mesos/include -I/mesos/3rdparty/stout/include -I/usr/include/apr-1.0 -I/mesos/build/3rdparty/boost-1.53.0/src/boost-1.53.0 -I/mesos/build/3rdparty/elfio-3.2/src/elfio-3.2 -I/mesos/build/3rdparty/glog-0.3.3/src/glog-0.3.3-lib/lib/include -I/mesos/build/3rdparty/nvml-352.79/src/nvml-352.79 -I/mesos/build/3rdparty/picojson-1.3.0/src/picojson-1.3.0 -I/usr/include/subversion-1 -I/mesos/src/src -I/mesos/3rdparty/libprocess/include -I/mesos/build/3rdparty/http_parser-2.6.2/src/http_parser-2.6.2 -I/mesos/build/3rdparty/libev-4.22/src/libev-4.22 -I/mesos/build/3rdparty/zookeeper-3.4.8/src/zookeeper-3.4.8/src/c/include -I/mesos/build/3rdparty/zookeeper-3.4.8/src/zookeeper-3.4.8/src/c/generated -I/mesos/build/3rdparty/leveldb-1.4/src/leveldb-1.4/include    -o CMakeFiles/mesos-protobufs.dir/slave/containerizer/mesos/isolators/docker/volume/state.pb.cc.o -c /mesos/build/src/slave/containerizer/mesos/isolators/docker/volume/state.pb.cc
/usr/bin/cmake -E cmake_progress_report /mesos/build/CMakeFiles 
[ 30%] Building CXX object src/CMakeFiles/mesos-protobufs.dir/slave/containerizer/mesos/provisioner/docker/message.pb.cc.o
cd /mesos/build/src && /usr/bin/clang++-3.5   -DBUILD_DATE="\"2016-3-3 10:20\"" -DBUILD_FLAGS=\"\" -DBUILD_JAVA_JVM_LIBRARY=\"\" -DBUILD_TIME=\"1111100\" -DBUILD_USER=\"frank\" -DHAS_AUTHENTICATION=1 -DLIBDIR=\"/usr/local/libmesos\" -DPICOJSON_USE_INT64 -DPKGDATADIR=\"/usr/local/share/mesos\" -DPKGLIBEXECDIR=\"/usr/local/libexec/mesos\" -DUSE_STATIC_LIB -DVERSION=\"1.2.0\" -D__STDC_FORMAT_MACROS -Dmesos_protobufs_EXPORTS -O2 -std=c++11 -g -fPIC -I/mesos/build/include -I/mesos/build/include/mesos -I/mesos/build/src -I/mesos/src -I/mesos/build/3rdparty/protobuf-2.6.1/src/protobuf-2.6.1-lib/lib/include -I/mesos/include -I/mesos/3rdparty/stout/include -I/usr/include/apr-1.0 -I/mesos/build/3rdparty/boost-1.53.0/src/boost-1.53.0 -I/mesos/build/3rdparty/elfio-3.2/src/elfio-3.2 -I/mesos/build/3rdparty/glog-0.3.3/src/glog-0.3.3-lib/lib/include -I/mesos/build/3rdparty/nvml-352.79/src/nvml-352.79 -I/mesos/build/3rdparty/picojson-1.3.0/src/picojson-1.3.0 -I/usr/include/subversion-1 -I/mesos/src/src -I/mesos/3rdparty/libprocess/include -I/mesos/build/3rdparty/http_parser-2.6.2/src/http_parser-2.6.2 -I/mesos/build/3rdparty/libev-4.22/src/libev-4.22 -I/mesos/build/3rdparty/zookeeper-3.4.8/src/zookeeper-3.4.8/src/c/include -I/mesos/build/3rdparty/zookeeper-3.4.8/src/zookeeper-3.4.8/src/c/generated -I/mesos/build/3rdparty/leveldb-1.4/src/leveldb-1.4/include    -o CMakeFiles/mesos-protobufs.dir/slave/containerizer/mesos/provisioner/docker/message.pb.cc.o -c /mesos/build/src/slave/containerizer/mesos/provisioner/docker/message.pb.cc
/usr/bin/cmake -E cmake_progress_report /mesos/build/CMakeFiles 
[ 30%] Building CXX object src/CMakeFiles/mesos-protobufs.dir/master/registry.pb.cc.o
cd /mesos/build/src && /usr/bin/clang++-3.5   -DBUILD_DATE="\"2016-3-3 10:20\"" -DBUILD_FLAGS=\"\" -DBUILD_JAVA_JVM_LIBRARY=\"\" -DBUILD_TIME=\"1111100\" -DBUILD_USER=\"frank\" -DHAS_AUTHENTICATION=1 -DLIBDIR=\"/usr/local/libmesos\" -DPICOJSON_USE_INT64 -DPKGDATADIR=\"/usr/local/share/mesos\" -DPKGLIBEXECDIR=\"/usr/local/libexec/mesos\" -DUSE_STATIC_LIB -DVERSION=\"1.2.0\" -D__STDC_FORMAT_MACROS -Dmesos_protobufs_EXPORTS -O2 -std=c++11 -g -fPIC -I/mesos/build/include -I/mesos/build/include/mesos -I/mesos/build/src -I/mesos/src -I/mesos/build/3rdparty/protobuf-2.6.1/src/protobuf-2.6.1-lib/lib/include -I/mesos/include -I/mesos/3rdparty/stout/include -I/usr/include/apr-1.0 -I/mesos/build/3rdparty/boost-1.53.0/src/boost-1.53.0 -I/mesos/build/3rdparty/elfio-3.2/src/elfio-3.2 -I/mesos/build/3rdparty/glog-0.3.3/src/glog-0.3.3-lib/lib/include -I/mesos/build/3rdparty/nvml-352.79/src/nvml-352.79 -I/mesos/build/3rdparty/picojson-1.3.0/src/picojson-1.3.0 -I/usr/include/subversion-1 -I/mesos/src/src -I/mesos/3rdparty/libprocess/include -I/mesos/build/3rdparty/http_parser-2.6.2/src/http_parser-2.6.2 -I/mesos/build/3rdparty/libev-4.22/src/libev-4.22 -I/mesos/build/3rdparty/zookeeper-3.4.8/src/zookeeper-3.4.8/src/c/include -I/mesos/build/3rdparty/zookeeper-3.4.8/src/zookeeper-3.4.8/src/c/generated -I/mesos/build/3rdparty/leveldb-1.4/src/leveldb-1.4/include    -o CMakeFiles/mesos-protobufs.dir/master/registry.pb.cc.o -c /mesos/build/src/master/registry.pb.cc
/usr/bin/cmake -E cmake_progress_report /mesos/build/CMakeFiles 90
[ 31%] Building CXX object 3rdparty/stout/tests/CMakeFiles/stout_tests.dir/none_tests.cpp.o
cd /mesos/build/3rdparty/stout/tests && /usr/bin/clang++-3.5   -DHAS_AUTHENTICATION=1 -DLIBDIR=\"/usr/local/libmesos\" -DPICOJSON_USE_INT64 -DPKGDATADIR=\"/usr/local/share/mesos\" -DPKGLIBEXECDIR=\"/usr/local/libexec/mesos\" -DVERSION=\"1.2.0\" -D__STDC_FORMAT_MACROS -O2 -std=c++11 -g -fPIE -I/mesos/3rdparty/stout/include -I/usr/include/apr-1.0 -I/mesos/build/3rdparty/boost-1.53.0/src/boost-1.53.0 -I/mesos/build/3rdparty/elfio-3.2/src/elfio-3.2 -I/mesos/build/3rdparty/glog-0.3.3/src/glog-0.3.3-lib/lib/include -I/mesos/build/3rdparty/nvml-352.79/src/nvml-352.79 -I/mesos/build/3rdparty/picojson-1.3.0/src/picojson-1.3.0 -I/mesos/build/3rdparty/protobuf-2.6.1/src/protobuf-2.6.1-lib/lib/include -I/usr/include/subversion-1 -I/mesos/3rdparty/stout/tests/src -I/mesos/build/3rdparty/gmock-1.7.0/src/gmock-1.7.0/include -I/mesos/build/3rdparty/gmock-1.7.0/src/gmock-1.7.0/gtest/include    -o CMakeFiles/stout_tests.dir/none_tests.cpp.o -c /mesos/3rdparty/stout/tests/none_tests.cpp
/usr/bin/cmake -E cmake_progress_report /mesos/build/CMakeFiles 
[ 31%] Building CXX object 3rdparty/stout/tests/CMakeFiles/stout_tests.dir/numify_tests.cpp.o
cd /mesos/build/3rdparty/stout/tests && /usr/bin/clang++-3.5   -DHAS_AUTHENTICATION=1 -DLIBDIR=\"/usr/local/libmesos\" -DPICOJSON_USE_INT64 -DPKGDATADIR=\"/usr/local/share/mesos\" -DPKGLIBEXECDIR=\"/usr/local/libexec/mesos\" -DVERSION=\"1.2.0\" -D__STDC_FORMAT_MACROS -O2 -std=c++11 -g -fPIE -I/mesos/3rdparty/stout/include -I/usr/include/apr-1.0 -I/mesos/build/3rdparty/boost-1.53.0/src/boost-1.53.0 -I/mesos/build/3rdparty/elfio-3.2/src/elfio-3.2 -I/mesos/build/3rdparty/glog-0.3.3/src/glog-0.3.3-lib/lib/include -I/mesos/build/3rdparty/nvml-352.79/src/nvml-352.79 -I/mesos/build/3rdparty/picojson-1.3.0/src/picojson-1.3.0 -I/mesos/build/3rdparty/protobuf-2.6.1/src/protobuf-2.6.1-lib/lib/include -I/usr/include/subversion-1 -I/mesos/3rdparty/stout/tests/src -I/mesos/build/3rdparty/gmock-1.7.0/src/gmock-1.7.0/include -I/mesos/build/3rdparty/gmock-1.7.0/src/gmock-1.7.0/gtest/include    -o CMakeFiles/stout_tests.dir/numify_tests.cpp.o -c /mesos/3rdparty/stout/tests/numify_tests.cpp
/usr/bin/cmake -E cmake_progress_report /mesos/build/CMakeFiles 
[ 31%] Building CXX object 3rdparty/stout/tests/CMakeFiles/stout_tests.dir/option_tests.cpp.o
cd /mesos/build/3rdparty/stout/tests && /usr/bin/clang++-3.5   -DHAS_AUTHENTICATION=1 -DLIBDIR=\"/usr/local/libmesos\" -DPICOJSON_USE_INT64 -DPKGDATADIR=\"/usr/local/share/mesos\" -DPKGLIBEXECDIR=\"/usr/local/libexec/mesos\" -DVERSION=\"1.2.0\" -D__STDC_FORMAT_MACROS -O2 -std=c++11 -g -fPIE -I/mesos/3rdparty/stout/include -I/usr/include/apr-1.0 -I/mesos/build/3rdparty/boost-1.53.0/src/boost-1.53.0 -I/mesos/build/3rdparty/elfio-3.2/src/elfio-3.2 -I/mesos/build/3rdparty/glog-0.3.3/src/glog-0.3.3-lib/lib/include -I/mesos/build/3rdparty/nvml-352.79/src/nvml-352.79 -I/mesos/build/3rdparty/picojson-1.3.0/src/picojson-1.3.0 -I/mesos/build/3rdparty/protobuf-2.6.1/src/protobuf-2.6.1-lib/lib/include -I/usr/include/subversion-1 -I/mesos/3rdparty/stout/tests/src -I/mesos/build/3rdparty/gmock-1.7.0/src/gmock-1.7.0/include -I/mesos/build/3rdparty/gmock-1.7.0/src/gmock-1.7.0/gtest/include    -o CMakeFiles/stout_tests.dir/option_tests.cpp.o -c /mesos/3rdparty/stout/tests/option_tests.cpp
/usr/bin/cmake -E cmake_progress_report /mesos/build/CMakeFiles 
[ 31%] Building CXX object 3rdparty/stout/tests/CMakeFiles/stout_tests.dir/os_tests.cpp.o
cd /mesos/build/3rdparty/stout/tests && /usr/bin/clang++-3.5   -DHAS_AUTHENTICATION=1 -DLIBDIR=\"/usr/local/libmesos\" -DPICOJSON_USE_INT64 -DPKGDATADIR=\"/usr/local/share/mesos\" -DPKGLIBEXECDIR=\"/usr/local/libexec/mesos\" -DVERSION=\"1.2.0\" -D__STDC_FORMAT_MACROS -O2 -std=c++11 -g -fPIE -I/mesos/3rdparty/stout/include -I/usr/include/apr-1.0 -I/mesos/build/3rdparty/boost-1.53.0/src/boost-1.53.0 -I/mesos/build/3rdparty/elfio-3.2/src/elfio-3.2 -I/mesos/build/3rdparty/glog-0.3.3/src/glog-0.3.3-lib/lib/include -I/mesos/build/3rdparty/nvml-352.79/src/nvml-352.79 -I/mesos/build/3rdparty/picojson-1.3.0/src/picojson-1.3.0 -I/mesos/build/3rdparty/protobuf-2.6.1/src/protobuf-2.6.1-lib/lib/include -I/usr/include/subversion-1 -I/mesos/3rdparty/stout/tests/src -I/mesos/build/3rdparty/gmock-1.7.0/src/gmock-1.7.0/include -I/mesos/build/3rdparty/gmock-1.7.0/src/gmock-1.7.0/gtest/include    -o CMakeFiles/stout_tests.dir/os_tests.cpp.o -c /mesos/3rdparty/stout/tests/os_tests.cpp
/usr/bin/cmake -E cmake_progress_report /mesos/build/CMakeFiles 
[ 31%] Building CXX object 3rdparty/stout/tests/CMakeFiles/stout_tests.dir/os/env_tests.cpp.o
cd /mesos/build/3rdparty/stout/tests && /usr/bin/clang++-3.5   -DHAS_AUTHENTICATION=1 -DLIBDIR=\"/usr/local/libmesos\" -DPICOJSON_USE_INT64 -DPKGDATADIR=\"/usr/local/share/mesos\" -DPKGLIBEXECDIR=\"/usr/local/libexec/mesos\" -DVERSION=\"1.2.0\" -D__STDC_FORMAT_MACROS -O2 -std=c++11 -g -fPIE -I/mesos/3rdparty/stout/include -I/usr/include/apr-1.0 -I/mesos/build/3rdparty/boost-1.53.0/src/boost-1.53.0 -I/mesos/build/3rdparty/elfio-3.2/src/elfio-3.2 -I/mesos/build/3rdparty/glog-0.3.3/src/glog-0.3.3-lib/lib/include -I/mesos/build/3rdparty/nvml-352.79/src/nvml-352.79 -I/mesos/build/3rdparty/picojson-1.3.0/src/picojson-1.3.0 -I/mesos/build/3rdparty/protobuf-2.6.1/src/protobuf-2.6.1-lib/lib/include -I/usr/include/subversion-1 -I/mesos/3rdparty/stout/tests/src -I/mesos/build/3rdparty/gmock-1.7.0/src/gmock-1.7.0/include -I/mesos/build/3rdparty/gmock-1.7.0/src/gmock-1.7.0/gtest/include    -o CMakeFiles/stout_tests.dir/os/env_tests.cpp.o -c /mesos/3rdparty/stout/tests/os/env_tests.cpp
/usr/bin/cmake -E cmake_progress_report /mesos/build/CMakeFiles 
[ 31%] Building CXX object 3rdparty/stout/tests/CMakeFiles/stout_tests.dir/os/filesystem_tests.cpp.o
cd /mesos/build/3rdparty/stout/tests && /usr/bin/clang++-3.5   -DHAS_AUTHENTICATION=1 -DLIBDIR=\"/usr/local/libmesos\" -DPICOJSON_USE_INT64 -DPKGDATADIR=\"/usr/local/share/mesos\" -DPKGLIBEXECDIR=\"/usr/local/libexec/mesos\" -DVERSION=\"1.2.0\" -D__STDC_FORMAT_MACROS -O2 -std=c++11 -g -fPIE -I/mesos/3rdparty/stout/include -I/usr/include/apr-1.0 -I/mesos/build/3rdparty/boost-1.53.0/src/boost-1.53.0 -I/mesos/build/3rdparty/elfio-3.2/src/elfio-3.2 -I/mesos/build/3rdparty/glog-0.3.3/src/glog-0.3.3-lib/lib/include -I/mesos/build/3rdparty/nvml-352.79/src/nvml-352.79 -I/mesos/build/3rdparty/picojson-1.3.0/src/picojson-1.3.0 -I/mesos/build/3rdparty/protobuf-2.6.1/src/protobuf-2.6.1-lib/lib/include -I/usr/include/subversion-1 -I/mesos/3rdparty/stout/tests/src -I/mesos/build/3rdparty/gmock-1.7.0/src/gmock-1.7.0/include -I/mesos/build/3rdparty/gmock-1.7.0/src/gmock-1.7.0/gtest/include    -o CMakeFiles/stout_tests.dir/os/filesystem_tests.cpp.o -c /mesos/3rdparty/stout/tests/os/filesystem_tests.cpp
/usr/bin/cmake -E cmake_progress_report /mesos/build/CMakeFiles 91
[ 32%] Building CXX object 3rdparty/stout/tests/CMakeFiles/stout_tests.dir/os/process_tests.cpp.o
cd /mesos/build/3rdparty/stout/tests && /usr/bin/clang++-3.5   -DHAS_AUTHENTICATION=1 -DLIBDIR=\"/usr/local/libmesos\" -DPICOJSON_USE_INT64 -DPKGDATADIR=\"/usr/local/share/mesos\" -DPKGLIBEXECDIR=\"/usr/local/libexec/mesos\" -DVERSION=\"1.2.0\" -D__STDC_FORMAT_MACROS -O2 -std=c++11 -g -fPIE -I/mesos/3rdparty/stout/include -I/usr/include/apr-1.0 -I/mesos/build/3rdparty/boost-1.53.0/src/boost-1.53.0 -I/mesos/build/3rdparty/elfio-3.2/src/elfio-3.2 -I/mesos/build/3rdparty/glog-0.3.3/src/glog-0.3.3-lib/lib/include -I/mesos/build/3rdparty/nvml-352.79/src/nvml-352.79 -I/mesos/build/3rdparty/picojson-1.3.0/src/picojson-1.3.0 -I/mesos/build/3rdparty/protobuf-2.6.1/src/protobuf-2.6.1-lib/lib/include -I/usr/include/subversion-1 -I/mesos/3rdparty/stout/tests/src -I/mesos/build/3rdparty/gmock-1.7.0/src/gmock-1.7.0/include -I/mesos/build/3rdparty/gmock-1.7.0/src/gmock-1.7.0/gtest/include    -o CMakeFiles/stout_tests.dir/os/process_tests.cpp.o -c /mesos/3rdparty/stout/tests/os/process_tests.cpp
/usr/bin/cmake -E cmake_progress_report /mesos/build/CMakeFiles 
[ 32%] Building CXX object 3rdparty/stout/tests/CMakeFiles/stout_tests.dir/os/rmdir_tests.cpp.o
cd /mesos/build/3rdparty/stout/tests && /usr/bin/clang++-3.5   -DHAS_AUTHENTICATION=1 -DLIBDIR=\"/usr/local/libmesos\" -DPICOJSON_USE_INT64 -DPKGDATADIR=\"/usr/local/share/mesos\" -DPKGLIBEXECDIR=\"/usr/local/libexec/mesos\" -DVERSION=\"1.2.0\" -D__STDC_FORMAT_MACROS -O2 -std=c++11 -g -fPIE -I/mesos/3rdparty/stout/include -I/usr/include/apr-1.0 -I/mesos/build/3rdparty/boost-1.53.0/src/boost-1.53.0 -I/mesos/build/3rdparty/elfio-3.2/src/elfio-3.2 -I/mesos/build/3rdparty/glog-0.3.3/src/glog-0.3.3-lib/lib/include -I/mesos/build/3rdparty/nvml-352.79/src/nvml-352.79 -I/mesos/build/3rdparty/picojson-1.3.0/src/picojson-1.3.0 -I/mesos/build/3rdparty/protobuf-2.6.1/src/protobuf-2.6.1-lib/lib/include -I/usr/include/subversion-1 -I/mesos/3rdparty/stout/tests/src -I/mesos/build/3rdparty/gmock-1.7.0/src/gmock-1.7.0/include -I/mesos/build/3rdparty/gmock-1.7.0/src/gmock-1.7.0/gtest/include    -o CMakeFiles/stout_tests.dir/os/rmdir_tests.cpp.o -c /mesos/3rdparty/stout/tests/os/rmdir_tests.cpp
/usr/bin/cmake -E cmake_progress_report /mesos/build/CMakeFiles 
[ 32%] Building CXX object 3rdparty/stout/tests/CMakeFiles/stout_tests.dir/os/socket_tests.cpp.o
cd /mesos/build/3rdparty/stout/tests && /usr/bin/clang++-3.5   -DHAS_AUTHENTICATION=1 -DLIBDIR=\"/usr/local/libmesos\" -DPICOJSON_USE_INT64 -DPKGDATADIR=\"/usr/local/share/mesos\" -DPKGLIBEXECDIR=\"/usr/local/libexec/mesos\" -DVERSION=\"1.2.0\" -D__STDC_FORMAT_MACROS -O2 -std=c++11 -g -fPIE -I/mesos/3rdparty/stout/include -I/usr/include/apr-1.0 -I/mesos/build/3rdparty/boost-1.53.0/src/boost-1.53.0 -I/mesos/build/3rdparty/elfio-3.2/src/elfio-3.2 -I/mesos/build/3rdparty/glog-0.3.3/src/glog-0.3.3-lib/lib/include -I/mesos/build/3rdparty/nvml-352.79/src/nvml-352.79 -I/mesos/build/3rdparty/picojson-1.3.0/src/picojson-1.3.0 -I/mesos/build/3rdparty/protobuf-2.6.1/src/protobuf-2.6.1-lib/lib/include -I/usr/include/subversion-1 -I/mesos/3rdparty/stout/tests/src -I/mesos/build/3rdparty/gmock-1.7.0/src/gmock-1.7.0/include -I/mesos/build/3rdparty/gmock-1.7.0/src/gmock-1.7.0/gtest/include    -o CMakeFiles/stout_tests.dir/os/socket_tests.cpp.o -c /mesos/3rdparty/stout/tests/os/socket_tests.cpp
/usr/bin/cmake -E cmake_progress_report /mesos/build/CMakeFiles 
[ 32%] Building CXX object 3rdparty/stout/tests/CMakeFiles/stout_tests.dir/os/strerror_tests.cpp.o
cd /mesos/build/3rdparty/stout/tests && /usr/bin/clang++-3.5   -DHAS_AUTHENTICATION=1 -DLIBDIR=\"/usr/local/libmesos\" -DPICOJSON_USE_INT64 -DPKGDATADIR=\"/usr/local/share/mesos\" -DPKGLIBEXECDIR=\"/usr/local/libexec/mesos\" -DVERSION=\"1.2.0\" -D__STDC_FORMAT_MACROS -O2 -std=c++11 -g -fPIE -I/mesos/3rdparty/stout/include -I/usr/include/apr-1.0 -I/mesos/build/3rdparty/boost-1.53.0/src/boost-1.53.0 -I/mesos/build/3rdparty/elfio-3.2/src/elfio-3.2 -I/mesos/build/3rdparty/glog-0.3.3/src/glog-0.3.3-lib/lib/include -I/mesos/build/3rdparty/nvml-352.79/src/nvml-352.79 -I/mesos/build/3rdparty/picojson-1.3.0/src/picojson-1.3.0 -I/mesos/build/3rdparty/protobuf-2.6.1/src/protobuf-2.6.1-lib/lib/include -I/usr/include/subversion-1 -I/mesos/3rdparty/stout/tests/src -I/mesos/build/3rdparty/gmock-1.7.0/src/gmock-1.7.0/include -I/mesos/build/3rdparty/gmock-1.7.0/src/gmock-1.7.0/gtest/include    -o CMakeFiles/stout_tests.dir/os/strerror_tests.cpp.o -c /mesos/3rdparty/stout/tests/os/strerror_tests.cpp
/usr/bin/cmake -E cmake_progress_report /mesos/build/CMakeFiles 
[ 32%] Building CXX object 3rdparty/stout/tests/CMakeFiles/stout_tests.dir/os/systems_tests.cpp.o
cd /mesos/build/3rdparty/stout/tests && /usr/bin/clang++-3.5   -DHAS_AUTHENTICATION=1 -DLIBDIR=\"/usr/local/libmesos\" -DPICOJSON_USE_INT64 -DPKGDATADIR=\"/usr/local/share/mesos\" -DPKGLIBEXECDIR=\"/usr/local/libexec/mesos\" -DVERSION=\"1.2.0\" -D__STDC_FORMAT_MACROS -O2 -std=c++11 -g -fPIE -I/mesos/3rdparty/stout/include -I/usr/include/apr-1.0 -I/mesos/build/3rdparty/boost-1.53.0/src/boost-1.53.0 -I/mesos/build/3rdparty/elfio-3.2/src/elfio-3.2 -I/mesos/build/3rdparty/glog-0.3.3/src/glog-0.3.3-lib/lib/include -I/mesos/build/3rdparty/nvml-352.79/src/nvml-352.79 -I/mesos/build/3rdparty/picojson-1.3.0/src/picojson-1.3.0 -I/mesos/build/3rdparty/protobuf-2.6.1/src/protobuf-2.6.1-lib/lib/include -I/usr/include/subversion-1 -I/mesos/3rdparty/stout/tests/src -I/mesos/build/3rdparty/gmock-1.7.0/src/gmock-1.7.0/include -I/mesos/build/3rdparty/gmock-1.7.0/src/gmock-1.7.0/gtest/include    -o CMakeFiles/stout_tests.dir/os/systems_tests.cpp.o -c /mesos/3rdparty/stout/tests/os/systems_tests.cpp
Linking CXX shared library libmesos-protobufs.so
cd /mesos/build/src && /usr/bin/cmake -E cmake_link_script CMakeFiles/mesos-protobufs.dir/link.txt --verbose=1
/usr/bin/clang++-3.5  -fPIC  -O2 -std=c++11 -g   -shared -Wl,-soname,libmesos-protobufs.so -o libmesos-protobufs.so CMakeFiles/mesos-protobufs.dir/__/include/mesos/authorizer/acls.pb.cc.o CMakeFiles/mesos-protobufs.dir/__/include/mesos/agent/agent.pb.cc.o CMakeFiles/mesos-protobufs.dir/__/include/mesos/allocator/allocator.pb.cc.o CMakeFiles/mesos-protobufs.dir/__/include/mesos/appc/spec.pb.cc.o CMakeFiles/mesos-protobufs.dir/__/include/mesos/authentication/authentication.pb.cc.o CMakeFiles/mesos-protobufs.dir/__/include/mesos/authorizer/authorizer.pb.cc.o CMakeFiles/mesos-protobufs.dir/__/include/mesos/slave/containerizer.pb.cc.o CMakeFiles/mesos-protobufs.dir/__/include/mesos/docker/spec.pb.cc.o CMakeFiles/mesos-protobufs.dir/__/include/mesos/docker/v1.pb.cc.o CMakeFiles/mesos-protobufs.dir/__/include/mesos/docker/v2.pb.cc.o CMakeFiles/mesos-protobufs.dir/__/include/mesos/executor/executor.pb.cc.o CMakeFiles/mesos-protobufs.dir/__/include/mesos/fetcher/fetcher.pb.cc.o CMakeFiles/mesos-protobufs.dir/__/include/mesos/module/hook.pb.cc.o CMakeFiles/mesos-protobufs.dir/__/include/mesos/maintenance/maintenance.pb.cc.o CMakeFiles/mesos-protobufs.dir/__/include/mesos/master/master.pb.cc.o CMakeFiles/mesos-protobufs.dir/__/include/mesos/mesos.pb.cc.o CMakeFiles/mesos-protobufs.dir/__/include/mesos/module/module.pb.cc.o CMakeFiles/mesos-protobufs.dir/__/include/mesos/slave/oversubscription.pb.cc.o CMakeFiles/mesos-protobufs.dir/__/include/mesos/quota/quota.pb.cc.o CMakeFiles/mesos-protobufs.dir/__/include/mesos/scheduler/scheduler.pb.cc.o CMakeFiles/mesos-protobufs.dir/__/include/mesos/state/state.pb.cc.o CMakeFiles/mesos-protobufs.dir/__/include/mesos/uri/uri.pb.cc.o CMakeFiles/mesos-protobufs.dir/__/include/mesos/v1/agent/agent.pb.cc.o CMakeFiles/mesos-protobufs.dir/__/include/mesos/v1/allocator/allocator.pb.cc.o CMakeFiles/mesos-protobufs.dir/__/include/mesos/v1/executor/executor.pb.cc.o CMakeFiles/mesos-protobufs.dir/__/include/mesos/v1/maintenance/maintenance.pb.cc.o CMakeFiles/mesos-protobufs.dir/__/include/mesos/v1/master/master.pb.cc.o CMakeFiles/mesos-protobufs.dir/__/include/mesos/v1/mesos.pb.cc.o CMakeFiles/mesos-protobufs.dir/__/include/mesos/v1/quota/quota.pb.cc.o CMakeFiles/mesos-protobufs.dir/__/include/mesos/v1/scheduler/scheduler.pb.cc.o CMakeFiles/mesos-protobufs.dir/messages/flags.pb.cc.o CMakeFiles/mesos-protobufs.dir/messages/log.pb.cc.o CMakeFiles/mesos-protobufs.dir/messages/messages.pb.cc.o CMakeFiles/mesos-protobufs.dir/messages/state.pb.cc.o CMakeFiles/mesos-protobufs.dir/slave/containerizer/mesos/isolators/network/cni/spec.pb.cc.o CMakeFiles/mesos-protobufs.dir/slave/containerizer/mesos/isolators/docker/volume/state.pb.cc.o CMakeFiles/mesos-protobufs.dir/slave/containerizer/mesos/provisioner/docker/message.pb.cc.o CMakeFiles/mesos-protobufs.dir/master/registry.pb.cc.o  -L/mesos/build/3rdparty/protobuf-2.6.1/src/protobuf-2.6.1-lib/lib/lib -lprotobuf -Wl,-rpath,/mesos/build/3rdparty/protobuf-2.6.1/src/protobuf-2.6.1-lib/lib/lib 
/usr/bin/cmake -E cmake_progress_report /mesos/build/CMakeFiles 
[ 32%] Building CXX object 3rdparty/stout/tests/CMakeFiles/stout_tests.dir/recordio_tests.cpp.o
cd /mesos/build/3rdparty/stout/tests && /usr/bin/clang++-3.5   -DHAS_AUTHENTICATION=1 -DLIBDIR=\"/usr/local/libmesos\" -DPICOJSON_USE_INT64 -DPKGDATADIR=\"/usr/local/share/mesos\" -DPKGLIBEXECDIR=\"/usr/local/libexec/mesos\" -DVERSION=\"1.2.0\" -D__STDC_FORMAT_MACROS -O2 -std=c++11 -g -fPIE -I/mesos/3rdparty/stout/include -I/usr/include/apr-1.0 -I/mesos/build/3rdparty/boost-1.53.0/src/boost-1.53.0 -I/mesos/build/3rdparty/elfio-3.2/src/elfio-3.2 -I/mesos/build/3rdparty/glog-0.3.3/src/glog-0.3.3-lib/lib/include -I/mesos/build/3rdparty/nvml-352.79/src/nvml-352.79 -I/mesos/build/3rdparty/picojson-1.3.0/src/picojson-1.3.0 -I/mesos/build/3rdparty/protobuf-2.6.1/src/protobuf-2.6.1-lib/lib/include -I/usr/include/subversion-1 -I/mesos/3rdparty/stout/tests/src -I/mesos/build/3rdparty/gmock-1.7.0/src/gmock-1.7.0/include -I/mesos/build/3rdparty/gmock-1.7.0/src/gmock-1.7.0/gtest/include    -o CMakeFiles/stout_tests.dir/recordio_tests.cpp.o -c /mesos/3rdparty/stout/tests/recordio_tests.cpp
/usr/bin/cmake -E cmake_progress_report /mesos/build/CMakeFiles 92
[ 33%] Building CXX object 3rdparty/stout/tests/CMakeFiles/stout_tests.dir/result_tests.cpp.o
cd /mesos/build/3rdparty/stout/tests && /usr/bin/clang++-3.5   -DHAS_AUTHENTICATION=1 -DLIBDIR=\"/usr/local/libmesos\" -DPICOJSON_USE_INT64 -DPKGDATADIR=\"/usr/local/share/mesos\" -DPKGLIBEXECDIR=\"/usr/local/libexec/mesos\" -DVERSION=\"1.2.0\" -D__STDC_FORMAT_MACROS -O2 -std=c++11 -g -fPIE -I/mesos/3rdparty/stout/include -I/usr/include/apr-1.0 -I/mesos/build/3rdparty/boost-1.53.0/src/boost-1.53.0 -I/mesos/build/3rdparty/elfio-3.2/src/elfio-3.2 -I/mesos/build/3rdparty/glog-0.3.3/src/glog-0.3.3-lib/lib/include -I/mesos/build/3rdparty/nvml-352.79/src/nvml-352.79 -I/mesos/build/3rdparty/picojson-1.3.0/src/picojson-1.3.0 -I/mesos/build/3rdparty/protobuf-2.6.1/src/protobuf-2.6.1-lib/lib/include -I/usr/include/subversion-1 -I/mesos/3rdparty/stout/tests/src -I/mesos/build/3rdparty/gmock-1.7.0/src/gmock-1.7.0/include -I/mesos/build/3rdparty/gmock-1.7.0/src/gmock-1.7.0/gtest/include    -o CMakeFiles/stout_tests.dir/result_tests.cpp.o -c /mesos/3rdparty/stout/tests/result_tests.cpp
make[3]: Leaving directory `/mesos/build'
/usr/bin/cmake -E cmake_progress_report /mesos/build/CMakeFiles  43 44 45 46 47 48 49 50 51 52 53 54
[ 33%] Built target mesos-protobufs
/usr/bin/cmake -E cmake_progress_report /mesos/build/CMakeFiles 
[ 33%] Building CXX object 3rdparty/stout/tests/CMakeFiles/stout_tests.dir/some_tests.cpp.o
cd /mesos/build/3rdparty/stout/tests && /usr/bin/clang++-3.5   -DHAS_AUTHENTICATION=1 -DLIBDIR=\"/usr/local/libmesos\" -DPICOJSON_USE_INT64 -DPKGDATADIR=\"/usr/local/share/mesos\" -DPKGLIBEXECDIR=\"/usr/local/libexec/mesos\" -DVERSION=\"1.2.0\" -D__STDC_FORMAT_MACROS -O2 -std=c++11 -g -fPIE -I/mesos/3rdparty/stout/include -I/usr/include/apr-1.0 -I/mesos/build/3rdparty/boost-1.53.0/src/boost-1.53.0 -I/mesos/build/3rdparty/elfio-3.2/src/elfio-3.2 -I/mesos/build/3rdparty/glog-0.3.3/src/glog-0.3.3-lib/lib/include -I/mesos/build/3rdparty/nvml-352.79/src/nvml-352.79 -I/mesos/build/3rdparty/picojson-1.3.0/src/picojson-1.3.0 -I/mesos/build/3rdparty/protobuf-2.6.1/src/protobuf-2.6.1-lib/lib/include -I/usr/include/subversion-1 -I/mesos/3rdparty/stout/tests/src -I/mesos/build/3rdparty/gmock-1.7.0/src/gmock-1.7.0/include -I/mesos/build/3rdparty/gmock-1.7.0/src/gmock-1.7.0/gtest/include    -o CMakeFiles/stout_tests.dir/some_tests.cpp.o -c /mesos/3rdparty/stout/tests/some_tests.cpp
/usr/bin/cmake -E cmake_progress_report /mesos/build/CMakeFiles 
[ 33%] Building CXX object 3rdparty/stout/tests/CMakeFiles/stout_tests.dir/strings_tests.cpp.o
cd /mesos/build/3rdparty/stout/tests && /usr/bin/clang++-3.5   -DHAS_AUTHENTICATION=1 -DLIBDIR=\"/usr/local/libmesos\" -DPICOJSON_USE_INT64 -DPKGDATADIR=\"/usr/local/share/mesos\" -DPKGLIBEXECDIR=\"/usr/local/libexec/mesos\" -DVERSION=\"1.2.0\" -D__STDC_FORMAT_MACROS -O2 -std=c++11 -g -fPIE -I/mesos/3rdparty/stout/include -I/usr/include/apr-1.0 -I/mesos/build/3rdparty/boost-1.53.0/src/boost-1.53.0 -I/mesos/build/3rdparty/elfio-3.2/src/elfio-3.2 -I/mesos/build/3rdparty/glog-0.3.3/src/glog-0.3.3-lib/lib/include -I/mesos/build/3rdparty/nvml-352.79/src/nvml-352.79 -I/mesos/build/3rdparty/picojson-1.3.0/src/picojson-1.3.0 -I/mesos/build/3rdparty/protobuf-2.6.1/src/protobuf-2.6.1-lib/lib/include -I/usr/include/subversion-1 -I/mesos/3rdparty/stout/tests/src -I/mesos/build/3rdparty/gmock-1.7.0/src/gmock-1.7.0/include -I/mesos/build/3rdparty/gmock-1.7.0/src/gmock-1.7.0/gtest/include    -o CMakeFiles/stout_tests.dir/strings_tests.cpp.o -c /mesos/3rdparty/stout/tests/strings_tests.cpp
/usr/bin/cmake -E cmake_progress_report /mesos/build/CMakeFiles 
[ 33%] Building CXX object 3rdparty/stout/tests/CMakeFiles/stout_tests.dir/subcommand_tests.cpp.o
cd /mesos/build/3rdparty/stout/tests && /usr/bin/clang++-3.5   -DHAS_AUTHENTICATION=1 -DLIBDIR=\"/usr/local/libmesos\" -DPICOJSON_USE_INT64 -DPKGDATADIR=\"/usr/local/share/mesos\" -DPKGLIBEXECDIR=\"/usr/local/libexec/mesos\" -DVERSION=\"1.2.0\" -D__STDC_FORMAT_MACROS -O2 -std=c++11 -g -fPIE -I/mesos/3rdparty/stout/include -I/usr/include/apr-1.0 -I/mesos/build/3rdparty/boost-1.53.0/src/boost-1.53.0 -I/mesos/build/3rdparty/elfio-3.2/src/elfio-3.2 -I/mesos/build/3rdparty/glog-0.3.3/src/glog-0.3.3-lib/lib/include -I/mesos/build/3rdparty/nvml-352.79/src/nvml-352.79 -I/mesos/build/3rdparty/picojson-1.3.0/src/picojson-1.3.0 -I/mesos/build/3rdparty/protobuf-2.6.1/src/protobuf-2.6.1-lib/lib/include -I/usr/include/subversion-1 -I/mesos/3rdparty/stout/tests/src -I/mesos/build/3rdparty/gmock-1.7.0/src/gmock-1.7.0/include -I/mesos/build/3rdparty/gmock-1.7.0/src/gmock-1.7.0/gtest/include    -o CMakeFiles/stout_tests.dir/subcommand_tests.cpp.o -c /mesos/3rdparty/stout/tests/subcommand_tests.cpp
/usr/bin/cmake -E cmake_progress_report /mesos/build/CMakeFiles 
[ 33%] Building CXX object 3rdparty/stout/tests/CMakeFiles/stout_tests.dir/try_tests.cpp.o
cd /mesos/build/3rdparty/stout/tests && /usr/bin/clang++-3.5   -DHAS_AUTHENTICATION=1 -DLIBDIR=\"/usr/local/libmesos\" -DPICOJSON_USE_INT64 -DPKGDATADIR=\"/usr/local/share/mesos\" -DPKGLIBEXECDIR=\"/usr/local/libexec/mesos\" -DVERSION=\"1.2.0\" -D__STDC_FORMAT_MACROS -O2 -std=c++11 -g -fPIE -I/mesos/3rdparty/stout/include -I/usr/include/apr-1.0 -I/mesos/build/3rdparty/boost-1.53.0/src/boost-1.53.0 -I/mesos/build/3rdparty/elfio-3.2/src/elfio-3.2 -I/mesos/build/3rdparty/glog-0.3.3/src/glog-0.3.3-lib/lib/include -I/mesos/build/3rdparty/nvml-352.79/src/nvml-352.79 -I/mesos/build/3rdparty/picojson-1.3.0/src/picojson-1.3.0 -I/mesos/build/3rdparty/protobuf-2.6.1/src/protobuf-2.6.1-lib/lib/include -I/usr/include/subversion-1 -I/mesos/3rdparty/stout/tests/src -I/mesos/build/3rdparty/gmock-1.7.0/src/gmock-1.7.0/include -I/mesos/build/3rdparty/gmock-1.7.0/src/gmock-1.7.0/gtest/include    -o CMakeFiles/stout_tests.dir/try_tests.cpp.o -c /mesos/3rdparty/stout/tests/try_tests.cpp
/usr/bin/cmake -E cmake_progress_report /mesos/build/CMakeFiles 
[ 33%] Building CXX object 3rdparty/stout/tests/CMakeFiles/stout_tests.dir/uuid_tests.cpp.o
cd /mesos/build/3rdparty/stout/tests && /usr/bin/clang++-3.5   -DHAS_AUTHENTICATION=1 -DLIBDIR=\"/usr/local/libmesos\" -DPICOJSON_USE_INT64 -DPKGDATADIR=\"/usr/local/share/mesos\" -DPKGLIBEXECDIR=\"/usr/local/libexec/mesos\" -DVERSION=\"1.2.0\" -D__STDC_FORMAT_MACROS -O2 -std=c++11 -g -fPIE -I/mesos/3rdparty/stout/include -I/usr/include/apr-1.0 -I/mesos/build/3rdparty/boost-1.53.0/src/boost-1.53.0 -I/mesos/build/3rdparty/elfio-3.2/src/elfio-3.2 -I/mesos/build/3rdparty/glog-0.3.3/src/glog-0.3.3-lib/lib/include -I/mesos/build/3rdparty/nvml-352.79/src/nvml-352.79 -I/mesos/build/3rdparty/picojson-1.3.0/src/picojson-1.3.0 -I/mesos/build/3rdparty/protobuf-2.6.1/src/protobuf-2.6.1-lib/lib/include -I/usr/include/subversion-1 -I/mesos/3rdparty/stout/tests/src -I/mesos/build/3rdparty/gmock-1.7.0/src/gmock-1.7.0/include -I/mesos/build/3rdparty/gmock-1.7.0/src/gmock-1.7.0/gtest/include    -o CMakeFiles/stout_tests.dir/uuid_tests.cpp.o -c /mesos/3rdparty/stout/tests/uuid_tests.cpp
/usr/bin/cmake -E cmake_progress_report /mesos/build/CMakeFiles 93
[ 34%] Building CXX object 3rdparty/stout/tests/CMakeFiles/stout_tests.dir/version_tests.cpp.o
cd /mesos/build/3rdparty/stout/tests && /usr/bin/clang++-3.5   -DHAS_AUTHENTICATION=1 -DLIBDIR=\"/usr/local/libmesos\" -DPICOJSON_USE_INT64 -DPKGDATADIR=\"/usr/local/share/mesos\" -DPKGLIBEXECDIR=\"/usr/local/libexec/mesos\" -DVERSION=\"1.2.0\" -D__STDC_FORMAT_MACROS -O2 -std=c++11 -g -fPIE -I/mesos/3rdparty/stout/include -I/usr/include/apr-1.0 -I/mesos/build/3rdparty/boost-1.53.0/src/boost-1.53.0 -I/mesos/build/3rdparty/elfio-3.2/src/elfio-3.2 -I/mesos/build/3rdparty/glog-0.3.3/src/glog-0.3.3-lib/lib/include -I/mesos/build/3rdparty/nvml-352.79/src/nvml-352.79 -I/mesos/build/3rdparty/picojson-1.3.0/src/picojson-1.3.0 -I/mesos/build/3rdparty/protobuf-2.6.1/src/protobuf-2.6.1-lib/lib/include -I/usr/include/subversion-1 -I/mesos/3rdparty/stout/tests/src -I/mesos/build/3rdparty/gmock-1.7.0/src/gmock-1.7.0/include -I/mesos/build/3rdparty/gmock-1.7.0/src/gmock-1.7.0/gtest/include    -o CMakeFiles/stout_tests.dir/version_tests.cpp.o -c /mesos/3rdparty/stout/tests/version_tests.cpp
/usr/bin/cmake -E cmake_progress_report /mesos/build/CMakeFiles 
[ 34%] Building CXX object 3rdparty/stout/tests/CMakeFiles/stout_tests.dir/path_tests.cpp.o
cd /mesos/build/3rdparty/stout/tests && /usr/bin/clang++-3.5   -DHAS_AUTHENTICATION=1 -DLIBDIR=\"/usr/local/libmesos\" -DPICOJSON_USE_INT64 -DPKGDATADIR=\"/usr/local/share/mesos\" -DPKGLIBEXECDIR=\"/usr/local/libexec/mesos\" -DVERSION=\"1.2.0\" -D__STDC_FORMAT_MACROS -O2 -std=c++11 -g -fPIE -I/mesos/3rdparty/stout/include -I/usr/include/apr-1.0 -I/mesos/build/3rdparty/boost-1.53.0/src/boost-1.53.0 -I/mesos/build/3rdparty/elfio-3.2/src/elfio-3.2 -I/mesos/build/3rdparty/glog-0.3.3/src/glog-0.3.3-lib/lib/include -I/mesos/build/3rdparty/nvml-352.79/src/nvml-352.79 -I/mesos/build/3rdparty/picojson-1.3.0/src/picojson-1.3.0 -I/mesos/build/3rdparty/protobuf-2.6.1/src/protobuf-2.6.1-lib/lib/include -I/usr/include/subversion-1 -I/mesos/3rdparty/stout/tests/src -I/mesos/build/3rdparty/gmock-1.7.0/src/gmock-1.7.0/include -I/mesos/build/3rdparty/gmock-1.7.0/src/gmock-1.7.0/gtest/include    -o CMakeFiles/stout_tests.dir/path_tests.cpp.o -c /mesos/3rdparty/stout/tests/path_tests.cpp
/usr/bin/cmake -E cmake_progress_report /mesos/build/CMakeFiles 
[ 34%] Building CXX object 3rdparty/stout/tests/CMakeFiles/stout_tests.dir/protobuf_tests.cpp.o
cd /mesos/build/3rdparty/stout/tests && /usr/bin/clang++-3.5   -DHAS_AUTHENTICATION=1 -DLIBDIR=\"/usr/local/libmesos\" -DPICOJSON_USE_INT64 -DPKGDATADIR=\"/usr/local/share/mesos\" -DPKGLIBEXECDIR=\"/usr/local/libexec/mesos\" -DVERSION=\"1.2.0\" -D__STDC_FORMAT_MACROS -O2 -std=c++11 -g -fPIE -I/mesos/3rdparty/stout/include -I/usr/include/apr-1.0 -I/mesos/build/3rdparty/boost-1.53.0/src/boost-1.53.0 -I/mesos/build/3rdparty/elfio-3.2/src/elfio-3.2 -I/mesos/build/3rdparty/glog-0.3.3/src/glog-0.3.3-lib/lib/include -I/mesos/build/3rdparty/nvml-352.79/src/nvml-352.79 -I/mesos/build/3rdparty/picojson-1.3.0/src/picojson-1.3.0 -I/mesos/build/3rdparty/protobuf-2.6.1/src/protobuf-2.6.1-lib/lib/include -I/usr/include/subversion-1 -I/mesos/3rdparty/stout/tests/src -I/mesos/build/3rdparty/gmock-1.7.0/src/gmock-1.7.0/include -I/mesos/build/3rdparty/gmock-1.7.0/src/gmock-1.7.0/gtest/include    -o CMakeFiles/stout_tests.dir/protobuf_tests.cpp.o -c /mesos/3rdparty/stout/tests/protobuf_tests.cpp
/usr/bin/cmake -E cmake_progress_report /mesos/build/CMakeFiles 
[ 34%] Building CXX object 3rdparty/stout/tests/CMakeFiles/stout_tests.dir/protobuf_tests.pb.cc.o
cd /mesos/build/3rdparty/stout/tests && /usr/bin/clang++-3.5   -DHAS_AUTHENTICATION=1 -DLIBDIR=\"/usr/local/libmesos\" -DPICOJSON_USE_INT64 -DPKGDATADIR=\"/usr/local/share/mesos\" -DPKGLIBEXECDIR=\"/usr/local/libexec/mesos\" -DVERSION=\"1.2.0\" -D__STDC_FORMAT_MACROS -O2 -std=c++11 -g -fPIE -I/mesos/3rdparty/stout/include -I/usr/include/apr-1.0 -I/mesos/build/3rdparty/boost-1.53.0/src/boost-1.53.0 -I/mesos/build/3rdparty/elfio-3.2/src/elfio-3.2 -I/mesos/build/3rdparty/glog-0.3.3/src/glog-0.3.3-lib/lib/include -I/mesos/build/3rdparty/nvml-352.79/src/nvml-352.79 -I/mesos/build/3rdparty/picojson-1.3.0/src/picojson-1.3.0 -I/mesos/build/3rdparty/protobuf-2.6.1/src/protobuf-2.6.1-lib/lib/include -I/usr/include/subversion-1 -I/mesos/3rdparty/stout/tests/src -I/mesos/build/3rdparty/gmock-1.7.0/src/gmock-1.7.0/include -I/mesos/build/3rdparty/gmock-1.7.0/src/gmock-1.7.0/gtest/include    -o CMakeFiles/stout_tests.dir/protobuf_tests.pb.cc.o -c /mesos/3rdparty/stout/tests/protobuf_tests.pb.cc
/usr/bin/cmake -E cmake_progress_report /mesos/build/CMakeFiles 
[ 34%] Building CXX object 3rdparty/stout/tests/CMakeFiles/stout_tests.dir/svn_tests.cpp.o
cd /mesos/build/3rdparty/stout/tests && /usr/bin/clang++-3.5   -DHAS_AUTHENTICATION=1 -DLIBDIR=\"/usr/local/libmesos\" -DPICOJSON_USE_INT64 -DPKGDATADIR=\"/usr/local/share/mesos\" -DPKGLIBEXECDIR=\"/usr/local/libexec/mesos\" -DVERSION=\"1.2.0\" -D__STDC_FORMAT_MACROS -O2 -std=c++11 -g -fPIE -I/mesos/3rdparty/stout/include -I/usr/include/apr-1.0 -I/mesos/build/3rdparty/boost-1.53.0/src/boost-1.53.0 -I/mesos/build/3rdparty/elfio-3.2/src/elfio-3.2 -I/mesos/build/3rdparty/glog-0.3.3/src/glog-0.3.3-lib/lib/include -I/mesos/build/3rdparty/nvml-352.79/src/nvml-352.79 -I/mesos/build/3rdparty/picojson-1.3.0/src/picojson-1.3.0 -I/mesos/build/3rdparty/protobuf-2.6.1/src/protobuf-2.6.1-lib/lib/include -I/usr/include/subversion-1 -I/mesos/3rdparty/stout/tests/src -I/mesos/build/3rdparty/gmock-1.7.0/src/gmock-1.7.0/include -I/mesos/build/3rdparty/gmock-1.7.0/src/gmock-1.7.0/gtest/include    -o CMakeFiles/stout_tests.dir/svn_tests.cpp.o -c /mesos/3rdparty/stout/tests/svn_tests.cpp
/usr/bin/cmake -E cmake_progress_report /mesos/build/CMakeFiles 
[ 34%] Building CXX object 3rdparty/stout/tests/CMakeFiles/stout_tests.dir/os/sendfile_tests.cpp.o
cd /mesos/build/3rdparty/stout/tests && /usr/bin/clang++-3.5   -DHAS_AUTHENTICATION=1 -DLIBDIR=\"/usr/local/libmesos\" -DPICOJSON_USE_INT64 -DPKGDATADIR=\"/usr/local/share/mesos\" -DPKGLIBEXECDIR=\"/usr/local/libexec/mesos\" -DVERSION=\"1.2.0\" -D__STDC_FORMAT_MACROS -O2 -std=c++11 -g -fPIE -I/mesos/3rdparty/stout/include -I/usr/include/apr-1.0 -I/mesos/build/3rdparty/boost-1.53.0/src/boost-1.53.0 -I/mesos/build/3rdparty/elfio-3.2/src/elfio-3.2 -I/mesos/build/3rdparty/glog-0.3.3/src/glog-0.3.3-lib/lib/include -I/mesos/build/3rdparty/nvml-352.79/src/nvml-352.79 -I/mesos/build/3rdparty/picojson-1.3.0/src/picojson-1.3.0 -I/mesos/build/3rdparty/protobuf-2.6.1/src/protobuf-2.6.1-lib/lib/include -I/usr/include/subversion-1 -I/mesos/3rdparty/stout/tests/src -I/mesos/build/3rdparty/gmock-1.7.0/src/gmock-1.7.0/include -I/mesos/build/3rdparty/gmock-1.7.0/src/gmock-1.7.0/gtest/include    -o CMakeFiles/stout_tests.dir/os/sendfile_tests.cpp.o -c /mesos/3rdparty/stout/tests/os/sendfile_tests.cpp
/usr/bin/cmake -E cmake_progress_report /mesos/build/CMakeFiles 94
[ 35%] Building CXX object 3rdparty/stout/tests/CMakeFiles/stout_tests.dir/os/signals_tests.cpp.o
cd /mesos/build/3rdparty/stout/tests && /usr/bin/clang++-3.5   -DHAS_AUTHENTICATION=1 -DLIBDIR=\"/usr/local/libmesos\" -DPICOJSON_USE_INT64 -DPKGDATADIR=\"/usr/local/share/mesos\" -DPKGLIBEXECDIR=\"/usr/local/libexec/mesos\" -DVERSION=\"1.2.0\" -D__STDC_FORMAT_MACROS -O2 -std=c++11 -g -fPIE -I/mesos/3rdparty/stout/include -I/usr/include/apr-1.0 -I/mesos/build/3rdparty/boost-1.53.0/src/boost-1.53.0 -I/mesos/build/3rdparty/elfio-3.2/src/elfio-3.2 -I/mesos/build/3rdparty/glog-0.3.3/src/glog-0.3.3-lib/lib/include -I/mesos/build/3rdparty/nvml-352.79/src/nvml-352.79 -I/mesos/build/3rdparty/picojson-1.3.0/src/picojson-1.3.0 -I/mesos/build/3rdparty/protobuf-2.6.1/src/protobuf-2.6.1-lib/lib/include -I/usr/include/subversion-1 -I/mesos/3rdparty/stout/tests/src -I/mesos/build/3rdparty/gmock-1.7.0/src/gmock-1.7.0/include -I/mesos/build/3rdparty/gmock-1.7.0/src/gmock-1.7.0/gtest/include    -o CMakeFiles/stout_tests.dir/os/signals_tests.cpp.o -c /mesos/3rdparty/stout/tests/os/signals_tests.cpp
/usr/bin/cmake -E cmake_progress_report /mesos/build/CMakeFiles 
[ 35%] Building CXX object 3rdparty/stout/tests/CMakeFiles/stout_tests.dir/proc_tests.cpp.o
cd /mesos/build/3rdparty/stout/tests && /usr/bin/clang++-3.5   -DHAS_AUTHENTICATION=1 -DLIBDIR=\"/usr/local/libmesos\" -DPICOJSON_USE_INT64 -DPKGDATADIR=\"/usr/local/share/mesos\" -DPKGLIBEXECDIR=\"/usr/local/libexec/mesos\" -DVERSION=\"1.2.0\" -D__STDC_FORMAT_MACROS -O2 -std=c++11 -g -fPIE -I/mesos/3rdparty/stout/include -I/usr/include/apr-1.0 -I/mesos/build/3rdparty/boost-1.53.0/src/boost-1.53.0 -I/mesos/build/3rdparty/elfio-3.2/src/elfio-3.2 -I/mesos/build/3rdparty/glog-0.3.3/src/glog-0.3.3-lib/lib/include -I/mesos/build/3rdparty/nvml-352.79/src/nvml-352.79 -I/mesos/build/3rdparty/picojson-1.3.0/src/picojson-1.3.0 -I/mesos/build/3rdparty/protobuf-2.6.1/src/protobuf-2.6.1-lib/lib/include -I/usr/include/subversion-1 -I/mesos/3rdparty/stout/tests/src -I/mesos/build/3rdparty/gmock-1.7.0/src/gmock-1.7.0/include -I/mesos/build/3rdparty/gmock-1.7.0/src/gmock-1.7.0/gtest/include    -o CMakeFiles/stout_tests.dir/proc_tests.cpp.o -c /mesos/3rdparty/stout/tests/proc_tests.cpp
Linking CXX executable stout_tests
cd /mesos/build/3rdparty/stout/tests && /usr/bin/cmake -E cmake_link_script CMakeFiles/stout_tests.dir/link.txt --verbose=1
/usr/bin/clang++-3.5    -O2 -std=c++11 -g    CMakeFiles/stout_tests.dir/base64_tests.cpp.o CMakeFiles/stout_tests.dir/bits_tests.cpp.o CMakeFiles/stout_tests.dir/bytes_tests.cpp.o CMakeFiles/stout_tests.dir/cache_tests.cpp.o CMakeFiles/stout_tests.dir/duration_tests.cpp.o CMakeFiles/stout_tests.dir/dynamiclibrary_tests.cpp.o CMakeFiles/stout_tests.dir/error_tests.cpp.o CMakeFiles/stout_tests.dir/flags_tests.cpp.o CMakeFiles/stout_tests.dir/gzip_tests.cpp.o CMakeFiles/stout_tests.dir/hashmap_tests.cpp.o CMakeFiles/stout_tests.dir/hashset_tests.cpp.o CMakeFiles/stout_tests.dir/interval_tests.cpp.o CMakeFiles/stout_tests.dir/ip_tests.cpp.o CMakeFiles/stout_tests.dir/json_tests.cpp.o CMakeFiles/stout_tests.dir/jsonify_tests.cpp.o CMakeFiles/stout_tests.dir/linkedhashmap_tests.cpp.o CMakeFiles/stout_tests.dir/mac_tests.cpp.o CMakeFiles/stout_tests.dir/main.cpp.o CMakeFiles/stout_tests.dir/multimap_tests.cpp.o CMakeFiles/stout_tests.dir/none_tests.cpp.o CMakeFiles/stout_tests.dir/numify_tests.cpp.o CMakeFiles/stout_tests.dir/option_tests.cpp.o CMakeFiles/stout_tests.dir/os_tests.cpp.o CMakeFiles/stout_tests.dir/os/env_tests.cpp.o CMakeFiles/stout_tests.dir/os/filesystem_tests.cpp.o CMakeFiles/stout_tests.dir/os/process_tests.cpp.o CMakeFiles/stout_tests.dir/os/rmdir_tests.cpp.o CMakeFiles/stout_tests.dir/os/socket_tests.cpp.o CMakeFiles/stout_tests.dir/os/strerror_tests.cpp.o CMakeFiles/stout_tests.dir/os/systems_tests.cpp.o CMakeFiles/stout_tests.dir/recordio_tests.cpp.o CMakeFiles/stout_tests.dir/result_tests.cpp.o CMakeFiles/stout_tests.dir/some_tests.cpp.o CMakeFiles/stout_tests.dir/strings_tests.cpp.o CMakeFiles/stout_tests.dir/subcommand_tests.cpp.o CMakeFiles/stout_tests.dir/try_tests.cpp.o CMakeFiles/stout_tests.dir/uuid_tests.cpp.o CMakeFiles/stout_tests.dir/version_tests.cpp.o CMakeFiles/stout_tests.dir/path_tests.cpp.o CMakeFiles/stout_tests.dir/protobuf_tests.cpp.o CMakeFiles/stout_tests.dir/protobuf_tests.pb.cc.o CMakeFiles/stout_tests.dir/svn_tests.cpp.o CMakeFiles/stout_tests.dir/os/sendfile_tests.cpp.o CMakeFiles/stout_tests.dir/os/signals_tests.cpp.o CMakeFiles/stout_tests.dir/proc_tests.cpp.o  -o stout_tests  -L/usr/lib/x86_64-linux-gnu/libapr-1.so  -L/mesos/build/3rdparty/glog-0.3.3/src/glog-0.3.3-lib/lib/lib  -L/mesos/build/3rdparty/protobuf-2.6.1/src/protobuf-2.6.1-lib/lib/lib  -L/usr/lib/x86_64-linux-gnu/libsvn_delta-1.so  -L/usr/lib/x86_64-linux-gnu/libsvn_diff-1.so  -L/usr/lib/x86_64-linux-gnu/libsvn_subr-1.so  -L/mesos/build/3rdparty/gmock-1.7.0/src/gmock-1.7.0-lib/lib  -L/mesos/build/3rdparty/gmock-1.7.0/src/gmock-1.7.0-build/gtest/lib/.libs -rdynamic -lcurl -lglog -lsvn_delta-1 -lsvn_diff-1 -lsvn_subr-1 -lprotobuf -ldl -lapr-1 -lrt -lpthread -lcurl -lglog -lsvn_delta-1 -lsvn_diff-1 -lsvn_subr-1 -lsvn_delta-1 -lsvn_diff-1 -lsvn_subr-1 -lprotobuf -ldl -lapr-1 -lrt -lpthread -lcurl -lglog -lsvn_delta-1 -lsvn_diff-1 -lsvn_subr-1 -lsvn_delta-1 -lsvn_diff-1 -lsvn_subr-1 -lsvn_delta-1 -lsvn_diff-1 -lsvn_subr-1 -lsvn_delta-1 -lsvn_diff-1 -lsvn_subr-1 -lprotobuf -ldl -lapr-1 -lrt -lpthread -lcurl -lglog -lsvn_delta-1 -lsvn_diff-1 -lsvn_subr-1 -lsvn_delta-1 -lsvn_diff-1 -lsvn_subr-1 -lsvn_delta-1 -lsvn_diff-1 -lsvn_subr-1 -lsvn_delta-1 -lsvn_diff-1 -lsvn_subr-1 -lsvn_delta-1 -lsvn_diff-1 -lsvn_subr-1 -lsvn_delta-1 -lsvn_diff-1 -lsvn_subr-1 -lprotobuf -ldl -lapr-1 -lrt -lgmock -lgtest -lpthread -lgmock -lgtest -Wl,-rpath,/usr/lib/x86_64-linux-gnu/libapr-1.so:/mesos/build/3rdparty/glog-0.3.3/src/glog-0.3.3-lib/lib/lib:/mesos/build/3rdparty/protobuf-2.6.1/src/protobuf-2.6.1-lib/lib/lib:/usr/lib/x86_64-linux-gnu/libsvn_delta-1.so:/usr/lib/x86_64-linux-gnu/libsvn_diff-1.so:/usr/lib/x86_64-linux-gnu/libsvn_subr-1.so:/mesos/build/3rdparty/gmock-1.7.0/src/gmock-1.7.0-lib/lib:/mesos/build/3rdparty/gmock-1.7.0/src/gmock-1.7.0-build/gtest/lib/.libs 
make[3]: Leaving directory `/mesos/build'
/usr/bin/cmake -E cmake_progress_report /mesos/build/CMakeFiles  87 88 89 90 91 92 93 94
[ 35%] Built target stout_tests
make[2]: Leaving directory `/mesos/build'
make[1]: *** [CMakeFiles/check.dir/rule] Error 2
make[1]: Leaving directory `/mesos/build'
make: *** [check] Error 2
+ docker rmi mesos-1480619526-27775
Untagged: mesos-1480619526-27775:latest
Deleted: sha256:1a881afd576ea344c99733bc10b12d75469e3cd56268244b4b118712c9971cbe
Deleted: sha256:e782846a2b29ca4bdccb262f7027948912d157cec25c3d362d56f48b6e29dda9
Deleted: sha256:8d46e03e281fbfcfc5b936178efa83726184ef1e256bb84253c229cee3b34f23
Deleted: sha256:88ac68e36f2691cbc48a9f0666ec284696e31f8b4a09a439e24385495e418320
Deleted: sha256:808fd4614630a79d278444b651cd08e085987b6ff788c498151eb0eca3b37eab
Deleted: sha256:c369401268763c12121d38d2023bdc4d1cc29e62c80b8dbb6e73a5af7f48abee
Deleted: sha256:36508a335b1c22a61859f089bdf4adc653f52d779933058e66c6bc1344da5c80
Deleted: sha256:3554d27b26100121b69ef5be78a059f27955025d1a17eae7bc81126055948ec0
Deleted: sha256:bad0b20e53ee61826b30f3346e6b36b627cbb95e03e067664d43c78607534b2c
Deleted: sha256:5ed7fc66bb71bfdb4939ba0d21f7e109d90a0e7ef702d9a48472b75494367c63
Deleted: sha256:1b3537336c168d4351ac4e092fd17e85bf738e6fdbe5db4c09aed35c8c20fd93
Deleted: sha256:38e038756b8b01b1826d835de43b0321ab324d82bdaf4eae249990e379c31917
Deleted: sha256:e846cac58c5166af2408522e84ba5f82569077f039e812a27e6a647a6d05e74e
Deleted: sha256:177e859d467614d15d146b78c9cf57cb3ceebe4088ba8ede14d766e4b89f26d6
Deleted: sha256:6a69ff00e4ce025c5b488de82845dc21bf268b7f30c62007ae31ac36266501d1
Deleted: sha256:699150ecb435add704eb32361f7e2884ed750157ba8d7096cc9d9bd469b22a9e
Deleted: sha256:2f1837bf8eab3c9ee016f59f98a783791036f49f41dcfa3e4cb2a0f26e0a98a8
Deleted: sha256:4d0b198f5ef03916301b53fef44813c93661513e2da7009baa5e668c5cbf370f
Deleted: sha256:4397fad1dae53841491874629c64afadd4fd0b68503bdfa9f0bad3285078c93e
Deleted: sha256:10285a9818e27e2930eca3bf82d254d8182519a99f9b03ebce10b1f0e1fbea69
Deleted: sha256:bd12864475b815d1530c84616a8d035492c8adace87d1dfd12e9f5c5ed83f0e7
Deleted: sha256:243f5e81b4d51c81bfe6e7158ccdd87c50b68803f583597d10af9f0bb20bc3c2
Deleted: sha256:a6e6db4f31858d7c78d4d215ef1fbea9174769555e077dad85ef79b16b09ec67
Deleted: sha256:7aef347aaa594f86b80566d089d655cb5a5bed5ce3e2940bfe41eaccbe70aa41
Build step 'Execute shell' marked build as failure

Mime
View raw message