mesos-builds mailing list archives

Site index · List index
Message view « Date » · « Thread »
Top « Date » · « Thread »
From Apache Jenkins Server <jenk...@builds.apache.org>
Subject Build failed in Jenkins: Mesos » autotools,gcc,--verbose --enable-libevent --enable-ssl,GLOG_v=1 MESOS_VERBOSE=1,ubuntu:14.04,(docker||Hadoop)&&(!ubuntu-us1)&&(!ubuntu-6)&&(!ubuntu-eu2) #3031
Date Mon, 12 Dec 2016 01:29:01 GMT
See <https://builds.apache.org/job/Mesos/BUILDTOOL=autotools,COMPILER=gcc,CONFIGURATION=--verbose%20--enable-libevent%20--enable-ssl,ENVIRONMENT=GLOG_v=1%20MESOS_VERBOSE=1,OS=ubuntu%3A14.04,label_exp=(docker%7C%7CHadoop)&&(!ubuntu-us1)&&(!ubuntu-6)&&(!ubuntu-eu2)/3031/changes>

Changes:

[vinodkone] Cleaned up expectations in api_tests.cpp.

[vinodkone] Added new test for LAUNCH_NESTED_CONTAINER_SESSION.

[vinodkone] Added a TTY test for LAUNCH_NESTED_CONTAINER_SESSION.

[vinodkone] Removed the TODO in AgentAPITest.AttachContainerOutputFailure test.

[vinodkone] Added AgentAPITest.LaunchNestedContainerSessionDisconnected.

------------------------------------------
[...truncated 175140 lines...]
I1212 01:27:34.876413 31611 containerizer.cpp:220] Using isolation: posix/cpu,posix/mem,filesystem/posix,network/cni
W1212 01:27:34.877017 31611 backend.cpp:76] Failed to create 'aufs' backend: AufsBackend requires
root privileges, but is running as user mesos
W1212 01:27:34.877238 31611 backend.cpp:76] Failed to create 'bind' backend: BindBackend requires
root privileges
I1212 01:27:34.881228 14752 slave.cpp:209] Mesos agent started on (672)@172.17.0.2:53706
I1212 01:27:34.881265 14752 slave.cpp:210] Flags at startup: --acls="" --appc_simple_discovery_uri_prefix="http://"
--appc_store_dir="/tmp/mesos/store/appc" --authenticate_http_readonly="true" --authenticate_http_readwrite="true"
--authenticatee="crammd5" --authentication_backoff_factor="1secs" --authorizer="local" --cgroups_cpu_enable_pids_and_tids_count="false"
--cgroups_enable_cfs="false" --cgroups_hierarchy="/sys/fs/cgroup" --cgroups_limit_swap="false"
--cgroups_root="mesos" --container_disk_watch_interval="15secs" --containerizers="mesos" --credential="/tmp/Endpoint_SlaveEndpointTest_AuthorizedRequest_1_zsiiSg/credential"
--default_role="*" --disk_watch_interval="1mins" --docker="docker" --docker_kill_orphans="true"
--docker_registry="https://registry-1.docker.io" --docker_remove_delay="6hrs" --docker_socket="/var/run/docker.sock"
--docker_stop_timeout="0ns" --docker_store_dir="/tmp/mesos/store/docker" --docker_volume_checkpoint_dir="/var/run/mesos/isolators/docker/volume"
--enforce_container_disk_quota="false" --executor_registration_timeout="1mins" --executor_shutdown_grace_period="5secs"
--fetcher_cache_dir="/tmp/Endpoint_SlaveEndpointTest_AuthorizedRequest_1_zsiiSg/fetch" --fetcher_cache_size="2GB"
--frameworks_home="" --gc_delay="1weeks" --gc_disk_headroom="0.1" --hadoop_home="" --help="false"
--hostname_lookup="true" --http_authenticators="basic" --http_command_executor="false" --http_credentials="/tmp/Endpoint_SlaveEndpointTest_AuthorizedRequest_1_zsiiSg/http_credentials"
--image_provisioner_backend="copy" --initialize_driver_logging="true" --io_switchboard_enable_server="true"
--isolation="posix/cpu,posix/mem" --launcher="posix" --launcher_dir="/mesos/mesos-1.2.0/_build/src"
--logbufsecs="0" --logging_level="INFO" --max_completed_executors_per_framework="150" --oversubscribed_resources_interval="15secs"
--perf_duration="10secs" --perf_interval="1mins" --qos_correction_interval_min="0ns" --quiet="false"
--recover="reconnect" --recovery_timeout="15mins" --registration_backoff_factor="10ms" --resources="cpus:2;gpus:0;mem:1024;disk:1024;ports:[31000-32000]"
--revocable_cpu_low_priority="true" --runtime_dir="/tmp/Endpoint_SlaveEndpointTest_AuthorizedRequest_1_zsiiSg"
--sandbox_directory="/mnt/mesos/sandbox" --strict="true" --switch_user="true" --systemd_enable_support="true"
--systemd_runtime_directory="/run/systemd/system" --version="false" --work_dir="/tmp/Endpoint_SlaveEndpointTest_AuthorizedRequest_1_2NPe8C"
I1212 01:27:34.882256 14752 credentials.hpp:86] Loading credential for authentication from
'/tmp/Endpoint_SlaveEndpointTest_AuthorizedRequest_1_zsiiSg/credential'
I1212 01:27:34.882490 14752 slave.cpp:347] Agent using credential for: test-principal
I1212 01:27:34.882525 14752 credentials.hpp:37] Loading credentials for authentication from
'/tmp/Endpoint_SlaveEndpointTest_AuthorizedRequest_1_zsiiSg/http_credentials'
I1212 01:27:34.882925 14752 http.cpp:922] Using default 'basic' HTTP authenticator for realm
'mesos-agent-readonly'
I1212 01:27:34.883071 14752 http.cpp:922] Using default 'basic' HTTP authenticator for realm
'mesos-agent-readwrite'
I1212 01:27:34.884444 14752 slave.cpp:534] Agent resources: cpus(*):2; mem(*):1024; disk(*):1024;
ports(*):[31000-32000]
I1212 01:27:34.884551 14752 slave.cpp:542] Agent attributes: [  ]
I1212 01:27:34.884578 14752 slave.cpp:547] Agent hostname: 6460622fcc16
I1212 01:27:34.886224 14753 state.cpp:57] Recovering state from '/tmp/Endpoint_SlaveEndpointTest_AuthorizedRequest_1_2NPe8C/meta'
I1212 01:27:34.886800 14742 status_update_manager.cpp:203] Recovering status update manager
I1212 01:27:34.887039 14747 containerizer.cpp:594] Recovering containerizer
I1212 01:27:34.888886 14741 provisioner.cpp:253] Provisioner recovery complete
I1212 01:27:34.889421 14747 slave.cpp:5415] Finished recovery
I1212 01:27:34.890035 14747 slave.cpp:5589] Querying resource estimator for oversubscribable
resources
I1212 01:27:34.890517 14752 slave.cpp:5603] Received oversubscribable resources {} from the
resource estimator
I1212 01:27:34.892544 14748 process.cpp:3679] Handling HTTP event for process 'slave(672)'
with path: '/slave(672)/monitor/statistics.json'
I1212 01:27:34.894274 14748 http.cpp:874] Authorizing principal 'test-principal' to GET the
'/monitor/statistics.json' endpoint
I1212 01:27:34.898689 14747 slave.cpp:791] Agent terminating
[       OK ] Endpoint/SlaveEndpointTest.AuthorizedRequest/1 (33 ms)
[ RUN      ] Endpoint/SlaveEndpointTest.AuthorizedRequest/2
I1212 01:27:34.910230 31611 containerizer.cpp:220] Using isolation: posix/cpu,posix/mem,filesystem/posix,network/cni
W1212 01:27:34.910825 31611 backend.cpp:76] Failed to create 'aufs' backend: AufsBackend requires
root privileges, but is running as user mesos
W1212 01:27:34.911011 31611 backend.cpp:76] Failed to create 'bind' backend: BindBackend requires
root privileges
I1212 01:27:34.914867 14742 slave.cpp:209] Mesos agent started on (673)@172.17.0.2:53706
I1212 01:27:34.914901 14742 slave.cpp:210] Flags at startup: --acls="" --appc_simple_discovery_uri_prefix="http://"
--appc_store_dir="/tmp/mesos/store/appc" --authenticate_http_readonly="true" --authenticate_http_readwrite="true"
--authenticatee="crammd5" --authentication_backoff_factor="1secs" --authorizer="local" --cgroups_cpu_enable_pids_and_tids_count="false"
--cgroups_enable_cfs="false" --cgroups_hierarchy="/sys/fs/cgroup" --cgroups_limit_swap="false"
--cgroups_root="mesos" --container_disk_watch_interval="15secs" --containerizers="mesos" --credential="/tmp/Endpoint_SlaveEndpointTest_AuthorizedRequest_2_Fgnd9P/credential"
--default_role="*" --disk_watch_interval="1mins" --docker="docker" --docker_kill_orphans="true"
--docker_registry="https://registry-1.docker.io" --docker_remove_delay="6hrs" --docker_socket="/var/run/docker.sock"
--docker_stop_timeout="0ns" --docker_store_dir="/tmp/mesos/store/docker" --docker_volume_checkpoint_dir="/var/run/mesos/isolators/docker/volume"
--enforce_container_disk_quota="false" --executor_registration_timeout="1mins" --executor_shutdown_grace_period="5secs"
--fetcher_cache_dir="/tmp/Endpoint_SlaveEndpointTest_AuthorizedRequest_2_Fgnd9P/fetch" --fetcher_cache_size="2GB"
--frameworks_home="" --gc_delay="1weeks" --gc_disk_headroom="0.1" --hadoop_home="" --help="false"
--hostname_lookup="true" --http_authenticators="basic" --http_command_executor="false" --http_credentials="/tmp/Endpoint_SlaveEndpointTest_AuthorizedRequest_2_Fgnd9P/http_credentials"
--image_provisioner_backend="copy" --initialize_driver_logging="true" --io_switchboard_enable_server="true"
--isolation="posix/cpu,posix/mem" --launcher="posix" --launcher_dir="/mesos/mesos-1.2.0/_build/src"
--logbufsecs="0" --logging_level="INFO" --max_completed_executors_per_framework="150" --oversubscribed_resources_interval="15secs"
--perf_duration="10secs" --perf_interval="1mins" --qos_correction_interval_min="0ns" --quiet="false"
--recover="reconnect" --recovery_timeout="15mins" --registration_backoff_factor="10ms" --resources="cpus:2;gpus:0;mem:1024;disk:1024;ports:[31000-32000]"
--revocable_cpu_low_priority="true" --runtime_dir="/tmp/Endpoint_SlaveEndpointTest_AuthorizedRequest_2_Fgnd9P"
--sandbox_directory="/mnt/mesos/sandbox" --strict="true" --switch_user="true" --systemd_enable_support="true"
--systemd_runtime_directory="/run/systemd/system" --version="false" --work_dir="/tmp/Endpoint_SlaveEndpointTest_AuthorizedRequest_2_200Fjc"
I1212 01:27:34.915592 14742 credentials.hpp:86] Loading credential for authentication from
'/tmp/Endpoint_SlaveEndpointTest_AuthorizedRequest_2_Fgnd9P/credential'
I1212 01:27:34.915752 14742 slave.cpp:347] Agent using credential for: test-principal
I1212 01:27:34.915784 14742 credentials.hpp:37] Loading credentials for authentication from
'/tmp/Endpoint_SlaveEndpointTest_AuthorizedRequest_2_Fgnd9P/http_credentials'
I1212 01:27:34.916070 14742 http.cpp:922] Using default 'basic' HTTP authenticator for realm
'mesos-agent-readonly'
I1212 01:27:34.916218 14742 http.cpp:922] Using default 'basic' HTTP authenticator for realm
'mesos-agent-readwrite'
I1212 01:27:34.917546 14742 slave.cpp:534] Agent resources: cpus(*):2; mem(*):1024; disk(*):1024;
ports(*):[31000-32000]
I1212 01:27:34.917649 14742 slave.cpp:542] Agent attributes: [  ]
I1212 01:27:34.917675 14742 slave.cpp:547] Agent hostname: 6460622fcc16
I1212 01:27:34.919247 14752 state.cpp:57] Recovering state from '/tmp/Endpoint_SlaveEndpointTest_AuthorizedRequest_2_200Fjc/meta'
I1212 01:27:34.919934 14740 status_update_manager.cpp:203] Recovering status update manager
I1212 01:27:34.920199 14751 containerizer.cpp:594] Recovering containerizer
I1212 01:27:34.921849 14748 provisioner.cpp:253] Provisioner recovery complete
I1212 01:27:34.922394 14753 slave.cpp:5415] Finished recovery
I1212 01:27:34.922978 14753 slave.cpp:5589] Querying resource estimator for oversubscribable
resources
I1212 01:27:34.923316 14739 slave.cpp:5603] Received oversubscribable resources {} from the
resource estimator
I1212 01:27:34.925518 14752 process.cpp:3679] Handling HTTP event for process 'slave(673)'
with path: '/slave(673)/containers'
I1212 01:27:34.926934 14743 http.cpp:874] Authorizing principal 'test-principal' to GET the
'/containers' endpoint
I1212 01:27:34.931347 14743 slave.cpp:791] Agent terminating
[       OK ] Endpoint/SlaveEndpointTest.AuthorizedRequest/2 (33 ms)
[ RUN      ] Endpoint/SlaveEndpointTest.UnauthorizedRequest/0
I1212 01:27:34.943799 31611 containerizer.cpp:220] Using isolation: posix/cpu,posix/mem,filesystem/posix,network/cni
W1212 01:27:34.944406 31611 backend.cpp:76] Failed to create 'aufs' backend: AufsBackend requires
root privileges, but is running as user mesos
W1212 01:27:34.944573 31611 backend.cpp:76] Failed to create 'bind' backend: BindBackend requires
root privileges
I1212 01:27:34.948771 14745 slave.cpp:209] Mesos agent started on (674)@172.17.0.2:53706
I1212 01:27:34.948804 14745 slave.cpp:210] Flags at startup: --acls="" --appc_simple_discovery_uri_prefix="http://"
--appc_store_dir="/tmp/mesos/store/appc" --authenticate_http_readonly="true" --authenticate_http_readwrite="true"
--authenticatee="crammd5" --authentication_backoff_factor="1secs" --authorizer="local" --cgroups_cpu_enable_pids_and_tids_count="false"
--cgroups_enable_cfs="false" --cgroups_hierarchy="/sys/fs/cgroup" --cgroups_limit_swap="false"
--cgroups_root="mesos" --container_disk_watch_interval="15secs" --containerizers="mesos" --credential="/tmp/Endpoint_SlaveEndpointTest_UnauthorizedRequest_0_5JzQLp/credential"
--default_role="*" --disk_watch_interval="1mins" --docker="docker" --docker_kill_orphans="true"
--docker_registry="https://registry-1.docker.io" --docker_remove_delay="6hrs" --docker_socket="/var/run/docker.sock"
--docker_stop_timeout="0ns" --docker_store_dir="/tmp/mesos/store/docker" --docker_volume_checkpoint_dir="/var/run/mesos/isolators/docker/volume"
--enforce_container_disk_quota="false" --executor_registration_timeout="1mins" --executor_shutdown_grace_period="5secs"
--fetcher_cache_dir="/tmp/Endpoint_SlaveEndpointTest_UnauthorizedRequest_0_5JzQLp/fetch" --fetcher_cache_size="2GB"
--frameworks_home="" --gc_delay="1weeks" --gc_disk_headroom="0.1" --hadoop_home="" --help="false"
--hostname_lookup="true" --http_authenticators="basic" --http_command_executor="false" --http_credentials="/tmp/Endpoint_SlaveEndpointTest_UnauthorizedRequest_0_5JzQLp/http_credentials"
--image_provisioner_backend="copy" --initialize_driver_logging="true" --io_switchboard_enable_server="true"
--isolation="posix/cpu,posix/mem" --launcher="posix" --launcher_dir="/mesos/mesos-1.2.0/_build/src"
--logbufsecs="0" --logging_level="INFO" --max_completed_executors_per_framework="150" --oversubscribed_resources_interval="15secs"
--perf_duration="10secs" --perf_interval="1mins" --qos_correction_interval_min="0ns" --quiet="false"
--recover="reconnect" --recovery_timeout="15mins" --registration_backoff_factor="10ms" --resources="cpus:2;gpus:0;mem:1024;disk:1024;ports:[31000-32000]"
--revocable_cpu_low_priority="true" --runtime_dir="/tmp/Endpoint_SlaveEndpointTest_UnauthorizedRequest_0_5JzQLp"
--sandbox_directory="/mnt/mesos/sandbox" --strict="true" --switch_user="true" --systemd_enable_support="true"
--systemd_runtime_directory="/run/systemd/system" --version="false" --work_dir="/tmp/Endpoint_SlaveEndpointTest_UnauthorizedRequest_0_C7UQQL"
I1212 01:27:34.949710 14745 credentials.hpp:86] Loading credential for authentication from
'/tmp/Endpoint_SlaveEndpointTest_UnauthorizedRequest_0_5JzQLp/credential'
I1212 01:27:34.949918 14745 slave.cpp:347] Agent using credential for: test-principal
I1212 01:27:34.949952 14745 credentials.hpp:37] Loading credentials for authentication from
'/tmp/Endpoint_SlaveEndpointTest_UnauthorizedRequest_0_5JzQLp/http_credentials'
I1212 01:27:34.950361 14745 http.cpp:922] Using default 'basic' HTTP authenticator for realm
'mesos-agent-readonly'
I1212 01:27:34.950531 14745 http.cpp:922] Using default 'basic' HTTP authenticator for realm
'mesos-agent-readwrite'
I1212 01:27:34.952154 14745 slave.cpp:534] Agent resources: cpus(*):2; mem(*):1024; disk(*):1024;
ports(*):[31000-32000]
I1212 01:27:34.952255 14745 slave.cpp:542] Agent attributes: [  ]
I1212 01:27:34.952268 14745 slave.cpp:547] Agent hostname: 6460622fcc16
I1212 01:27:34.953748 14746 state.cpp:57] Recovering state from '/tmp/Endpoint_SlaveEndpointTest_UnauthorizedRequest_0_C7UQQL/meta'
I1212 01:27:34.954134 14753 status_update_manager.cpp:203] Recovering status update manager
I1212 01:27:34.954418 14742 containerizer.cpp:594] Recovering containerizer
I1212 01:27:34.956166 14744 provisioner.cpp:253] Provisioner recovery complete
I1212 01:27:34.956789 14752 slave.cpp:5415] Finished recovery
I1212 01:27:34.957408 14752 slave.cpp:5589] Querying resource estimator for oversubscribable
resources
I1212 01:27:34.957754 14751 slave.cpp:5603] Received oversubscribable resources {} from the
resource estimator
I1212 01:27:34.960008 14742 process.cpp:3679] Handling HTTP event for process 'slave(674)'
with path: '/slave(674)/monitor/statistics'
I1212 01:27:34.961645 14748 http.cpp:874] Authorizing principal 'test-principal' to GET the
'/monitor/statistics' endpoint
I1212 01:27:34.964359 14746 slave.cpp:791] Agent terminating
[       OK ] Endpoint/SlaveEndpointTest.UnauthorizedRequest/0 (32 ms)
[ RUN      ] Endpoint/SlaveEndpointTest.UnauthorizedRequest/1
I1212 01:27:34.976192 31611 containerizer.cpp:220] Using isolation: posix/cpu,posix/mem,filesystem/posix,network/cni
W1212 01:27:34.976765 31611 backend.cpp:76] Failed to create 'aufs' backend: AufsBackend requires
root privileges, but is running as user mesos
W1212 01:27:34.976932 31611 backend.cpp:76] Failed to create 'bind' backend: BindBackend requires
root privileges
I1212 01:27:34.981154 14740 slave.cpp:209] Mesos agent started on (675)@172.17.0.2:53706
I1212 01:27:34.981179 14740 slave.cpp:210] Flags at startup: --acls="" --appc_simple_discovery_uri_prefix="http://"
--appc_store_dir="/tmp/mesos/store/appc" --authenticate_http_readonly="true" --authenticate_http_readwrite="true"
--authenticatee="crammd5" --authentication_backoff_factor="1secs" --authorizer="local" --cgroups_cpu_enable_pids_and_tids_count="false"
--cgroups_enable_cfs="false" --cgroups_hierarchy="/sys/fs/cgroup" --cgroups_limit_swap="false"
--cgroups_root="mesos" --container_disk_watch_interval="15secs" --containerizers="mesos" --credential="/tmp/Endpoint_SlaveEndpointTest_UnauthorizedRequest_1_xcuPJZ/credential"
--default_role="*" --disk_watch_interval="1mins" --docker="docker" --docker_kill_orphans="true"
--docker_registry="https://registry-1.docker.io" --docker_remove_delay="6hrs" --docker_socket="/var/run/docker.sock"
--docker_stop_timeout="0ns" --docker_store_dir="/tmp/mesos/store/docker" --docker_volume_checkpoint_dir="/var/run/mesos/isolators/docker/volume"
--enforce_container_disk_quota="false" --executor_registration_timeout="1mins" --executor_shutdown_grace_period="5secs"
--fetcher_cache_dir="/tmp/Endpoint_SlaveEndpointTest_UnauthorizedRequest_1_xcuPJZ/fetch" --fetcher_cache_size="2GB"
--frameworks_home="" --gc_delay="1weeks" --gc_disk_headroom="0.1" --hadoop_home="" --help="false"
--hostname_lookup="true" --http_authenticators="basic" --http_command_executor="false" --http_credentials="/tmp/Endpoint_SlaveEndpointTest_UnauthorizedRequest_1_xcuPJZ/http_credentials"
--image_provisioner_backend="copy" --initialize_driver_logging="true" --io_switchboard_enable_server="true"
--isolation="posix/cpu,posix/mem" --launcher="posix" --launcher_dir="/mesos/mesos-1.2.0/_build/src"
--logbufsecs="0" --logging_level="INFO" --max_completed_executors_per_framework="150" --oversubscribed_resources_interval="15secs"
--perf_duration="10secs" --perf_interval="1mins" --qos_correction_interval_min="0ns" --quiet="false"
--recover="reconnect" --recovery_timeout="15mins" --registration_backoff_factor="10ms" --resources="cpus:2;gpus:0;mem:1024;disk:1024;ports:[31000-32000]"
--revocable_cpu_low_priority="true" --runtime_dir="/tmp/Endpoint_SlaveEndpointTest_UnauthorizedRequest_1_xcuPJZ"
--sandbox_directory="/mnt/mesos/sandbox" --strict="true" --switch_user="true" --systemd_enable_support="true"
--systemd_runtime_directory="/run/systemd/system" --version="false" --work_dir="/tmp/Endpoint_SlaveEndpointTest_UnauthorizedRequest_1_UrMzJl"
I1212 01:27:34.981782 14740 credentials.hpp:86] Loading credential for authentication from
'/tmp/Endpoint_SlaveEndpointTest_UnauthorizedRequest_1_xcuPJZ/credential'
I1212 01:27:34.981977 14740 slave.cpp:347] Agent using credential for: test-principal
I1212 01:27:34.982008 14740 credentials.hpp:37] Loading credentials for authentication from
'/tmp/Endpoint_SlaveEndpointTest_UnauthorizedRequest_1_xcuPJZ/http_credentials'
I1212 01:27:34.982338 14740 http.cpp:922] Using default 'basic' HTTP authenticator for realm
'mesos-agent-readonly'
I1212 01:27:34.982488 14740 http.cpp:922] Using default 'basic' HTTP authenticator for realm
'mesos-agent-readwrite'
I1212 01:27:34.983921 14740 slave.cpp:534] Agent resources: cpus(*):2; mem(*):1024; disk(*):1024;
ports(*):[31000-32000]
I1212 01:27:34.984022 14740 slave.cpp:542] Agent attributes: [  ]
I1212 01:27:34.984038 14740 slave.cpp:547] Agent hostname: 6460622fcc16
I1212 01:27:34.985648 14745 state.cpp:57] Recovering state from '/tmp/Endpoint_SlaveEndpointTest_UnauthorizedRequest_1_UrMzJl/meta'
I1212 01:27:34.986299 14746 status_update_manager.cpp:203] Recovering status update manager
I1212 01:27:34.986755 14740 containerizer.cpp:594] Recovering containerizer
I1212 01:27:34.988790 14750 provisioner.cpp:253] Provisioner recovery complete
I1212 01:27:34.989334 14749 slave.cpp:5415] Finished recovery
I1212 01:27:34.990073 14749 slave.cpp:5589] Querying resource estimator for oversubscribable
resources
I1212 01:27:34.990332 14753 slave.cpp:5603] Received oversubscribable resources {} from the
resource estimator
I1212 01:27:34.992504 14750 process.cpp:3679] Handling HTTP event for process 'slave(675)'
with path: '/slave(675)/monitor/statistics.json'
I1212 01:27:34.993923 14739 http.cpp:874] Authorizing principal 'test-principal' to GET the
'/monitor/statistics.json' endpoint
I1212 01:27:34.996531 14745 slave.cpp:791] Agent terminating
[       OK ] Endpoint/SlaveEndpointTest.UnauthorizedRequest/1 (33 ms)
[ RUN      ] Endpoint/SlaveEndpointTest.UnauthorizedRequest/2
I1212 01:27:35.009526 31611 containerizer.cpp:220] Using isolation: posix/cpu,posix/mem,filesystem/posix,network/cni
W1212 01:27:35.010131 31611 backend.cpp:76] Failed to create 'aufs' backend: AufsBackend requires
root privileges, but is running as user mesos
W1212 01:27:35.010301 31611 backend.cpp:76] Failed to create 'bind' backend: BindBackend requires
root privileges
I1212 01:27:35.014330 14753 slave.cpp:209] Mesos agent started on (676)@172.17.0.2:53706
I1212 01:27:35.014360 14753 slave.cpp:210] Flags at startup: --acls="" --appc_simple_discovery_uri_prefix="http://"
--appc_store_dir="/tmp/mesos/store/appc" --authenticate_http_readonly="true" --authenticate_http_readwrite="true"
--authenticatee="crammd5" --authentication_backoff_factor="1secs" --authorizer="local" --cgroups_cpu_enable_pids_and_tids_count="false"
--cgroups_enable_cfs="false" --cgroups_hierarchy="/sys/fs/cgroup" --cgroups_limit_swap="false"
--cgroups_root="mesos" --container_disk_watch_interval="15secs" --containerizers="mesos" --credential="/tmp/Endpoint_SlaveEndpointTest_UnauthorizedRequest_2_L3Cm3z/credential"
--default_role="*" --disk_watch_interval="1mins" --docker="docker" --docker_kill_orphans="true"
--docker_registry="https://registry-1.docker.io" --docker_remove_delay="6hrs" --docker_socket="/var/run/docker.sock"
--docker_stop_timeout="0ns" --docker_store_dir="/tmp/mesos/store/docker" --docker_volume_checkpoint_dir="/var/run/mesos/isolators/docker/volume"
--enforce_container_disk_quota="false" --executor_registration_timeout="1mins" --executor_shutdown_grace_period="5secs"
--fetcher_cache_dir="/tmp/Endpoint_SlaveEndpointTest_UnauthorizedRequest_2_L3Cm3z/fetch" --fetcher_cache_size="2GB"
--frameworks_home="" --gc_delay="1weeks" --gc_disk_headroom="0.1" --hadoop_home="" --help="false"
--hostname_lookup="true" --http_authenticators="basic" --http_command_executor="false" --http_credentials="/tmp/Endpoint_SlaveEndpointTest_UnauthorizedRequest_2_L3Cm3z/http_credentials"
--image_provisioner_backend="copy" --initialize_driver_logging="true" --io_switchboard_enable_server="true"
--isolation="posix/cpu,posix/mem" --launcher="posix" --launcher_dir="/mesos/mesos-1.2.0/_build/src"
--logbufsecs="0" --logging_level="INFO" --max_completed_executors_per_framework="150" --oversubscribed_resources_interval="15secs"
--perf_duration="10secs" --perf_interval="1mins" --qos_correction_interval_min="0ns" --quiet="false"
--recover="reconnect" --recovery_timeout="15mins" --registration_backoff_factor="10ms" --resources="cpus:2;gpus:0;mem:1024;disk:1024;ports:[31000-32000]"
--revocable_cpu_low_priority="true" --runtime_dir="/tmp/Endpoint_SlaveEndpointTest_UnauthorizedRequest_2_L3Cm3z"
--sandbox_directory="/mnt/mesos/sandbox" --strict="true" --switch_user="true" --systemd_enable_support="true"
--systemd_runtime_directory="/run/systemd/system" --version="false" --work_dir="/tmp/Endpoint_SlaveEndpointTest_UnauthorizedRequest_2_u4dHXV"
I1212 01:27:35.015034 14753 credentials.hpp:86] Loading credential for authentication from
'/tmp/Endpoint_SlaveEndpointTest_UnauthorizedRequest_2_L3Cm3z/credential'
I1212 01:27:35.015198 14753 slave.cpp:347] Agent using credential for: test-principal
I1212 01:27:35.015226 14753 credentials.hpp:37] Loading credentials for authentication from
'/tmp/Endpoint_SlaveEndpointTest_UnauthorizedRequest_2_L3Cm3z/http_credentials'
I1212 01:27:35.015516 14753 http.cpp:922] Using default 'basic' HTTP authenticator for realm
'mesos-agent-readonly'
I1212 01:27:35.015657 14753 http.cpp:922] Using default 'basic' HTTP authenticator for realm
'mesos-agent-readwrite'
I1212 01:27:35.017065 14753 slave.cpp:534] Agent resources: cpus(*):2; mem(*):1024; disk(*):1024;
ports(*):[31000-32000]
I1212 01:27:35.017163 14753 slave.cpp:542] Agent attributes: [  ]
I1212 01:27:35.017177 14753 slave.cpp:547] Agent hostname: 6460622fcc16
I1212 01:27:35.018685 14744 state.cpp:57] Recovering state from '/tmp/Endpoint_SlaveEndpointTest_UnauthorizedRequest_2_u4dHXV/meta'
I1212 01:27:35.019165 14751 status_update_manager.cpp:203] Recovering status update manager
I1212 01:27:35.019549 14745 containerizer.cpp:594] Recovering containerizer
I1212 01:27:35.021039 14746 provisioner.cpp:253] Provisioner recovery complete
I1212 01:27:35.021627 14748 slave.cpp:5415] Finished recovery
I1212 01:27:35.022156 14748 slave.cpp:5589] Querying resource estimator for oversubscribable
resources
I1212 01:27:35.022466 14745 slave.cpp:5603] Received oversubscribable resources {} from the
resource estimator
I1212 01:27:35.024456 14747 process.cpp:3679] Handling HTTP event for process 'slave(676)'
with path: '/slave(676)/containers'
I1212 01:27:35.026145 14744 http.cpp:874] Authorizing principal 'test-principal' to GET the
'/containers' endpoint
I1212 01:27:35.029400 14747 slave.cpp:791] Agent terminating
[       OK ] Endpoint/SlaveEndpointTest.UnauthorizedRequest/2 (32 ms)
[ RUN      ] Endpoint/SlaveEndpointTest.NoAuthorizer/0
I1212 01:27:35.042023 31611 containerizer.cpp:220] Using isolation: posix/cpu,posix/mem,filesystem/posix,network/cni
W1212 01:27:35.042621 31611 backend.cpp:76] Failed to create 'aufs' backend: AufsBackend requires
root privileges, but is running as user mesos
W1212 01:27:35.042784 31611 backend.cpp:76] Failed to create 'bind' backend: BindBackend requires
root privileges
I1212 01:27:35.045156 31611 cluster.cpp:446] Creating default 'local' authorizer
I1212 01:27:35.047277 14746 slave.cpp:209] Mesos agent started on (677)@172.17.0.2:53706
I1212 01:27:35.047312 14746 slave.cpp:210] Flags at startup: --acls="" --appc_simple_discovery_uri_prefix="http://"
--appc_store_dir="/tmp/mesos/store/appc" --authenticate_http_readonly="true" --authenticate_http_readwrite="true"
--authenticatee="crammd5" --authentication_backoff_factor="1secs" --authorizer="local" --cgroups_cpu_enable_pids_and_tids_count="false"
--cgroups_enable_cfs="false" --cgroups_hierarchy="/sys/fs/cgroup" --cgroups_limit_swap="false"
--cgroups_root="mesos" --container_disk_watch_interval="15secs" --containerizers="mesos" --credential="/tmp/Endpoint_SlaveEndpointTest_NoAuthorizer_0_dcYQHa/credential"
--default_role="*" --disk_watch_interval="1mins" --docker="docker" --docker_kill_orphans="true"
--docker_registry="https://registry-1.docker.io" --docker_remove_delay="6hrs" --docker_socket="/var/run/docker.sock"
--docker_stop_timeout="0ns" --docker_store_dir="/tmp/mesos/store/docker" --docker_volume_checkpoint_dir="/var/run/mesos/isolators/docker/volume"
--enforce_container_disk_quota="false" --executor_registration_timeout="1mins" --executor_shutdown_grace_period="5secs"
--fetcher_cache_dir="/tmp/Endpoint_SlaveEndpointTest_NoAuthorizer_0_dcYQHa/fetch" --fetcher_cache_size="2GB"
--frameworks_home="" --gc_delay="1weeks" --gc_disk_headroom="0.1" --hadoop_home="" --help="false"
--hostname_lookup="true" --http_authenticators="basic" --http_command_executor="false" --http_credentials="/tmp/Endpoint_SlaveEndpointTest_NoAuthorizer_0_dcYQHa/http_credentials"
--image_provisioner_backend="copy" --initialize_driver_logging="true" --io_switchboard_enable_server="true"
--isolation="posix/cpu,posix/mem" --launcher="posix" --launcher_dir="/mesos/mesos-1.2.0/_build/src"
--logbufsecs="0" --logging_level="INFO" --max_completed_executors_per_framework="150" --oversubscribed_resources_interval="15secs"
--perf_duration="10secs" --perf_interval="1mins" --qos_correction_interval_min="0ns" --quiet="false"
--recover="reconnect" --recovery_timeout="15mins" --registration_backoff_factor="10ms" --resources="cpus:2;gpus:0;mem:1024;disk:1024;ports:[31000-32000]"
--revocable_cpu_low_priority="true" --runtime_dir="/tmp/Endpoint_SlaveEndpointTest_NoAuthorizer_0_dcYQHa"
--sandbox_directory="/mnt/mesos/sandbox" --strict="true" --switch_user="true" --systemd_enable_support="true"
--systemd_runtime_directory="/run/systemd/system" --version="false" --work_dir="/tmp/Endpoint_SlaveEndpointTest_NoAuthorizer_0_IuXWww"
I1212 01:27:35.047981 14746 credentials.hpp:86] Loading credential for authentication from
'/tmp/Endpoint_SlaveEndpointTest_NoAuthorizer_0_dcYQHa/credential'
I1212 01:27:35.048151 14746 slave.cpp:347] Agent using credential for: test-principal
I1212 01:27:35.048176 14746 credentials.hpp:37] Loading credentials for authentication from
'/tmp/Endpoint_SlaveEndpointTest_NoAuthorizer_0_dcYQHa/http_credentials'
I1212 01:27:35.048447 14746 http.cpp:922] Using default 'basic' HTTP authenticator for realm
'mesos-agent-readonly'
I1212 01:27:35.048614 14746 http.cpp:922] Using default 'basic' HTTP authenticator for realm
'mesos-agent-readwrite'
I1212 01:27:35.050071 14746 slave.cpp:534] Agent resources: cpus(*):2; mem(*):1024; disk(*):1024;
ports(*):[31000-32000]
I1212 01:27:35.050173 14746 slave.cpp:542] Agent attributes: [  ]
I1212 01:27:35.050190 14746 slave.cpp:547] Agent hostname: 6460622fcc16
I1212 01:27:35.051908 14754 state.cpp:57] Recovering state from '/tmp/Endpoint_SlaveEndpointTest_NoAuthorizer_0_IuXWww/meta'
I1212 01:27:35.052212 14745 status_update_manager.cpp:203] Recovering status update manager
I1212 01:27:35.052448 14744 containerizer.cpp:594] Recovering containerizer
I1212 01:27:35.054101 14751 provisioner.cpp:253] Provisioner recovery complete
I1212 01:27:35.054627 14752 slave.cpp:5415] Finished recovery
I1212 01:27:35.055140 14752 slave.cpp:5589] Querying resource estimator for oversubscribable
resources
I1212 01:27:35.055444 14746 slave.cpp:5603] Received oversubscribable resources {} from the
resource estimator
I1212 01:27:35.057267 14753 process.cpp:3679] Handling HTTP event for process 'slave(677)'
with path: '/slave(677)/monitor/statistics'
I1212 01:27:35.058657 14751 http.cpp:874] Authorizing principal 'test-principal' to GET the
'/monitor/statistics' endpoint
I1212 01:27:35.062777 14739 slave.cpp:791] Agent terminating
[       OK ] Endpoint/SlaveEndpointTest.NoAuthorizer/0 (34 ms)
[ RUN      ] Endpoint/SlaveEndpointTest.NoAuthorizer/1
I1212 01:27:35.076279 31611 containerizer.cpp:220] Using isolation: posix/cpu,posix/mem,filesystem/posix,network/cni
W1212 01:27:35.076905 31611 backend.cpp:76] Failed to create 'aufs' backend: AufsBackend requires
root privileges, but is running as user mesos
W1212 01:27:35.077087 31611 backend.cpp:76] Failed to create 'bind' backend: BindBackend requires
root privileges
I1212 01:27:35.079280 31611 cluster.cpp:446] Creating default 'local' authorizer
I1212 01:27:35.081321 14753 slave.cpp:209] Mesos agent started on (678)@172.17.0.2:53706
I1212 01:27:35.081349 14753 slave.cpp:210] Flags at startup: --acls="" --appc_simple_discovery_uri_prefix="http://"
--appc_store_dir="/tmp/mesos/store/appc" --authenticate_http_readonly="true" --authenticate_http_readwrite="true"
--authenticatee="crammd5" --authentication_backoff_factor="1secs" --authorizer="local" --cgroups_cpu_enable_pids_and_tids_count="false"
--cgroups_enable_cfs="false" --cgroups_hierarchy="/sys/fs/cgroup" --cgroups_limit_swap="false"
--cgroups_root="mesos" --container_disk_watch_interval="15secs" --containerizers="mesos" --credential="/tmp/Endpoint_SlaveEndpointTest_NoAuthorizer_1_pqhmIL/credential"
--default_role="*" --disk_watch_interval="1mins" --docker="docker" --docker_kill_orphans="true"
--docker_registry="https://registry-1.docker.io" --docker_remove_delay="6hrs" --docker_socket="/var/run/docker.sock"
--docker_stop_timeout="0ns" --docker_store_dir="/tmp/mesos/store/docker" --docker_volume_checkpoint_dir="/var/run/mesos/isolators/docker/volume"
--enforce_container_disk_quota="false" --executor_registration_timeout="1mins" --executor_shutdown_grace_period="5secs"
--fetcher_cache_dir="/tmp/Endpoint_SlaveEndpointTest_NoAuthorizer_1_pqhmIL/fetch" --fetcher_cache_size="2GB"
--frameworks_home="" --gc_delay="1weeks" --gc_disk_headroom="0.1" --hadoop_home="" --help="false"
--hostname_lookup="true" --http_authenticators="basic" --http_command_executor="false" --http_credentials="/tmp/Endpoint_SlaveEndpointTest_NoAuthorizer_1_pqhmIL/http_credentials"
--image_provisioner_backend="copy" --initialize_driver_logging="true" --io_switchboard_enable_server="true"
--isolation="posix/cpu,posix/mem" --launcher="posix" --launcher_dir="/mesos/mesos-1.2.0/_build/src"
--logbufsecs="0" --logging_level="INFO" --max_completed_executors_per_framework="150" --oversubscribed_resources_interval="15secs"
--perf_duration="10secs" --perf_interval="1mins" --qos_correction_interval_min="0ns" --quiet="false"
--recover="reconnect" --recovery_timeout="15mins" --registration_backoff_factor="10ms" --resources="cpus:2;gpus:0;mem:1024;disk:1024;ports:[31000-32000]"
--revocable_cpu_low_priority="true" --runtime_dir="/tmp/Endpoint_SlaveEndpointTest_NoAuthorizer_1_pqhmIL"
--sandbox_directory="/mnt/mesos/sandbox" --strict="true" --switch_user="true" --systemd_enable_support="true"
--systemd_runtime_directory="/run/systemd/system" --version="false" --work_dir="/tmp/Endpoint_SlaveEndpointTest_NoAuthorizer_1_KOGTr7"
I1212 01:27:35.082022 14753 credentials.hpp:86] Loading credential for authentication from
'/tmp/Endpoint_SlaveEndpointTest_NoAuthorizer_1_pqhmIL/credential'
I1212 01:27:35.082180 14753 slave.cpp:347] Agent using credential for: test-principal
I1212 01:27:35.082214 14753 credentials.hpp:37] Loading credentials for authentication from
'/tmp/Endpoint_SlaveEndpointTest_NoAuthorizer_1_pqhmIL/http_credentials'
I1212 01:27:35.082492 14753 http.cpp:922] Using default 'basic' HTTP authenticator for realm
'mesos-agent-readonly'
I1212 01:27:35.082638 14753 http.cpp:922] Using default 'basic' HTTP authenticator for realm
'mesos-agent-readwrite'
I1212 01:27:35.083919 14753 slave.cpp:534] Agent resources: cpus(*):2; mem(*):1024; disk(*):1024;
ports(*):[31000-32000]
I1212 01:27:35.084018 14753 slave.cpp:542] Agent attributes: [  ]
I1212 01:27:35.084035 14753 slave.cpp:547] Agent hostname: 6460622fcc16
I1212 01:27:35.085587 14743 state.cpp:57] Recovering state from '/tmp/Endpoint_SlaveEndpointTest_NoAuthorizer_1_KOGTr7/meta'
I1212 01:27:35.085955 14742 status_update_manager.cpp:203] Recovering status update manager
I1212 01:27:35.086216 14754 containerizer.cpp:594] Recovering containerizer
I1212 01:27:35.087824 14746 provisioner.cpp:253] Provisioner recovery complete
I1212 01:27:35.088358 14751 slave.cpp:5415] Finished recovery
I1212 01:27:35.088884 14751 slave.cpp:5589] Querying resource estimator for oversubscribable
resources
I1212 01:27:35.089184 14753 slave.cpp:5603] Received oversubscribable resources {} from the
resource estimator
I1212 01:27:35.091500 14741 process.cpp:3679] Handling HTTP event for process 'slave(678)'
with path: '/slave(678)/monitor/statistics.json'
I1212 01:27:35.092934 14746 http.cpp:874] Authorizing principal 'test-principal' to GET the
'/monitor/statistics.json' endpoint
I1212 01:27:35.096542 14745 slave.cpp:791] Agent terminating
[       OK ] Endpoint/SlaveEndpointTest.NoAuthorizer/1 (31 ms)
[ RUN      ] Endpoint/SlaveEndpointTest.NoAuthorizer/2
I1212 01:27:35.107754 31611 containerizer.cpp:220] Using isolation: posix/cpu,posix/mem,filesystem/posix,network/cni
W1212 01:27:35.108350 31611 backend.cpp:76] Failed to create 'aufs' backend: AufsBackend requires
root privileges, but is running as user mesos
W1212 01:27:35.108536 31611 backend.cpp:76] Failed to create 'bind' backend: BindBackend requires
root privileges
I1212 01:27:35.110433 31611 cluster.cpp:446] Creating default 'local' authorizer
I1212 01:27:35.112126 14750 slave.cpp:209] Mesos agent started on (679)@172.17.0.2:53706
I1212 01:27:35.112149 14750 slave.cpp:210] Flags at startup: --acls="" --appc_simple_discovery_uri_prefix="http://"
--appc_store_dir="/tmp/mesos/store/appc" --authenticate_http_readonly="true" --authenticate_http_readwrite="true"
--authenticatee="crammd5" --authentication_backoff_factor="1secs" --authorizer="local" --cgroups_cpu_enable_pids_and_tids_count="false"
--cgroups_enable_cfs="false" --cgroups_hierarchy="/sys/fs/cgroup" --cgroups_limit_swap="false"
--cgroups_root="mesos" --container_disk_watch_interval="15secs" --containerizers="mesos" --credential="/tmp/Endpoint_SlaveEndpointTest_NoAuthorizer_2_HU6G3m/credential"
--default_role="*" --disk_watch_interval="1mins" --docker="docker" --docker_kill_orphans="true"
--docker_registry="https://registry-1.docker.io" --docker_remove_delay="6hrs" --docker_socket="/var/run/docker.sock"
--docker_stop_timeout="0ns" --docker_store_dir="/tmp/mesos/store/docker" --docker_volume_checkpoint_dir="/var/run/mesos/isolators/docker/volume"
--enforce_container_disk_quota="false" --executor_registration_timeout="1mins" --executor_shutdown_grace_period="5secs"
--fetcher_cache_dir="/tmp/Endpoint_SlaveEndpointTest_NoAuthorizer_2_HU6G3m/fetch" --fetcher_cache_size="2GB"
--frameworks_home="" --gc_delay="1weeks" --gc_disk_headroom="0.1" --hadoop_home="" --help="false"
--hostname_lookup="true" --http_authenticators="basic" --http_command_executor="false" --http_credentials="/tmp/Endpoint_SlaveEndpointTest_NoAuthorizer_2_HU6G3m/http_credentials"
--image_provisioner_backend="copy" --initialize_driver_logging="true" --io_switchboard_enable_server="true"
--isolation="posix/cpu,posix/mem" --launcher="posix" --launcher_dir="/mesos/mesos-1.2.0/_build/src"
--logbufsecs="0" --logging_level="INFO" --max_completed_executors_per_framework="150" --oversubscribed_resources_interval="15secs"
--perf_duration="10secs" --perf_interval="1mins" --qos_correction_interval_min="0ns" --quiet="false"
--recover="reconnect" --recovery_timeout="15mins" --registration_backoff_factor="10ms" --resources="cpus:2;gpus:0;mem:1024;disk:1024;ports:[31000-32000]"
--revocable_cpu_low_priority="true" --runtime_dir="/tmp/Endpoint_SlaveEndpointTest_NoAuthorizer_2_HU6G3m"
--sandbox_directory="/mnt/mesos/sandbox" --strict="true" --switch_user="true" --systemd_enable_support="true"
--systemd_runtime_directory="/run/systemd/system" --version="false" --work_dir="/tmp/Endpoint_SlaveEndpointTest_NoAuthorizer_2_YUy7HI"
I1212 01:27:35.112612 14750 credentials.hpp:86] Loading credential for authentication from
'/tmp/Endpoint_SlaveEndpointTest_NoAuthorizer_2_HU6G3m/credential'
I1212 01:27:35.112732 14750 slave.cpp:347] Agent using credential for: test-principal
I1212 01:27:35.112752 14750 credentials.hpp:37] Loading credentials for authentication from
'/tmp/Endpoint_SlaveEndpointTest_NoAuthorizer_2_HU6G3m/http_credentials'
I1212 01:27:35.112989 14750 http.cpp:922] Using default 'basic' HTTP authenticator for realm
'mesos-agent-readonly'
I1212 01:27:35.113135 14750 http.cpp:922] Using default 'basic' HTTP authenticator for realm
'mesos-agent-readwrite'
I1212 01:27:35.114465 14750 slave.cpp:534] Agent resources: cpus(*):2; mem(*):1024; disk(*):1024;
ports(*):[31000-32000]
I1212 01:27:35.114564 14750 slave.cpp:542] Agent attributes: [  ]
I1212 01:27:35.114580 14750 slave.cpp:547] Agent hostname: 6460622fcc16
I1212 01:27:35.116050 14753 state.cpp:57] Recovering state from '/tmp/Endpoint_SlaveEndpointTest_NoAuthorizer_2_YUy7HI/meta'
I1212 01:27:35.116600 14744 status_update_manager.cpp:203] Recovering status update manager
I1212 01:27:35.116932 14745 containerizer.cpp:594] Recovering containerizer
I1212 01:27:35.118743 14745 provisioner.cpp:253] Provisioner recovery complete
I1212 01:27:35.119441 14750 slave.cpp:5415] Finished recovery
I1212 01:27:35.119902 14750 slave.cpp:5589] Querying resource estimator for oversubscribable
resources
I1212 01:27:35.120278 14739 slave.cpp:5603] Received oversubscribable resources {} from the
resource estimator
I1212 01:27:35.122437 14740 process.cpp:3679] Handling HTTP event for process 'slave(679)'
with path: '/slave(679)/containers'
I1212 01:27:35.123957 14748 http.cpp:874] Authorizing principal 'test-principal' to GET the
'/containers' endpoint
I1212 01:27:35.127784 14752 slave.cpp:791] Agent terminating
[       OK ] Endpoint/SlaveEndpointTest.NoAuthorizer/2 (31 ms)
[----------] 9 tests from Endpoint/SlaveEndpointTest (297 ms total)

[----------] Global test environment tear-down
[==========] 1433 tests from 165 test cases ran. (487997 ms total)
[  PASSED  ] 1432 tests.
[  FAILED  ] 1 test, listed below:
[  FAILED  ] MasterTest.MaxCompletedTasksPerFrameworkFlag

 1 FAILED TEST
  YOU HAVE 9 DISABLED TESTS

make[4]: *** [check-local] Error 1
make[4]: Leaving directory `/mesos/mesos-1.2.0/_build/src'
make[3]: *** [check-am] Error 2
make[3]: Leaving directory `/mesos/mesos-1.2.0/_build/src'
make[2]: *** [check] Error 2
make[2]: Leaving directory `/mesos/mesos-1.2.0/_build/src'
make[1]: *** [check-recursive] Error 1
make[1]: Leaving directory `/mesos/mesos-1.2.0/_build'
make: *** [distcheck] Error 1
+ docker rmi mesos-1481503129-19966
Untagged: mesos-1481503129-19966:latest
Deleted: sha256:7680224fbc3e6ef33c75248037cf9e8a2ffbee616caa535194e2197f47501e24
Deleted: sha256:7b636e0c7b09e9986dcea17e89edd4c64396ca2120b1f02628d77e526d5b9d05
Deleted: sha256:e86abff0e9ede4924445ef2fa8e7654c53f30179c169e8d40ce24d3b0d1465be
Deleted: sha256:06f8535817df3c02cedb414f008bdcc8269bea115d4aa06a438bc8d62258a2c5
Deleted: sha256:f56a0461d0aeff30e2a4d2df5aa130ff52623747b5c63f5b908210d8e1454c21
Deleted: sha256:25287feb621a4f30160aacd80b6a9c428a1f0fc02dab82971ab71f4a732c453d
Deleted: sha256:12b42d273f20911e8700c420d39584e300f648dc8aea8faf12588b6dc8151231
Deleted: sha256:ea31ec2bc3b0e60011e62ff5b28c2915a7cb1a8abe6cf4c926a4524e751fe3db
Deleted: sha256:fbbe8b4e3c3c0ad489d2bea203161d977d20e9436048f936016539bacdb11558
Deleted: sha256:ace7af80f29fbadbe020e24dcb347fc7183db2c54eee5055e190172f572dd562
Deleted: sha256:aaa87a8010b211a6734d57081e1bb58d026b5f13f6c122e93e7db0c879117566
Deleted: sha256:ce89fb7031289db218bf45b1d695bc52a7b637c45f84c6704838c6e9b60ecc3b
Deleted: sha256:70c9f752fc5fc5e7aaaa62a2503135900b084359f858a42e9625326c4427f0cf
Deleted: sha256:b524da4182b3aa419433d25b0b9548c9874ef23d7096f87921db6ff8f478648d
Deleted: sha256:f62fce51eb8a7a77ad1842e28dd2e0f587dfcf54c00d5b01de73623c7b7f05c9
Deleted: sha256:50019730f906210c1ed793f95429bbc988763f0ef72954559fa03513b1a56f0b
Deleted: sha256:3c8fdbe33a3b8bda162d0d873edacd438f3f68547ac151eb4d504d064eb55f12
Deleted: sha256:4bf76b5f9da2d3abffa93cb961e5e4c6affda1a37c41c7f0978a3b74e314283f
Deleted: sha256:12fa1ce1d768ddb39a56f702676b9af6b60c821d9d97f39f05f2adbfcb8cc2ec
Deleted: sha256:98494e069be6dc6860e3bbf1e2fc191a89b8e3df5127d59b6a78005669dc04ec
Deleted: sha256:2930cf00f14732fa7dfc7627e7d149587ea6f37e2b492cf7075a2cf0dc8f4b26
Deleted: sha256:d34476eb4428e6b33dec6095fee73026df969868bc1dd82990f74b05c19b1b79
Deleted: sha256:769a17e741fea831f272b6c5caf5e1edb0101750ebd3ea4b9b58faf0cb057171
Deleted: sha256:a5c385676791566676d71fca478aeb7eb56cbdfda2ca88d20fede9a0fc100625
Build step 'Execute shell' marked build as failure

Mime
View raw message