mesos-builds mailing list archives

Site index · List index
Message view « Date » · « Thread »
Top « Date » · « Thread »
From Apache Jenkins Server <jenk...@builds.apache.org>
Subject Build failed in Jenkins: Mesos » autotools,gcc,--verbose,GLOG_v=1 MESOS_VERBOSE=1,centos:7,(docker||Hadoop)&&(!ubuntu-us1)&&(!ubuntu-6)&&(!ubuntu-eu2) #3033
Date Tue, 13 Dec 2016 00:06:50 GMT
See <https://builds.apache.org/job/Mesos/BUILDTOOL=autotools,COMPILER=gcc,CONFIGURATION=--verbose,ENVIRONMENT=GLOG_v=1%20MESOS_VERBOSE=1,OS=centos%3A7,label_exp=(docker%7C%7CHadoop)&&(!ubuntu-us1)&&(!ubuntu-6)&&(!ubuntu-eu2)/3033/changes>

Changes:

[anand] Fixed erroneous usage of 'Accept' header as 'Accept-Type'.

[vinodkone] Removed "enable_io_switchboard_server" agent flag.

[vinodkone] Fixed EOF bug when tty is enabled in switch board server.

[yujie.jay] Updated address of 'http::connect()' with http scheme for SSL support.

[yujie.jay] Changed 'Socket::create()' in IOSwitchboard to always be of 'kind' POLL.

[yujie.jay] Changed the timing of entering mount namespace for DEBUG container.

[yujie.jay] Fixed an unreachable statement in launch.cpp.

[vinodkone] Added a `http_heartbeat_interval` flag to the agent flags.

[vinodkone] Added a bi-directional heartbeat for IOSwitchboard connections.

------------------------------------------
[...truncated 168858 lines...]
W1213 00:04:17.062975 30748 backend.cpp:76] Failed to create 'aufs' backend: AufsBackend requires
root privileges, but is running as user mesos
W1213 00:04:17.063156 30748 backend.cpp:76] Failed to create 'bind' backend: BindBackend requires
root privileges
I1213 00:04:17.067143 30771 slave.cpp:209] Mesos agent started on (667)@172.17.0.2:36680
I1213 00:04:17.067174 30771 slave.cpp:210] Flags at startup: --acls="" --appc_simple_discovery_uri_prefix="http://"
--appc_store_dir="/tmp/mesos/store/appc" --authenticate_http_readonly="true" --authenticate_http_readwrite="true"
--authenticatee="crammd5" --authentication_backoff_factor="1secs" --authorizer="local" --cgroups_cpu_enable_pids_and_tids_count="false"
--cgroups_enable_cfs="false" --cgroups_hierarchy="/sys/fs/cgroup" --cgroups_limit_swap="false"
--cgroups_root="mesos" --container_disk_watch_interval="15secs" --containerizers="mesos" --credential="/tmp/Endpoint_SlaveEndpointTest_AuthorizedRequest_1_w6Huez/credential"
--default_role="*" --disk_watch_interval="1mins" --docker="docker" --docker_kill_orphans="true"
--docker_registry="https://registry-1.docker.io" --docker_remove_delay="6hrs" --docker_socket="/var/run/docker.sock"
--docker_stop_timeout="0ns" --docker_store_dir="/tmp/mesos/store/docker" --docker_volume_checkpoint_dir="/var/run/mesos/isolators/docker/volume"
--enforce_container_disk_quota="false" --executor_registration_timeout="1mins" --executor_shutdown_grace_period="5secs"
--fetcher_cache_dir="/tmp/Endpoint_SlaveEndpointTest_AuthorizedRequest_1_w6Huez/fetch" --fetcher_cache_size="2GB"
--frameworks_home="" --gc_delay="1weeks" --gc_disk_headroom="0.1" --hadoop_home="" --help="false"
--hostname_lookup="true" --http_authenticators="basic" --http_command_executor="false" --http_credentials="/tmp/Endpoint_SlaveEndpointTest_AuthorizedRequest_1_w6Huez/http_credentials"
--http_heartbeat_interval="30secs" --image_provisioner_backend="copy" --initialize_driver_logging="true"
--isolation="posix/cpu,posix/mem" --launcher="posix" --launcher_dir="/mesos/mesos-1.2.0/_build/src"
--logbufsecs="0" --logging_level="INFO" --max_completed_executors_per_framework="150" --oversubscribed_resources_interval="15secs"
--perf_duration="10secs" --perf_interval="1mins" --qos_correction_interval_min="0ns" --quiet="false"
--recover="reconnect" --recovery_timeout="15mins" --registration_backoff_factor="10ms" --resources="cpus:2;gpus:0;mem:1024;disk:1024;ports:[31000-32000]"
--revocable_cpu_low_priority="true" --runtime_dir="/tmp/Endpoint_SlaveEndpointTest_AuthorizedRequest_1_w6Huez"
--sandbox_directory="/mnt/mesos/sandbox" --strict="true" --switch_user="true" --systemd_enable_support="true"
--systemd_runtime_directory="/run/systemd/system" --version="false" --work_dir="/tmp/Endpoint_SlaveEndpointTest_AuthorizedRequest_1_6h8l9Y"
I1213 00:04:17.067883 30771 credentials.hpp:86] Loading credential for authentication from
'/tmp/Endpoint_SlaveEndpointTest_AuthorizedRequest_1_w6Huez/credential'
I1213 00:04:17.068061 30771 slave.cpp:347] Agent using credential for: test-principal
I1213 00:04:17.068089 30771 credentials.hpp:37] Loading credentials for authentication from
'/tmp/Endpoint_SlaveEndpointTest_AuthorizedRequest_1_w6Huez/http_credentials'
I1213 00:04:17.068363 30771 http.cpp:922] Using default 'basic' HTTP authenticator for realm
'mesos-agent-readonly'
I1213 00:04:17.068514 30771 http.cpp:922] Using default 'basic' HTTP authenticator for realm
'mesos-agent-readwrite'
I1213 00:04:17.069985 30771 slave.cpp:534] Agent resources: cpus(*):2; mem(*):1024; disk(*):1024;
ports(*):[31000-32000]
I1213 00:04:17.070087 30771 slave.cpp:542] Agent attributes: [  ]
I1213 00:04:17.070104 30771 slave.cpp:547] Agent hostname: a4a60d50a07c
I1213 00:04:17.071732 30777 state.cpp:57] Recovering state from '/tmp/Endpoint_SlaveEndpointTest_AuthorizedRequest_1_6h8l9Y/meta'
I1213 00:04:17.072036 30776 status_update_manager.cpp:203] Recovering status update manager
I1213 00:04:17.072285 30781 containerizer.cpp:594] Recovering containerizer
I1213 00:04:17.074086 30771 provisioner.cpp:253] Provisioner recovery complete
I1213 00:04:17.074605 30768 slave.cpp:5415] Finished recovery
I1213 00:04:17.075134 30768 slave.cpp:5589] Querying resource estimator for oversubscribable
resources
I1213 00:04:17.075439 30773 slave.cpp:5603] Received oversubscribable resources {} from the
resource estimator
I1213 00:04:17.077904 30767 process.cpp:3679] Handling HTTP event for process 'slave(667)'
with path: '/slave(667)/monitor/statistics.json'
I1213 00:04:17.079448 30770 http.cpp:874] Authorizing principal 'test-principal' to GET the
'/monitor/statistics.json' endpoint
I1213 00:04:17.083904 30776 slave.cpp:791] Agent terminating
[       OK ] Endpoint/SlaveEndpointTest.AuthorizedRequest/1 (32 ms)
[ RUN      ] Endpoint/SlaveEndpointTest.AuthorizedRequest/2
I1213 00:04:17.094887 30748 containerizer.cpp:220] Using isolation: posix/cpu,posix/mem,filesystem/posix,network/cni
W1213 00:04:17.095427 30748 backend.cpp:76] Failed to create 'aufs' backend: AufsBackend requires
root privileges, but is running as user mesos
W1213 00:04:17.095592 30748 backend.cpp:76] Failed to create 'bind' backend: BindBackend requires
root privileges
I1213 00:04:17.098908 30776 slave.cpp:209] Mesos agent started on (668)@172.17.0.2:36680
I1213 00:04:17.098937 30776 slave.cpp:210] Flags at startup: --acls="" --appc_simple_discovery_uri_prefix="http://"
--appc_store_dir="/tmp/mesos/store/appc" --authenticate_http_readonly="true" --authenticate_http_readwrite="true"
--authenticatee="crammd5" --authentication_backoff_factor="1secs" --authorizer="local" --cgroups_cpu_enable_pids_and_tids_count="false"
--cgroups_enable_cfs="false" --cgroups_hierarchy="/sys/fs/cgroup" --cgroups_limit_swap="false"
--cgroups_root="mesos" --container_disk_watch_interval="15secs" --containerizers="mesos" --credential="/tmp/Endpoint_SlaveEndpointTest_AuthorizedRequest_2_sGhiRT/credential"
--default_role="*" --disk_watch_interval="1mins" --docker="docker" --docker_kill_orphans="true"
--docker_registry="https://registry-1.docker.io" --docker_remove_delay="6hrs" --docker_socket="/var/run/docker.sock"
--docker_stop_timeout="0ns" --docker_store_dir="/tmp/mesos/store/docker" --docker_volume_checkpoint_dir="/var/run/mesos/isolators/docker/volume"
--enforce_container_disk_quota="false" --executor_registration_timeout="1mins" --executor_shutdown_grace_period="5secs"
--fetcher_cache_dir="/tmp/Endpoint_SlaveEndpointTest_AuthorizedRequest_2_sGhiRT/fetch" --fetcher_cache_size="2GB"
--frameworks_home="" --gc_delay="1weeks" --gc_disk_headroom="0.1" --hadoop_home="" --help="false"
--hostname_lookup="true" --http_authenticators="basic" --http_command_executor="false" --http_credentials="/tmp/Endpoint_SlaveEndpointTest_AuthorizedRequest_2_sGhiRT/http_credentials"
--http_heartbeat_interval="30secs" --image_provisioner_backend="copy" --initialize_driver_logging="true"
--isolation="posix/cpu,posix/mem" --launcher="posix" --launcher_dir="/mesos/mesos-1.2.0/_build/src"
--logbufsecs="0" --logging_level="INFO" --max_completed_executors_per_framework="150" --oversubscribed_resources_interval="15secs"
--perf_duration="10secs" --perf_interval="1mins" --qos_correction_interval_min="0ns" --quiet="false"
--recover="reconnect" --recovery_timeout="15mins" --registration_backoff_factor="10ms" --resources="cpus:2;gpus:0;mem:1024;disk:1024;ports:[31000-32000]"
--revocable_cpu_low_priority="true" --runtime_dir="/tmp/Endpoint_SlaveEndpointTest_AuthorizedRequest_2_sGhiRT"
--sandbox_directory="/mnt/mesos/sandbox" --strict="true" --switch_user="true" --systemd_enable_support="true"
--systemd_runtime_directory="/run/systemd/system" --version="false" --work_dir="/tmp/Endpoint_SlaveEndpointTest_AuthorizedRequest_2_a56MGj"
I1213 00:04:17.099490 30776 credentials.hpp:86] Loading credential for authentication from
'/tmp/Endpoint_SlaveEndpointTest_AuthorizedRequest_2_sGhiRT/credential'
I1213 00:04:17.099630 30776 slave.cpp:347] Agent using credential for: test-principal
I1213 00:04:17.099653 30776 credentials.hpp:37] Loading credentials for authentication from
'/tmp/Endpoint_SlaveEndpointTest_AuthorizedRequest_2_sGhiRT/http_credentials'
I1213 00:04:17.099871 30776 http.cpp:922] Using default 'basic' HTTP authenticator for realm
'mesos-agent-readonly'
I1213 00:04:17.099993 30776 http.cpp:922] Using default 'basic' HTTP authenticator for realm
'mesos-agent-readwrite'
I1213 00:04:17.101192 30776 slave.cpp:534] Agent resources: cpus(*):2; mem(*):1024; disk(*):1024;
ports(*):[31000-32000]
I1213 00:04:17.101294 30776 slave.cpp:542] Agent attributes: [  ]
I1213 00:04:17.101308 30776 slave.cpp:547] Agent hostname: a4a60d50a07c
I1213 00:04:17.102892 30774 state.cpp:57] Recovering state from '/tmp/Endpoint_SlaveEndpointTest_AuthorizedRequest_2_a56MGj/meta'
I1213 00:04:17.103255 30782 status_update_manager.cpp:203] Recovering status update manager
I1213 00:04:17.103529 30770 containerizer.cpp:594] Recovering containerizer
I1213 00:04:17.105182 30776 provisioner.cpp:253] Provisioner recovery complete
I1213 00:04:17.105731 30767 slave.cpp:5415] Finished recovery
I1213 00:04:17.106242 30767 slave.cpp:5589] Querying resource estimator for oversubscribable
resources
I1213 00:04:17.106534 30768 slave.cpp:5603] Received oversubscribable resources {} from the
resource estimator
I1213 00:04:17.108674 30778 process.cpp:3679] Handling HTTP event for process 'slave(668)'
with path: '/slave(668)/containers'
I1213 00:04:17.110277 30775 http.cpp:874] Authorizing principal 'test-principal' to GET the
'/containers' endpoint
I1213 00:04:17.114645 30768 slave.cpp:791] Agent terminating
[       OK ] Endpoint/SlaveEndpointTest.AuthorizedRequest/2 (30 ms)
[ RUN      ] Endpoint/SlaveEndpointTest.UnauthorizedRequest/0
I1213 00:04:17.125797 30748 containerizer.cpp:220] Using isolation: posix/cpu,posix/mem,filesystem/posix,network/cni
W1213 00:04:17.126417 30748 backend.cpp:76] Failed to create 'aufs' backend: AufsBackend requires
root privileges, but is running as user mesos
W1213 00:04:17.126593 30748 backend.cpp:76] Failed to create 'bind' backend: BindBackend requires
root privileges
I1213 00:04:17.130198 30772 slave.cpp:209] Mesos agent started on (669)@172.17.0.2:36680
I1213 00:04:17.130221 30772 slave.cpp:210] Flags at startup: --acls="" --appc_simple_discovery_uri_prefix="http://"
--appc_store_dir="/tmp/mesos/store/appc" --authenticate_http_readonly="true" --authenticate_http_readwrite="true"
--authenticatee="crammd5" --authentication_backoff_factor="1secs" --authorizer="local" --cgroups_cpu_enable_pids_and_tids_count="false"
--cgroups_enable_cfs="false" --cgroups_hierarchy="/sys/fs/cgroup" --cgroups_limit_swap="false"
--cgroups_root="mesos" --container_disk_watch_interval="15secs" --containerizers="mesos" --credential="/tmp/Endpoint_SlaveEndpointTest_UnauthorizedRequest_0_scKWNe/credential"
--default_role="*" --disk_watch_interval="1mins" --docker="docker" --docker_kill_orphans="true"
--docker_registry="https://registry-1.docker.io" --docker_remove_delay="6hrs" --docker_socket="/var/run/docker.sock"
--docker_stop_timeout="0ns" --docker_store_dir="/tmp/mesos/store/docker" --docker_volume_checkpoint_dir="/var/run/mesos/isolators/docker/volume"
--enforce_container_disk_quota="false" --executor_registration_timeout="1mins" --executor_shutdown_grace_period="5secs"
--fetcher_cache_dir="/tmp/Endpoint_SlaveEndpointTest_UnauthorizedRequest_0_scKWNe/fetch" --fetcher_cache_size="2GB"
--frameworks_home="" --gc_delay="1weeks" --gc_disk_headroom="0.1" --hadoop_home="" --help="false"
--hostname_lookup="true" --http_authenticators="basic" --http_command_executor="false" --http_credentials="/tmp/Endpoint_SlaveEndpointTest_UnauthorizedRequest_0_scKWNe/http_credentials"
--http_heartbeat_interval="30secs" --image_provisioner_backend="copy" --initialize_driver_logging="true"
--isolation="posix/cpu,posix/mem" --launcher="posix" --launcher_dir="/mesos/mesos-1.2.0/_build/src"
--logbufsecs="0" --logging_level="INFO" --max_completed_executors_per_framework="150" --oversubscribed_resources_interval="15secs"
--perf_duration="10secs" --perf_interval="1mins" --qos_correction_interval_min="0ns" --quiet="false"
--recover="reconnect" --recovery_timeout="15mins" --registration_backoff_factor="10ms" --resources="cpus:2;gpus:0;mem:1024;disk:1024;ports:[31000-32000]"
--revocable_cpu_low_priority="true" --runtime_dir="/tmp/Endpoint_SlaveEndpointTest_UnauthorizedRequest_0_scKWNe"
--sandbox_directory="/mnt/mesos/sandbox" --strict="true" --switch_user="true" --systemd_enable_support="true"
--systemd_runtime_directory="/run/systemd/system" --version="false" --work_dir="/tmp/Endpoint_SlaveEndpointTest_UnauthorizedRequest_0_qvZuyE"
I1213 00:04:17.130682 30772 credentials.hpp:86] Loading credential for authentication from
'/tmp/Endpoint_SlaveEndpointTest_UnauthorizedRequest_0_scKWNe/credential'
I1213 00:04:17.130831 30772 slave.cpp:347] Agent using credential for: test-principal
I1213 00:04:17.130854 30772 credentials.hpp:37] Loading credentials for authentication from
'/tmp/Endpoint_SlaveEndpointTest_UnauthorizedRequest_0_scKWNe/http_credentials'
I1213 00:04:17.131050 30772 http.cpp:922] Using default 'basic' HTTP authenticator for realm
'mesos-agent-readonly'
I1213 00:04:17.131167 30772 http.cpp:922] Using default 'basic' HTTP authenticator for realm
'mesos-agent-readwrite'
I1213 00:04:17.132189 30772 slave.cpp:534] Agent resources: cpus(*):2; mem(*):1024; disk(*):1024;
ports(*):[31000-32000]
I1213 00:04:17.132264 30772 slave.cpp:542] Agent attributes: [  ]
I1213 00:04:17.132282 30772 slave.cpp:547] Agent hostname: a4a60d50a07c
I1213 00:04:17.133540 30769 state.cpp:57] Recovering state from '/tmp/Endpoint_SlaveEndpointTest_UnauthorizedRequest_0_qvZuyE/meta'
I1213 00:04:17.133754 30773 status_update_manager.cpp:203] Recovering status update manager
I1213 00:04:17.133946 30781 containerizer.cpp:594] Recovering containerizer
I1213 00:04:17.135089 30776 provisioner.cpp:253] Provisioner recovery complete
I1213 00:04:17.135537 30768 slave.cpp:5415] Finished recovery
I1213 00:04:17.135967 30768 slave.cpp:5589] Querying resource estimator for oversubscribable
resources
I1213 00:04:17.136165 30777 slave.cpp:5603] Received oversubscribable resources {} from the
resource estimator
I1213 00:04:17.138358 30777 process.cpp:3679] Handling HTTP event for process 'slave(669)'
with path: '/slave(669)/monitor/statistics'
I1213 00:04:17.139578 30772 http.cpp:874] Authorizing principal 'test-principal' to GET the
'/monitor/statistics' endpoint
I1213 00:04:17.142199 30771 slave.cpp:791] Agent terminating
[       OK ] Endpoint/SlaveEndpointTest.UnauthorizedRequest/0 (28 ms)
[ RUN      ] Endpoint/SlaveEndpointTest.UnauthorizedRequest/1
I1213 00:04:17.154187 30748 containerizer.cpp:220] Using isolation: posix/cpu,posix/mem,filesystem/posix,network/cni
W1213 00:04:17.154839 30748 backend.cpp:76] Failed to create 'aufs' backend: AufsBackend requires
root privileges, but is running as user mesos
W1213 00:04:17.155016 30748 backend.cpp:76] Failed to create 'bind' backend: BindBackend requires
root privileges
I1213 00:04:17.158699 30773 slave.cpp:209] Mesos agent started on (670)@172.17.0.2:36680
I1213 00:04:17.158735 30773 slave.cpp:210] Flags at startup: --acls="" --appc_simple_discovery_uri_prefix="http://"
--appc_store_dir="/tmp/mesos/store/appc" --authenticate_http_readonly="true" --authenticate_http_readwrite="true"
--authenticatee="crammd5" --authentication_backoff_factor="1secs" --authorizer="local" --cgroups_cpu_enable_pids_and_tids_count="false"
--cgroups_enable_cfs="false" --cgroups_hierarchy="/sys/fs/cgroup" --cgroups_limit_swap="false"
--cgroups_root="mesos" --container_disk_watch_interval="15secs" --containerizers="mesos" --credential="/tmp/Endpoint_SlaveEndpointTest_UnauthorizedRequest_1_ea3f3z/credential"
--default_role="*" --disk_watch_interval="1mins" --docker="docker" --docker_kill_orphans="true"
--docker_registry="https://registry-1.docker.io" --docker_remove_delay="6hrs" --docker_socket="/var/run/docker.sock"
--docker_stop_timeout="0ns" --docker_store_dir="/tmp/mesos/store/docker" --docker_volume_checkpoint_dir="/var/run/mesos/isolators/docker/volume"
--enforce_container_disk_quota="false" --executor_registration_timeout="1mins" --executor_shutdown_grace_period="5secs"
--fetcher_cache_dir="/tmp/Endpoint_SlaveEndpointTest_UnauthorizedRequest_1_ea3f3z/fetch" --fetcher_cache_size="2GB"
--frameworks_home="" --gc_delay="1weeks" --gc_disk_headroom="0.1" --hadoop_home="" --help="false"
--hostname_lookup="true" --http_authenticators="basic" --http_command_executor="false" --http_credentials="/tmp/Endpoint_SlaveEndpointTest_UnauthorizedRequest_1_ea3f3z/http_credentials"
--http_heartbeat_interval="30secs" --image_provisioner_backend="copy" --initialize_driver_logging="true"
--isolation="posix/cpu,posix/mem" --launcher="posix" --launcher_dir="/mesos/mesos-1.2.0/_build/src"
--logbufsecs="0" --logging_level="INFO" --max_completed_executors_per_framework="150" --oversubscribed_resources_interval="15secs"
--perf_duration="10secs" --perf_interval="1mins" --qos_correction_interval_min="0ns" --quiet="false"
--recover="reconnect" --recovery_timeout="15mins" --registration_backoff_factor="10ms" --resources="cpus:2;gpus:0;mem:1024;disk:1024;ports:[31000-32000]"
--revocable_cpu_low_priority="true" --runtime_dir="/tmp/Endpoint_SlaveEndpointTest_UnauthorizedRequest_1_ea3f3z"
--sandbox_directory="/mnt/mesos/sandbox" --strict="true" --switch_user="true" --systemd_enable_support="true"
--systemd_runtime_directory="/run/systemd/system" --version="false" --work_dir="/tmp/Endpoint_SlaveEndpointTest_UnauthorizedRequest_1_SplcJZ"
I1213 00:04:17.159451 30773 credentials.hpp:86] Loading credential for authentication from
'/tmp/Endpoint_SlaveEndpointTest_UnauthorizedRequest_1_ea3f3z/credential'
I1213 00:04:17.159636 30773 slave.cpp:347] Agent using credential for: test-principal
I1213 00:04:17.159667 30773 credentials.hpp:37] Loading credentials for authentication from
'/tmp/Endpoint_SlaveEndpointTest_UnauthorizedRequest_1_ea3f3z/http_credentials'
I1213 00:04:17.159942 30773 http.cpp:922] Using default 'basic' HTTP authenticator for realm
'mesos-agent-readonly'
I1213 00:04:17.160094 30773 http.cpp:922] Using default 'basic' HTTP authenticator for realm
'mesos-agent-readwrite'
I1213 00:04:17.161557 30773 slave.cpp:534] Agent resources: cpus(*):2; mem(*):1024; disk(*):1024;
ports(*):[31000-32000]
I1213 00:04:17.161664 30773 slave.cpp:542] Agent attributes: [  ]
I1213 00:04:17.161689 30773 slave.cpp:547] Agent hostname: a4a60d50a07c
I1213 00:04:17.163269 30767 state.cpp:57] Recovering state from '/tmp/Endpoint_SlaveEndpointTest_UnauthorizedRequest_1_SplcJZ/meta'
I1213 00:04:17.163813 30775 status_update_manager.cpp:203] Recovering status update manager
I1213 00:04:17.164057 30774 containerizer.cpp:594] Recovering containerizer
I1213 00:04:17.165730 30777 provisioner.cpp:253] Provisioner recovery complete
I1213 00:04:17.166208 30773 slave.cpp:5415] Finished recovery
I1213 00:04:17.166741 30773 slave.cpp:5589] Querying resource estimator for oversubscribable
resources
I1213 00:04:17.166993 30771 slave.cpp:5603] Received oversubscribable resources {} from the
resource estimator
I1213 00:04:17.169251 30781 process.cpp:3679] Handling HTTP event for process 'slave(670)'
with path: '/slave(670)/monitor/statistics.json'
I1213 00:04:17.170514 30782 http.cpp:874] Authorizing principal 'test-principal' to GET the
'/monitor/statistics.json' endpoint
I1213 00:04:17.173141 30776 slave.cpp:791] Agent terminating
[       OK ] Endpoint/SlaveEndpointTest.UnauthorizedRequest/1 (29 ms)
[ RUN      ] Endpoint/SlaveEndpointTest.UnauthorizedRequest/2
I1213 00:04:17.183383 30748 containerizer.cpp:220] Using isolation: posix/cpu,posix/mem,filesystem/posix,network/cni
W1213 00:04:17.184012 30748 backend.cpp:76] Failed to create 'aufs' backend: AufsBackend requires
root privileges, but is running as user mesos
W1213 00:04:17.184187 30748 backend.cpp:76] Failed to create 'bind' backend: BindBackend requires
root privileges
I1213 00:04:17.187826 30768 slave.cpp:209] Mesos agent started on (671)@172.17.0.2:36680
I1213 00:04:17.187863 30768 slave.cpp:210] Flags at startup: --acls="" --appc_simple_discovery_uri_prefix="http://"
--appc_store_dir="/tmp/mesos/store/appc" --authenticate_http_readonly="true" --authenticate_http_readwrite="true"
--authenticatee="crammd5" --authentication_backoff_factor="1secs" --authorizer="local" --cgroups_cpu_enable_pids_and_tids_count="false"
--cgroups_enable_cfs="false" --cgroups_hierarchy="/sys/fs/cgroup" --cgroups_limit_swap="false"
--cgroups_root="mesos" --container_disk_watch_interval="15secs" --containerizers="mesos" --credential="/tmp/Endpoint_SlaveEndpointTest_UnauthorizedRequest_2_8olRBV/credential"
--default_role="*" --disk_watch_interval="1mins" --docker="docker" --docker_kill_orphans="true"
--docker_registry="https://registry-1.docker.io" --docker_remove_delay="6hrs" --docker_socket="/var/run/docker.sock"
--docker_stop_timeout="0ns" --docker_store_dir="/tmp/mesos/store/docker" --docker_volume_checkpoint_dir="/var/run/mesos/isolators/docker/volume"
--enforce_container_disk_quota="false" --executor_registration_timeout="1mins" --executor_shutdown_grace_period="5secs"
--fetcher_cache_dir="/tmp/Endpoint_SlaveEndpointTest_UnauthorizedRequest_2_8olRBV/fetch" --fetcher_cache_size="2GB"
--frameworks_home="" --gc_delay="1weeks" --gc_disk_headroom="0.1" --hadoop_home="" --help="false"
--hostname_lookup="true" --http_authenticators="basic" --http_command_executor="false" --http_credentials="/tmp/Endpoint_SlaveEndpointTest_UnauthorizedRequest_2_8olRBV/http_credentials"
--http_heartbeat_interval="30secs" --image_provisioner_backend="copy" --initialize_driver_logging="true"
--isolation="posix/cpu,posix/mem" --launcher="posix" --launcher_dir="/mesos/mesos-1.2.0/_build/src"
--logbufsecs="0" --logging_level="INFO" --max_completed_executors_per_framework="150" --oversubscribed_resources_interval="15secs"
--perf_duration="10secs" --perf_interval="1mins" --qos_correction_interval_min="0ns" --quiet="false"
--recover="reconnect" --recovery_timeout="15mins" --registration_backoff_factor="10ms" --resources="cpus:2;gpus:0;mem:1024;disk:1024;ports:[31000-32000]"
--revocable_cpu_low_priority="true" --runtime_dir="/tmp/Endpoint_SlaveEndpointTest_UnauthorizedRequest_2_8olRBV"
--sandbox_directory="/mnt/mesos/sandbox" --strict="true" --switch_user="true" --systemd_enable_support="true"
--systemd_runtime_directory="/run/systemd/system" --version="false" --work_dir="/tmp/Endpoint_SlaveEndpointTest_UnauthorizedRequest_2_agn2cl"
I1213 00:04:17.188880 30768 credentials.hpp:86] Loading credential for authentication from
'/tmp/Endpoint_SlaveEndpointTest_UnauthorizedRequest_2_8olRBV/credential'
I1213 00:04:17.189105 30768 slave.cpp:347] Agent using credential for: test-principal
I1213 00:04:17.189139 30768 credentials.hpp:37] Loading credentials for authentication from
'/tmp/Endpoint_SlaveEndpointTest_UnauthorizedRequest_2_8olRBV/http_credentials'
I1213 00:04:17.189534 30768 http.cpp:922] Using default 'basic' HTTP authenticator for realm
'mesos-agent-readonly'
I1213 00:04:17.189707 30768 http.cpp:922] Using default 'basic' HTTP authenticator for realm
'mesos-agent-readwrite'
I1213 00:04:17.191366 30768 slave.cpp:534] Agent resources: cpus(*):2; mem(*):1024; disk(*):1024;
ports(*):[31000-32000]
I1213 00:04:17.191468 30768 slave.cpp:542] Agent attributes: [  ]
I1213 00:04:17.191483 30768 slave.cpp:547] Agent hostname: a4a60d50a07c
I1213 00:04:17.193091 30775 state.cpp:57] Recovering state from '/tmp/Endpoint_SlaveEndpointTest_UnauthorizedRequest_2_agn2cl/meta'
I1213 00:04:17.193475 30768 status_update_manager.cpp:203] Recovering status update manager
I1213 00:04:17.193788 30782 containerizer.cpp:594] Recovering containerizer
I1213 00:04:17.195457 30776 provisioner.cpp:253] Provisioner recovery complete
I1213 00:04:17.195947 30771 slave.cpp:5415] Finished recovery
I1213 00:04:17.196533 30771 slave.cpp:5589] Querying resource estimator for oversubscribable
resources
I1213 00:04:17.196877 30774 slave.cpp:5603] Received oversubscribable resources {} from the
resource estimator
I1213 00:04:17.199319 30769 process.cpp:3679] Handling HTTP event for process 'slave(671)'
with path: '/slave(671)/containers'
I1213 00:04:17.200891 30768 http.cpp:874] Authorizing principal 'test-principal' to GET the
'/containers' endpoint
I1213 00:04:17.203716 30775 slave.cpp:791] Agent terminating
[       OK ] Endpoint/SlaveEndpointTest.UnauthorizedRequest/2 (31 ms)
[ RUN      ] Endpoint/SlaveEndpointTest.NoAuthorizer/0
I1213 00:04:17.215759 30748 containerizer.cpp:220] Using isolation: posix/cpu,posix/mem,filesystem/posix,network/cni
W1213 00:04:17.216392 30748 backend.cpp:76] Failed to create 'aufs' backend: AufsBackend requires
root privileges, but is running as user mesos
W1213 00:04:17.216583 30748 backend.cpp:76] Failed to create 'bind' backend: BindBackend requires
root privileges
I1213 00:04:17.219261 30748 cluster.cpp:446] Creating default 'local' authorizer
I1213 00:04:17.221518 30774 slave.cpp:209] Mesos agent started on (672)@172.17.0.2:36680
I1213 00:04:17.221547 30774 slave.cpp:210] Flags at startup: --acls="" --appc_simple_discovery_uri_prefix="http://"
--appc_store_dir="/tmp/mesos/store/appc" --authenticate_http_readonly="true" --authenticate_http_readwrite="true"
--authenticatee="crammd5" --authentication_backoff_factor="1secs" --authorizer="local" --cgroups_cpu_enable_pids_and_tids_count="false"
--cgroups_enable_cfs="false" --cgroups_hierarchy="/sys/fs/cgroup" --cgroups_limit_swap="false"
--cgroups_root="mesos" --container_disk_watch_interval="15secs" --containerizers="mesos" --credential="/tmp/Endpoint_SlaveEndpointTest_NoAuthorizer_0_KM0Nuh/credential"
--default_role="*" --disk_watch_interval="1mins" --docker="docker" --docker_kill_orphans="true"
--docker_registry="https://registry-1.docker.io" --docker_remove_delay="6hrs" --docker_socket="/var/run/docker.sock"
--docker_stop_timeout="0ns" --docker_store_dir="/tmp/mesos/store/docker" --docker_volume_checkpoint_dir="/var/run/mesos/isolators/docker/volume"
--enforce_container_disk_quota="false" --executor_registration_timeout="1mins" --executor_shutdown_grace_period="5secs"
--fetcher_cache_dir="/tmp/Endpoint_SlaveEndpointTest_NoAuthorizer_0_KM0Nuh/fetch" --fetcher_cache_size="2GB"
--frameworks_home="" --gc_delay="1weeks" --gc_disk_headroom="0.1" --hadoop_home="" --help="false"
--hostname_lookup="true" --http_authenticators="basic" --http_command_executor="false" --http_credentials="/tmp/Endpoint_SlaveEndpointTest_NoAuthorizer_0_KM0Nuh/http_credentials"
--http_heartbeat_interval="30secs" --image_provisioner_backend="copy" --initialize_driver_logging="true"
--isolation="posix/cpu,posix/mem" --launcher="posix" --launcher_dir="/mesos/mesos-1.2.0/_build/src"
--logbufsecs="0" --logging_level="INFO" --max_completed_executors_per_framework="150" --oversubscribed_resources_interval="15secs"
--perf_duration="10secs" --perf_interval="1mins" --qos_correction_interval_min="0ns" --quiet="false"
--recover="reconnect" --recovery_timeout="15mins" --registration_backoff_factor="10ms" --resources="cpus:2;gpus:0;mem:1024;disk:1024;ports:[31000-32000]"
--revocable_cpu_low_priority="true" --runtime_dir="/tmp/Endpoint_SlaveEndpointTest_NoAuthorizer_0_KM0Nuh"
--sandbox_directory="/mnt/mesos/sandbox" --strict="true" --switch_user="true" --systemd_enable_support="true"
--systemd_runtime_directory="/run/systemd/system" --version="false" --work_dir="/tmp/Endpoint_SlaveEndpointTest_NoAuthorizer_0_GGfO0G"
I1213 00:04:17.222273 30774 credentials.hpp:86] Loading credential for authentication from
'/tmp/Endpoint_SlaveEndpointTest_NoAuthorizer_0_KM0Nuh/credential'
I1213 00:04:17.222475 30774 slave.cpp:347] Agent using credential for: test-principal
I1213 00:04:17.222502 30774 credentials.hpp:37] Loading credentials for authentication from
'/tmp/Endpoint_SlaveEndpointTest_NoAuthorizer_0_KM0Nuh/http_credentials'
I1213 00:04:17.222765 30774 http.cpp:922] Using default 'basic' HTTP authenticator for realm
'mesos-agent-readonly'
I1213 00:04:17.222935 30774 http.cpp:922] Using default 'basic' HTTP authenticator for realm
'mesos-agent-readwrite'
I1213 00:04:17.224334 30774 slave.cpp:534] Agent resources: cpus(*):2; mem(*):1024; disk(*):1024;
ports(*):[31000-32000]
I1213 00:04:17.224436 30774 slave.cpp:542] Agent attributes: [  ]
I1213 00:04:17.224449 30774 slave.cpp:547] Agent hostname: a4a60d50a07c
I1213 00:04:17.225998 30772 state.cpp:57] Recovering state from '/tmp/Endpoint_SlaveEndpointTest_NoAuthorizer_0_GGfO0G/meta'
I1213 00:04:17.226403 30768 status_update_manager.cpp:203] Recovering status update manager
I1213 00:04:17.226636 30768 containerizer.cpp:594] Recovering containerizer
I1213 00:04:17.228327 30769 provisioner.cpp:253] Provisioner recovery complete
I1213 00:04:17.228866 30781 slave.cpp:5415] Finished recovery
I1213 00:04:17.229413 30781 slave.cpp:5589] Querying resource estimator for oversubscribable
resources
I1213 00:04:17.229759 30782 slave.cpp:5603] Received oversubscribable resources {} from the
resource estimator
I1213 00:04:17.232005 30780 process.cpp:3679] Handling HTTP event for process 'slave(672)'
with path: '/slave(672)/monitor/statistics'
I1213 00:04:17.233433 30771 http.cpp:874] Authorizing principal 'test-principal' to GET the
'/monitor/statistics' endpoint
I1213 00:04:17.237584 30773 slave.cpp:791] Agent terminating
[       OK ] Endpoint/SlaveEndpointTest.NoAuthorizer/0 (33 ms)
[ RUN      ] Endpoint/SlaveEndpointTest.NoAuthorizer/1
I1213 00:04:17.248888 30748 containerizer.cpp:220] Using isolation: posix/cpu,posix/mem,filesystem/posix,network/cni
W1213 00:04:17.249518 30748 backend.cpp:76] Failed to create 'aufs' backend: AufsBackend requires
root privileges, but is running as user mesos
W1213 00:04:17.249719 30748 backend.cpp:76] Failed to create 'bind' backend: BindBackend requires
root privileges
I1213 00:04:17.251708 30748 cluster.cpp:446] Creating default 'local' authorizer
I1213 00:04:17.253814 30774 slave.cpp:209] Mesos agent started on (673)@172.17.0.2:36680
I1213 00:04:17.253844 30774 slave.cpp:210] Flags at startup: --acls="" --appc_simple_discovery_uri_prefix="http://"
--appc_store_dir="/tmp/mesos/store/appc" --authenticate_http_readonly="true" --authenticate_http_readwrite="true"
--authenticatee="crammd5" --authentication_backoff_factor="1secs" --authorizer="local" --cgroups_cpu_enable_pids_and_tids_count="false"
--cgroups_enable_cfs="false" --cgroups_hierarchy="/sys/fs/cgroup" --cgroups_limit_swap="false"
--cgroups_root="mesos" --container_disk_watch_interval="15secs" --containerizers="mesos" --credential="/tmp/Endpoint_SlaveEndpointTest_NoAuthorizer_1_kgclJD/credential"
--default_role="*" --disk_watch_interval="1mins" --docker="docker" --docker_kill_orphans="true"
--docker_registry="https://registry-1.docker.io" --docker_remove_delay="6hrs" --docker_socket="/var/run/docker.sock"
--docker_stop_timeout="0ns" --docker_store_dir="/tmp/mesos/store/docker" --docker_volume_checkpoint_dir="/var/run/mesos/isolators/docker/volume"
--enforce_container_disk_quota="false" --executor_registration_timeout="1mins" --executor_shutdown_grace_period="5secs"
--fetcher_cache_dir="/tmp/Endpoint_SlaveEndpointTest_NoAuthorizer_1_kgclJD/fetch" --fetcher_cache_size="2GB"
--frameworks_home="" --gc_delay="1weeks" --gc_disk_headroom="0.1" --hadoop_home="" --help="false"
--hostname_lookup="true" --http_authenticators="basic" --http_command_executor="false" --http_credentials="/tmp/Endpoint_SlaveEndpointTest_NoAuthorizer_1_kgclJD/http_credentials"
--http_heartbeat_interval="30secs" --image_provisioner_backend="copy" --initialize_driver_logging="true"
--isolation="posix/cpu,posix/mem" --launcher="posix" --launcher_dir="/mesos/mesos-1.2.0/_build/src"
--logbufsecs="0" --logging_level="INFO" --max_completed_executors_per_framework="150" --oversubscribed_resources_interval="15secs"
--perf_duration="10secs" --perf_interval="1mins" --qos_correction_interval_min="0ns" --quiet="false"
--recover="reconnect" --recovery_timeout="15mins" --registration_backoff_factor="10ms" --resources="cpus:2;gpus:0;mem:1024;disk:1024;ports:[31000-32000]"
--revocable_cpu_low_priority="true" --runtime_dir="/tmp/Endpoint_SlaveEndpointTest_NoAuthorizer_1_kgclJD"
--sandbox_directory="/mnt/mesos/sandbox" --strict="true" --switch_user="true" --systemd_enable_support="true"
--systemd_runtime_directory="/run/systemd/system" --version="false" --work_dir="/tmp/Endpoint_SlaveEndpointTest_NoAuthorizer_1_otkW92"
I1213 00:04:17.254598 30774 credentials.hpp:86] Loading credential for authentication from
'/tmp/Endpoint_SlaveEndpointTest_NoAuthorizer_1_kgclJD/credential'
I1213 00:04:17.254756 30774 slave.cpp:347] Agent using credential for: test-principal
I1213 00:04:17.254802 30774 credentials.hpp:37] Loading credentials for authentication from
'/tmp/Endpoint_SlaveEndpointTest_NoAuthorizer_1_kgclJD/http_credentials'
I1213 00:04:17.255017 30774 http.cpp:922] Using default 'basic' HTTP authenticator for realm
'mesos-agent-readonly'
I1213 00:04:17.255173 30774 http.cpp:922] Using default 'basic' HTTP authenticator for realm
'mesos-agent-readwrite'
I1213 00:04:17.256438 30774 slave.cpp:534] Agent resources: cpus(*):2; mem(*):1024; disk(*):1024;
ports(*):[31000-32000]
I1213 00:04:17.256541 30774 slave.cpp:542] Agent attributes: [  ]
I1213 00:04:17.256556 30774 slave.cpp:547] Agent hostname: a4a60d50a07c
I1213 00:04:17.257869 30779 state.cpp:57] Recovering state from '/tmp/Endpoint_SlaveEndpointTest_NoAuthorizer_1_otkW92/meta'
I1213 00:04:17.258323 30767 status_update_manager.cpp:203] Recovering status update manager
I1213 00:04:17.258575 30781 containerizer.cpp:594] Recovering containerizer
I1213 00:04:17.260319 30781 provisioner.cpp:253] Provisioner recovery complete
I1213 00:04:17.260866 30767 slave.cpp:5415] Finished recovery
I1213 00:04:17.261420 30767 slave.cpp:5589] Querying resource estimator for oversubscribable
resources
I1213 00:04:17.261741 30768 slave.cpp:5603] Received oversubscribable resources {} from the
resource estimator
I1213 00:04:17.264103 30769 process.cpp:3679] Handling HTTP event for process 'slave(673)'
with path: '/slave(673)/monitor/statistics.json'
I1213 00:04:17.265550 30779 http.cpp:874] Authorizing principal 'test-principal' to GET the
'/monitor/statistics.json' endpoint
I1213 00:04:17.270751 30771 slave.cpp:791] Agent terminating
[       OK ] Endpoint/SlaveEndpointTest.NoAuthorizer/1 (34 ms)
[ RUN      ] Endpoint/SlaveEndpointTest.NoAuthorizer/2
I1213 00:04:17.283321 30748 containerizer.cpp:220] Using isolation: posix/cpu,posix/mem,filesystem/posix,network/cni
W1213 00:04:17.283956 30748 backend.cpp:76] Failed to create 'aufs' backend: AufsBackend requires
root privileges, but is running as user mesos
W1213 00:04:17.284127 30748 backend.cpp:76] Failed to create 'bind' backend: BindBackend requires
root privileges
I1213 00:04:17.285882 30748 cluster.cpp:446] Creating default 'local' authorizer
I1213 00:04:17.287394 30770 slave.cpp:209] Mesos agent started on (674)@172.17.0.2:36680
I1213 00:04:17.287427 30770 slave.cpp:210] Flags at startup: --acls="" --appc_simple_discovery_uri_prefix="http://"
--appc_store_dir="/tmp/mesos/store/appc" --authenticate_http_readonly="true" --authenticate_http_readwrite="true"
--authenticatee="crammd5" --authentication_backoff_factor="1secs" --authorizer="local" --cgroups_cpu_enable_pids_and_tids_count="false"
--cgroups_enable_cfs="false" --cgroups_hierarchy="/sys/fs/cgroup" --cgroups_limit_swap="false"
--cgroups_root="mesos" --container_disk_watch_interval="15secs" --containerizers="mesos" --credential="/tmp/Endpoint_SlaveEndpointTest_NoAuthorizer_2_OduNj0/credential"
--default_role="*" --disk_watch_interval="1mins" --docker="docker" --docker_kill_orphans="true"
--docker_registry="https://registry-1.docker.io" --docker_remove_delay="6hrs" --docker_socket="/var/run/docker.sock"
--docker_stop_timeout="0ns" --docker_store_dir="/tmp/mesos/store/docker" --docker_volume_checkpoint_dir="/var/run/mesos/isolators/docker/volume"
--enforce_container_disk_quota="false" --executor_registration_timeout="1mins" --executor_shutdown_grace_period="5secs"
--fetcher_cache_dir="/tmp/Endpoint_SlaveEndpointTest_NoAuthorizer_2_OduNj0/fetch" --fetcher_cache_size="2GB"
--frameworks_home="" --gc_delay="1weeks" --gc_disk_headroom="0.1" --hadoop_home="" --help="false"
--hostname_lookup="true" --http_authenticators="basic" --http_command_executor="false" --http_credentials="/tmp/Endpoint_SlaveEndpointTest_NoAuthorizer_2_OduNj0/http_credentials"
--http_heartbeat_interval="30secs" --image_provisioner_backend="copy" --initialize_driver_logging="true"
--isolation="posix/cpu,posix/mem" --launcher="posix" --launcher_dir="/mesos/mesos-1.2.0/_build/src"
--logbufsecs="0" --logging_level="INFO" --max_completed_executors_per_framework="150" --oversubscribed_resources_interval="15secs"
--perf_duration="10secs" --perf_interval="1mins" --qos_correction_interval_min="0ns" --quiet="false"
--recover="reconnect" --recovery_timeout="15mins" --registration_backoff_factor="10ms" --resources="cpus:2;gpus:0;mem:1024;disk:1024;ports:[31000-32000]"
--revocable_cpu_low_priority="true" --runtime_dir="/tmp/Endpoint_SlaveEndpointTest_NoAuthorizer_2_OduNj0"
--sandbox_directory="/mnt/mesos/sandbox" --strict="true" --switch_user="true" --systemd_enable_support="true"
--systemd_runtime_directory="/run/systemd/system" --version="false" --work_dir="/tmp/Endpoint_SlaveEndpointTest_NoAuthorizer_2_8ENOEp"
I1213 00:04:17.288218 30770 credentials.hpp:86] Loading credential for authentication from
'/tmp/Endpoint_SlaveEndpointTest_NoAuthorizer_2_OduNj0/credential'
I1213 00:04:17.288385 30770 slave.cpp:347] Agent using credential for: test-principal
I1213 00:04:17.288414 30770 credentials.hpp:37] Loading credentials for authentication from
'/tmp/Endpoint_SlaveEndpointTest_NoAuthorizer_2_OduNj0/http_credentials'
I1213 00:04:17.288713 30770 http.cpp:922] Using default 'basic' HTTP authenticator for realm
'mesos-agent-readonly'
I1213 00:04:17.288885 30770 http.cpp:922] Using default 'basic' HTTP authenticator for realm
'mesos-agent-readwrite'
I1213 00:04:17.289959 30770 slave.cpp:534] Agent resources: cpus(*):2; mem(*):1024; disk(*):1024;
ports(*):[31000-32000]
I1213 00:04:17.290041 30770 slave.cpp:542] Agent attributes: [  ]
I1213 00:04:17.290061 30770 slave.cpp:547] Agent hostname: a4a60d50a07c
I1213 00:04:17.291622 30772 state.cpp:57] Recovering state from '/tmp/Endpoint_SlaveEndpointTest_NoAuthorizer_2_8ENOEp/meta'
I1213 00:04:17.291976 30767 status_update_manager.cpp:203] Recovering status update manager
I1213 00:04:17.292243 30769 containerizer.cpp:594] Recovering containerizer
I1213 00:04:17.293828 30782 provisioner.cpp:253] Provisioner recovery complete
I1213 00:04:17.294245 30773 slave.cpp:5415] Finished recovery
I1213 00:04:17.294793 30773 slave.cpp:5589] Querying resource estimator for oversubscribable
resources
I1213 00:04:17.295106 30773 slave.cpp:5603] Received oversubscribable resources {} from the
resource estimator
I1213 00:04:17.297395 30770 process.cpp:3679] Handling HTTP event for process 'slave(674)'
with path: '/slave(674)/containers'
I1213 00:04:17.298908 30778 http.cpp:874] Authorizing principal 'test-principal' to GET the
'/containers' endpoint
I1213 00:04:17.303630 30780 slave.cpp:791] Agent terminating
[       OK ] Endpoint/SlaveEndpointTest.NoAuthorizer/2 (33 ms)
[----------] 9 tests from Endpoint/SlaveEndpointTest (287 ms total)

[----------] Global test environment tear-down
[==========] 1424 tests from 164 test cases ran. (442539 ms total)
[  PASSED  ] 1423 tests.
[  FAILED  ] 1 test, listed below:
[  FAILED  ] RegistrarTest.UpdateMaintenanceSchedule

 1 FAILED TEST
  YOU HAVE 9 DISABLED TESTS

make[4]: *** [check-local] Error 1
make[4]: Leaving directory `/mesos/mesos-1.2.0/_build/src'
make[3]: *** [check-am] Error 2
make[3]: Leaving directory `/mesos/mesos-1.2.0/_build/src'
make[2]: *** [check] Error 2
make[2]: Leaving directory `/mesos/mesos-1.2.0/_build/src'
make[1]: *** [check-recursive] Error 1
make[1]: Leaving directory `/mesos/mesos-1.2.0/_build'
make: *** [distcheck] Error 1
+ docker rmi mesos-1481585040-31848
Untagged: mesos-1481585040-31848:latest
Deleted: sha256:88b9a62228de6f238f58003fabd9d186f7a085114b7bc832956fb53c5384111a
Deleted: sha256:a3eb94570cf94802669c508db726f7c08f18f7e5e96daec8ea2d43e0025b4608
Deleted: sha256:a9a3fd826ca4ad49b7fe5e5469b077ca0bebf1ce50e7569ec3869241adb4087d
Deleted: sha256:c1e24c29d7051ff2d0c69e562dadaf41967a7c249147a8cfb43f78626b54d014
Deleted: sha256:db5483b0a85867959648f2b200022998764868e94813ec7c514c70d046ef2305
Deleted: sha256:559636ee83787a9fd5ac7e0d239bdfb4a656961288e4a675d896e67b64d0ae91
Deleted: sha256:f6d5b2c086375c409e067119c8a198625d4139474ac731055f95baf19cc38f5b
Deleted: sha256:a829d76042cffdfb5aafb337d4e2761e97cf29389b80e5ab49f1504d2ccabbe8
Deleted: sha256:5960966d8f38a853aed4c374d80cf78533d1e579e3e71d9706180ce293d69f65
Deleted: sha256:3e67cc18ce582e7ff3a472f9a96fe4e9c24d5dc0bd5eb4b9d2cba98689c48f42
Deleted: sha256:0ddf899c8eb316b85a6a912491646424e8c5139094b50aaa63497376df284f12
Deleted: sha256:d5fe2b4800d2d5ea7d4c05bb871fccd9edaea8c033c85f1d014b9c3e65dbf287
Deleted: sha256:eb82c5b2105ca929a703ace12c287124bc6db8c4719e725ec5ba404859dffb32
Deleted: sha256:58b5355baa911811c865d0bb623768011d2210e27dcb4001047da58918b0fc7f
Deleted: sha256:d692977d3c4d9b148f070964999015cd621ca60d4452ea2c1e80c316fd472882
Deleted: sha256:0e544b2f83bb7bb225d749ee0bcbbc98f491aa032a3fe0801faa65b472752105
Deleted: sha256:cda520c8fbbfc56e64c9f4f0f815fc3fa9dbc73c0014e78db81f8afb9e3b0d2c
Deleted: sha256:c7f6d5a4cd247b876355b2dabc54fcc60a802a49e665c02843e9a9021a69f2cc
Deleted: sha256:fdcdeecea0f8df718b6096c46573425d32461f37bf6dddb80b761558b5c9576f
Deleted: sha256:34b8dfe915021f4a8dd93e7663e05711a7b880b23d9a454370162a2115d179ef
Deleted: sha256:5c13769c459f9cb4f56f38b3fefdff65a6878e2276798026e7bbb0a7d07ee96e
Deleted: sha256:aaa17792d0d1e756f5da4d9b4c82c1f503a88b00538efdbf15f8d4c9e89352ee
Deleted: sha256:882877ae7749b31abf3b6ff40a43bd82c55574fadc91adbbc083910ae6cf1470
Deleted: sha256:14a1c19feb5649508c78afaca4eb1a8f7d7976153c401985c632c75ff833c007
Deleted: sha256:790b3a445a26ee944f961969304a4a09849b750ea9bca068b0f435cfd3e47bf7
Build step 'Execute shell' marked build as failure

Mime
View raw message