mesos-builds mailing list archives

Site index · List index
Message view « Date » · « Thread »
Top « Date » · « Thread »
From Apache Jenkins Server <jenk...@builds.apache.org>
Subject Build failed in Jenkins: Mesos » autotools,gcc,--verbose --enable-libevent --enable-ssl,GLOG_v=1 MESOS_VERBOSE=1,ubuntu:14.04,(docker||Hadoop)&&(!ubuntu-us1)&&(!ubuntu-6)&&(!ubuntu-eu2) #3003
Date Sat, 03 Dec 2016 02:37:55 GMT
See <https://builds.apache.org/job/Mesos/BUILDTOOL=autotools,COMPILER=gcc,CONFIGURATION=--verbose%20--enable-libevent%20--enable-ssl,ENVIRONMENT=GLOG_v=1%20MESOS_VERBOSE=1,OS=ubuntu%3A14.04,label_exp=(docker%7C%7CHadoop)&&(!ubuntu-us1)&&(!ubuntu-6)&&(!ubuntu-eu2)/3003/changes>

Changes:

[vinodkone] Updated no-longer-accurate comment.

[anand] Made `http::serv()` use the streaming request decoder.

[anand] Updated the IOSwitchboard http handler to work with streaming requests.

[bmahler] Added macOS 10.12 instructions to the getting started page.

[vinodkone] Removed stuttering from teardown test names.

[vinodkone] Improved TeardownTest.Success.

[vinodkone] Improved FaultToleranceTest.FrameworkReregister.

[vinodkone] Improved SlaveRecoveryTest.ReconcileShutdownFramework.

[vinodkone] Improved comments in the master.

[vinodkone] Tweaked usage of `getFramework`.

[vinodkone] Replaced "slave" with "agent" in status update messages.

[vinodkone] Fixed typo, removed hard tab character.

[vinodkone] Avoided sending `LostSlaveMessage` to disconnected frameworks.

[vinodkone] Added helper function, `Master::isCompletedFramework`.

[bmahler] Introduced FrameworkInfo validation.

[bmahler] Fixed WebUI error on Firefox 45.

[josephwu] Windows: Added support for Agent test harness.

[josephwu] Fixed switchboard build break on Windows.

[josephwu] Fixed ownership semantics of `DynamicLibrary`.

[josephwu] Windows: Fixed warnings in `getcwd.hpp`.

[josephwu] Windows: Fixed namespace resolution issue for test builds.

[idownes] Fix configure on FreeBSD.

[idownes] Fix xattr for FreeBSD.

[idownes] Disable sentinel checks for clang on FreeBSD.

[idownes] Fix wait macros on FreeBSD.

[idownes] Move isJailed for FreeBSD into utils.

[idownes] Check isJailed in tests that call mknod.

[idownes] Don't expect an init process in a FreeBSD jail.

[bmahler] Introduced 'roles' validation in master.

------------------------------------------
[...truncated 222061 lines...]
I1203 02:31:22.364837 31278 containerizer.cpp:206] Using isolation: posix/cpu,posix/mem,filesystem/posix,network/cni
W1203 02:31:22.365551 31278 backend.cpp:76] Failed to create 'aufs' backend: AufsBackend requires
root privileges, but is running as user mesos
W1203 02:31:22.365748 31278 backend.cpp:76] Failed to create 'bind' backend: BindBackend requires
root privileges
I1203 02:31:22.369566 31303 slave.cpp:208] Mesos agent started on (651)@172.17.0.2:58747
I1203 02:31:22.369599 31303 slave.cpp:209] Flags at startup: --acls="" --appc_simple_discovery_uri_prefix="http://"
--appc_store_dir="/tmp/mesos/store/appc" --authenticate_http_readonly="true" --authenticate_http_readwrite="true"
--authenticatee="crammd5" --authentication_backoff_factor="1secs" --authorizer="local" --cgroups_cpu_enable_pids_and_tids_count="false"
--cgroups_enable_cfs="false" --cgroups_hierarchy="/sys/fs/cgroup" --cgroups_limit_swap="false"
--cgroups_root="mesos" --container_disk_watch_interval="15secs" --containerizers="mesos" --credential="/tmp/Endpoint_SlaveEndpointTest_AuthorizedRequest_1_lcIvT8/credential"
--default_role="*" --disk_watch_interval="1mins" --docker="docker" --docker_kill_orphans="true"
--docker_registry="https://registry-1.docker.io" --docker_remove_delay="6hrs" --docker_socket="/var/run/docker.sock"
--docker_stop_timeout="0ns" --docker_store_dir="/tmp/mesos/store/docker" --docker_volume_checkpoint_dir="/var/run/mesos/isolators/docker/volume"
--enforce_container_disk_quota="false" --executor_registration_timeout="1mins" --executor_shutdown_grace_period="5secs"
--fetcher_cache_dir="/tmp/Endpoint_SlaveEndpointTest_AuthorizedRequest_1_lcIvT8/fetch" --fetcher_cache_size="2GB"
--frameworks_home="" --gc_delay="1weeks" --gc_disk_headroom="0.1" --hadoop_home="" --help="false"
--hostname_lookup="true" --http_authenticators="basic" --http_command_executor="false" --http_credentials="/tmp/Endpoint_SlaveEndpointTest_AuthorizedRequest_1_lcIvT8/http_credentials"
--image_provisioner_backend="copy" --initialize_driver_logging="true" --io_switchboard_enable_server="true"
--isolation="posix/cpu,posix/mem" --launcher="posix" --launcher_dir="/mesos/mesos-1.2.0/_build/src"
--logbufsecs="0" --logging_level="INFO" --max_completed_executors_per_framework="150" --oversubscribed_resources_interval="15secs"
--perf_duration="10secs" --perf_interval="1mins" --qos_correction_interval_min="0ns" --quiet="false"
--recover="reconnect" --recovery_timeout="15mins" --registration_backoff_factor="10ms" --resources="cpus:2;gpus:0;mem:1024;disk:1024;ports:[31000-32000]"
--revocable_cpu_low_priority="true" --runtime_dir="/tmp/Endpoint_SlaveEndpointTest_AuthorizedRequest_1_lcIvT8"
--sandbox_directory="/mnt/mesos/sandbox" --strict="true" --switch_user="true" --systemd_enable_support="true"
--systemd_runtime_directory="/run/systemd/system" --version="false" --work_dir="/tmp/Endpoint_SlaveEndpointTest_AuthorizedRequest_1_7qKdcB"
I1203 02:31:22.370275 31303 credentials.hpp:86] Loading credential for authentication from
'/tmp/Endpoint_SlaveEndpointTest_AuthorizedRequest_1_lcIvT8/credential'
I1203 02:31:22.370440 31303 slave.cpp:346] Agent using credential for: test-principal
I1203 02:31:22.370466 31303 credentials.hpp:37] Loading credentials for authentication from
'/tmp/Endpoint_SlaveEndpointTest_AuthorizedRequest_1_lcIvT8/http_credentials'
I1203 02:31:22.370733 31303 http.cpp:922] Using default 'basic' HTTP authenticator for realm
'mesos-agent-readonly'
I1203 02:31:22.370885 31303 http.cpp:922] Using default 'basic' HTTP authenticator for realm
'mesos-agent-readwrite'
I1203 02:31:22.372040 31303 slave.cpp:533] Agent resources: cpus(*):2; mem(*):1024; disk(*):1024;
ports(*):[31000-32000]
I1203 02:31:22.372143 31303 slave.cpp:541] Agent attributes: [  ]
I1203 02:31:22.372161 31303 slave.cpp:546] Agent hostname: 8a1bcb44aaf1
I1203 02:31:22.373749 31309 state.cpp:57] Recovering state from '/tmp/Endpoint_SlaveEndpointTest_AuthorizedRequest_1_7qKdcB/meta'
I1203 02:31:22.374055 31299 status_update_manager.cpp:203] Recovering status update manager
I1203 02:31:22.374275 31302 containerizer.cpp:579] Recovering containerizer
I1203 02:31:22.375628 31297 provisioner.cpp:253] Provisioner recovery complete
I1203 02:31:22.376016 31302 slave.cpp:5414] Finished recovery
I1203 02:31:22.376436 31302 slave.cpp:5588] Querying resource estimator for oversubscribable
resources
I1203 02:31:22.376658 31297 slave.cpp:5602] Received oversubscribable resources {} from the
resource estimator
I1203 02:31:22.378295 31297 process.cpp:3679] Handling HTTP event for process 'slave(651)'
with path: '/slave(651)/monitor/statistics.json'
I1203 02:31:22.379567 31297 http.cpp:874] Authorizing principal 'test-principal' to GET the
'/monitor/statistics.json' endpoint
I1203 02:31:22.382520 31312 slave.cpp:790] Agent terminating
[       OK ] Endpoint/SlaveEndpointTest.AuthorizedRequest/1 (27 ms)
[ RUN      ] Endpoint/SlaveEndpointTest.AuthorizedRequest/2
I1203 02:31:22.392596 31278 containerizer.cpp:206] Using isolation: posix/cpu,posix/mem,filesystem/posix,network/cni
W1203 02:31:22.393306 31278 backend.cpp:76] Failed to create 'aufs' backend: AufsBackend requires
root privileges, but is running as user mesos
W1203 02:31:22.393474 31278 backend.cpp:76] Failed to create 'bind' backend: BindBackend requires
root privileges
I1203 02:31:22.396612 31305 slave.cpp:208] Mesos agent started on (652)@172.17.0.2:58747
I1203 02:31:22.396654 31305 slave.cpp:209] Flags at startup: --acls="" --appc_simple_discovery_uri_prefix="http://"
--appc_store_dir="/tmp/mesos/store/appc" --authenticate_http_readonly="true" --authenticate_http_readwrite="true"
--authenticatee="crammd5" --authentication_backoff_factor="1secs" --authorizer="local" --cgroups_cpu_enable_pids_and_tids_count="false"
--cgroups_enable_cfs="false" --cgroups_hierarchy="/sys/fs/cgroup" --cgroups_limit_swap="false"
--cgroups_root="mesos" --container_disk_watch_interval="15secs" --containerizers="mesos" --credential="/tmp/Endpoint_SlaveEndpointTest_AuthorizedRequest_2_r3s7Vj/credential"
--default_role="*" --disk_watch_interval="1mins" --docker="docker" --docker_kill_orphans="true"
--docker_registry="https://registry-1.docker.io" --docker_remove_delay="6hrs" --docker_socket="/var/run/docker.sock"
--docker_stop_timeout="0ns" --docker_store_dir="/tmp/mesos/store/docker" --docker_volume_checkpoint_dir="/var/run/mesos/isolators/docker/volume"
--enforce_container_disk_quota="false" --executor_registration_timeout="1mins" --executor_shutdown_grace_period="5secs"
--fetcher_cache_dir="/tmp/Endpoint_SlaveEndpointTest_AuthorizedRequest_2_r3s7Vj/fetch" --fetcher_cache_size="2GB"
--frameworks_home="" --gc_delay="1weeks" --gc_disk_headroom="0.1" --hadoop_home="" --help="false"
--hostname_lookup="true" --http_authenticators="basic" --http_command_executor="false" --http_credentials="/tmp/Endpoint_SlaveEndpointTest_AuthorizedRequest_2_r3s7Vj/http_credentials"
--image_provisioner_backend="copy" --initialize_driver_logging="true" --io_switchboard_enable_server="true"
--isolation="posix/cpu,posix/mem" --launcher="posix" --launcher_dir="/mesos/mesos-1.2.0/_build/src"
--logbufsecs="0" --logging_level="INFO" --max_completed_executors_per_framework="150" --oversubscribed_resources_interval="15secs"
--perf_duration="10secs" --perf_interval="1mins" --qos_correction_interval_min="0ns" --quiet="false"
--recover="reconnect" --recovery_timeout="15mins" --registration_backoff_factor="10ms" --resources="cpus:2;gpus:0;mem:1024;disk:1024;ports:[31000-32000]"
--revocable_cpu_low_priority="true" --runtime_dir="/tmp/Endpoint_SlaveEndpointTest_AuthorizedRequest_2_r3s7Vj"
--sandbox_directory="/mnt/mesos/sandbox" --strict="true" --switch_user="true" --systemd_enable_support="true"
--systemd_runtime_directory="/run/systemd/system" --version="false" --work_dir="/tmp/Endpoint_SlaveEndpointTest_AuthorizedRequest_2_V7tkaM"
I1203 02:31:22.397107 31305 credentials.hpp:86] Loading credential for authentication from
'/tmp/Endpoint_SlaveEndpointTest_AuthorizedRequest_2_r3s7Vj/credential'
I1203 02:31:22.397228 31305 slave.cpp:346] Agent using credential for: test-principal
I1203 02:31:22.397251 31305 credentials.hpp:37] Loading credentials for authentication from
'/tmp/Endpoint_SlaveEndpointTest_AuthorizedRequest_2_r3s7Vj/http_credentials'
I1203 02:31:22.397450 31305 http.cpp:922] Using default 'basic' HTTP authenticator for realm
'mesos-agent-readonly'
I1203 02:31:22.397595 31305 http.cpp:922] Using default 'basic' HTTP authenticator for realm
'mesos-agent-readwrite'
I1203 02:31:22.398960 31305 slave.cpp:533] Agent resources: cpus(*):2; mem(*):1024; disk(*):1024;
ports(*):[31000-32000]
I1203 02:31:22.399063 31305 slave.cpp:541] Agent attributes: [  ]
I1203 02:31:22.399082 31305 slave.cpp:546] Agent hostname: 8a1bcb44aaf1
I1203 02:31:22.400693 31310 state.cpp:57] Recovering state from '/tmp/Endpoint_SlaveEndpointTest_AuthorizedRequest_2_V7tkaM/meta'
I1203 02:31:22.401311 31299 status_update_manager.cpp:203] Recovering status update manager
I1203 02:31:22.401600 31306 containerizer.cpp:579] Recovering containerizer
I1203 02:31:22.403062 31305 provisioner.cpp:253] Provisioner recovery complete
I1203 02:31:22.403539 31297 slave.cpp:5414] Finished recovery
I1203 02:31:22.404253 31297 slave.cpp:5588] Querying resource estimator for oversubscribable
resources
I1203 02:31:22.404644 31310 slave.cpp:5602] Received oversubscribable resources {} from the
resource estimator
I1203 02:31:22.406659 31308 process.cpp:3679] Handling HTTP event for process 'slave(652)'
with path: '/slave(652)/containers'
I1203 02:31:22.408219 31304 http.cpp:874] Authorizing principal 'test-principal' to GET the
'/containers' endpoint
I1203 02:31:22.412194 31306 slave.cpp:790] Agent terminating
[       OK ] Endpoint/SlaveEndpointTest.AuthorizedRequest/2 (29 ms)
[ RUN      ] Endpoint/SlaveEndpointTest.UnauthorizedRequest/0
I1203 02:31:22.420769 31278 containerizer.cpp:206] Using isolation: posix/cpu,posix/mem,filesystem/posix,network/cni
W1203 02:31:22.421425 31278 backend.cpp:76] Failed to create 'aufs' backend: AufsBackend requires
root privileges, but is running as user mesos
W1203 02:31:22.421612 31278 backend.cpp:76] Failed to create 'bind' backend: BindBackend requires
root privileges
I1203 02:31:22.425123 31311 slave.cpp:208] Mesos agent started on (653)@172.17.0.2:58747
I1203 02:31:22.425146 31311 slave.cpp:209] Flags at startup: --acls="" --appc_simple_discovery_uri_prefix="http://"
--appc_store_dir="/tmp/mesos/store/appc" --authenticate_http_readonly="true" --authenticate_http_readwrite="true"
--authenticatee="crammd5" --authentication_backoff_factor="1secs" --authorizer="local" --cgroups_cpu_enable_pids_and_tids_count="false"
--cgroups_enable_cfs="false" --cgroups_hierarchy="/sys/fs/cgroup" --cgroups_limit_swap="false"
--cgroups_root="mesos" --container_disk_watch_interval="15secs" --containerizers="mesos" --credential="/tmp/Endpoint_SlaveEndpointTest_UnauthorizedRequest_0_bkZrhv/credential"
--default_role="*" --disk_watch_interval="1mins" --docker="docker" --docker_kill_orphans="true"
--docker_registry="https://registry-1.docker.io" --docker_remove_delay="6hrs" --docker_socket="/var/run/docker.sock"
--docker_stop_timeout="0ns" --docker_store_dir="/tmp/mesos/store/docker" --docker_volume_checkpoint_dir="/var/run/mesos/isolators/docker/volume"
--enforce_container_disk_quota="false" --executor_registration_timeout="1mins" --executor_shutdown_grace_period="5secs"
--fetcher_cache_dir="/tmp/Endpoint_SlaveEndpointTest_UnauthorizedRequest_0_bkZrhv/fetch" --fetcher_cache_size="2GB"
--frameworks_home="" --gc_delay="1weeks" --gc_disk_headroom="0.1" --hadoop_home="" --help="false"
--hostname_lookup="true" --http_authenticators="basic" --http_command_executor="false" --http_credentials="/tmp/Endpoint_SlaveEndpointTest_UnauthorizedRequest_0_bkZrhv/http_credentials"
--image_provisioner_backend="copy" --initialize_driver_logging="true" --io_switchboard_enable_server="true"
--isolation="posix/cpu,posix/mem" --launcher="posix" --launcher_dir="/mesos/mesos-1.2.0/_build/src"
--logbufsecs="0" --logging_level="INFO" --max_completed_executors_per_framework="150" --oversubscribed_resources_interval="15secs"
--perf_duration="10secs" --perf_interval="1mins" --qos_correction_interval_min="0ns" --quiet="false"
--recover="reconnect" --recovery_timeout="15mins" --registration_backoff_factor="10ms" --resources="cpus:2;gpus:0;mem:1024;disk:1024;ports:[31000-32000]"
--revocable_cpu_low_priority="true" --runtime_dir="/tmp/Endpoint_SlaveEndpointTest_UnauthorizedRequest_0_bkZrhv"
--sandbox_directory="/mnt/mesos/sandbox" --strict="true" --switch_user="true" --systemd_enable_support="true"
--systemd_runtime_directory="/run/systemd/system" --version="false" --work_dir="/tmp/Endpoint_SlaveEndpointTest_UnauthorizedRequest_0_V47WqX"
I1203 02:31:22.425592 31311 credentials.hpp:86] Loading credential for authentication from
'/tmp/Endpoint_SlaveEndpointTest_UnauthorizedRequest_0_bkZrhv/credential'
I1203 02:31:22.425719 31311 slave.cpp:346] Agent using credential for: test-principal
I1203 02:31:22.425742 31311 credentials.hpp:37] Loading credentials for authentication from
'/tmp/Endpoint_SlaveEndpointTest_UnauthorizedRequest_0_bkZrhv/http_credentials'
I1203 02:31:22.425994 31311 http.cpp:922] Using default 'basic' HTTP authenticator for realm
'mesos-agent-readonly'
I1203 02:31:22.426167 31311 http.cpp:922] Using default 'basic' HTTP authenticator for realm
'mesos-agent-readwrite'
I1203 02:31:22.427178 31311 slave.cpp:533] Agent resources: cpus(*):2; mem(*):1024; disk(*):1024;
ports(*):[31000-32000]
I1203 02:31:22.427249 31311 slave.cpp:541] Agent attributes: [  ]
I1203 02:31:22.427295 31311 slave.cpp:546] Agent hostname: 8a1bcb44aaf1
I1203 02:31:22.428503 31302 state.cpp:57] Recovering state from '/tmp/Endpoint_SlaveEndpointTest_UnauthorizedRequest_0_V47WqX/meta'
I1203 02:31:22.428799 31302 status_update_manager.cpp:203] Recovering status update manager
I1203 02:31:22.428961 31297 containerizer.cpp:579] Recovering containerizer
I1203 02:31:22.430191 31297 provisioner.cpp:253] Provisioner recovery complete
I1203 02:31:22.430526 31302 slave.cpp:5414] Finished recovery
I1203 02:31:22.430969 31302 slave.cpp:5588] Querying resource estimator for oversubscribable
resources
I1203 02:31:22.431182 31311 slave.cpp:5602] Received oversubscribable resources {} from the
resource estimator
I1203 02:31:22.432749 31305 process.cpp:3679] Handling HTTP event for process 'slave(653)'
with path: '/slave(653)/monitor/statistics'
I1203 02:31:22.434173 31298 http.cpp:874] Authorizing principal 'test-principal' to GET the
'/monitor/statistics' endpoint
I1203 02:31:22.436311 31312 slave.cpp:790] Agent terminating
[       OK ] Endpoint/SlaveEndpointTest.UnauthorizedRequest/0 (24 ms)
[ RUN      ] Endpoint/SlaveEndpointTest.UnauthorizedRequest/1
I1203 02:31:22.445492 31278 containerizer.cpp:206] Using isolation: posix/cpu,posix/mem,filesystem/posix,network/cni
W1203 02:31:22.445966 31278 backend.cpp:76] Failed to create 'aufs' backend: AufsBackend requires
root privileges, but is running as user mesos
W1203 02:31:22.446096 31278 backend.cpp:76] Failed to create 'bind' backend: BindBackend requires
root privileges
I1203 02:31:22.448937 31304 slave.cpp:208] Mesos agent started on (654)@172.17.0.2:58747
I1203 02:31:22.448982 31304 slave.cpp:209] Flags at startup: --acls="" --appc_simple_discovery_uri_prefix="http://"
--appc_store_dir="/tmp/mesos/store/appc" --authenticate_http_readonly="true" --authenticate_http_readwrite="true"
--authenticatee="crammd5" --authentication_backoff_factor="1secs" --authorizer="local" --cgroups_cpu_enable_pids_and_tids_count="false"
--cgroups_enable_cfs="false" --cgroups_hierarchy="/sys/fs/cgroup" --cgroups_limit_swap="false"
--cgroups_root="mesos" --container_disk_watch_interval="15secs" --containerizers="mesos" --credential="/tmp/Endpoint_SlaveEndpointTest_UnauthorizedRequest_1_Dp2bTG/credential"
--default_role="*" --disk_watch_interval="1mins" --docker="docker" --docker_kill_orphans="true"
--docker_registry="https://registry-1.docker.io" --docker_remove_delay="6hrs" --docker_socket="/var/run/docker.sock"
--docker_stop_timeout="0ns" --docker_store_dir="/tmp/mesos/store/docker" --docker_volume_checkpoint_dir="/var/run/mesos/isolators/docker/volume"
--enforce_container_disk_quota="false" --executor_registration_timeout="1mins" --executor_shutdown_grace_period="5secs"
--fetcher_cache_dir="/tmp/Endpoint_SlaveEndpointTest_UnauthorizedRequest_1_Dp2bTG/fetch" --fetcher_cache_size="2GB"
--frameworks_home="" --gc_delay="1weeks" --gc_disk_headroom="0.1" --hadoop_home="" --help="false"
--hostname_lookup="true" --http_authenticators="basic" --http_command_executor="false" --http_credentials="/tmp/Endpoint_SlaveEndpointTest_UnauthorizedRequest_1_Dp2bTG/http_credentials"
--image_provisioner_backend="copy" --initialize_driver_logging="true" --io_switchboard_enable_server="true"
--isolation="posix/cpu,posix/mem" --launcher="posix" --launcher_dir="/mesos/mesos-1.2.0/_build/src"
--logbufsecs="0" --logging_level="INFO" --max_completed_executors_per_framework="150" --oversubscribed_resources_interval="15secs"
--perf_duration="10secs" --perf_interval="1mins" --qos_correction_interval_min="0ns" --quiet="false"
--recover="reconnect" --recovery_timeout="15mins" --registration_backoff_factor="10ms" --resources="cpus:2;gpus:0;mem:1024;disk:1024;ports:[31000-32000]"
--revocable_cpu_low_priority="true" --runtime_dir="/tmp/Endpoint_SlaveEndpointTest_UnauthorizedRequest_1_Dp2bTG"
--sandbox_directory="/mnt/mesos/sandbox" --strict="true" --switch_user="true" --systemd_enable_support="true"
--systemd_runtime_directory="/run/systemd/system" --version="false" --work_dir="/tmp/Endpoint_SlaveEndpointTest_UnauthorizedRequest_1_HyJEY8"
I1203 02:31:22.449460 31304 credentials.hpp:86] Loading credential for authentication from
'/tmp/Endpoint_SlaveEndpointTest_UnauthorizedRequest_1_Dp2bTG/credential'
I1203 02:31:22.449594 31304 slave.cpp:346] Agent using credential for: test-principal
I1203 02:31:22.449615 31304 credentials.hpp:37] Loading credentials for authentication from
'/tmp/Endpoint_SlaveEndpointTest_UnauthorizedRequest_1_Dp2bTG/http_credentials'
I1203 02:31:22.449827 31304 http.cpp:922] Using default 'basic' HTTP authenticator for realm
'mesos-agent-readonly'
I1203 02:31:22.449998 31304 http.cpp:922] Using default 'basic' HTTP authenticator for realm
'mesos-agent-readwrite'
I1203 02:31:22.451334 31304 slave.cpp:533] Agent resources: cpus(*):2; mem(*):1024; disk(*):1024;
ports(*):[31000-32000]
I1203 02:31:22.451439 31304 slave.cpp:541] Agent attributes: [  ]
I1203 02:31:22.451454 31304 slave.cpp:546] Agent hostname: 8a1bcb44aaf1
I1203 02:31:22.452812 31311 state.cpp:57] Recovering state from '/tmp/Endpoint_SlaveEndpointTest_UnauthorizedRequest_1_HyJEY8/meta'
I1203 02:31:22.453086 31299 status_update_manager.cpp:203] Recovering status update manager
I1203 02:31:22.453335 31309 containerizer.cpp:579] Recovering containerizer
I1203 02:31:22.454632 31300 provisioner.cpp:253] Provisioner recovery complete
I1203 02:31:22.454988 31309 slave.cpp:5414] Finished recovery
I1203 02:31:22.455390 31309 slave.cpp:5588] Querying resource estimator for oversubscribable
resources
I1203 02:31:22.455595 31304 slave.cpp:5602] Received oversubscribable resources {} from the
resource estimator
I1203 02:31:22.457190 31308 process.cpp:3679] Handling HTTP event for process 'slave(654)'
with path: '/slave(654)/monitor/statistics.json'
I1203 02:31:22.458148 31311 http.cpp:874] Authorizing principal 'test-principal' to GET the
'/monitor/statistics.json' endpoint
I1203 02:31:22.460053 31305 slave.cpp:790] Agent terminating
[       OK ] Endpoint/SlaveEndpointTest.UnauthorizedRequest/1 (25 ms)
[ RUN      ] Endpoint/SlaveEndpointTest.UnauthorizedRequest/2
I1203 02:31:22.471732 31278 containerizer.cpp:206] Using isolation: posix/cpu,posix/mem,filesystem/posix,network/cni
W1203 02:31:22.472370 31278 backend.cpp:76] Failed to create 'aufs' backend: AufsBackend requires
root privileges, but is running as user mesos
W1203 02:31:22.472591 31278 backend.cpp:76] Failed to create 'bind' backend: BindBackend requires
root privileges
I1203 02:31:22.475901 31312 slave.cpp:208] Mesos agent started on (655)@172.17.0.2:58747
I1203 02:31:22.475919 31312 slave.cpp:209] Flags at startup: --acls="" --appc_simple_discovery_uri_prefix="http://"
--appc_store_dir="/tmp/mesos/store/appc" --authenticate_http_readonly="true" --authenticate_http_readwrite="true"
--authenticatee="crammd5" --authentication_backoff_factor="1secs" --authorizer="local" --cgroups_cpu_enable_pids_and_tids_count="false"
--cgroups_enable_cfs="false" --cgroups_hierarchy="/sys/fs/cgroup" --cgroups_limit_swap="false"
--cgroups_root="mesos" --container_disk_watch_interval="15secs" --containerizers="mesos" --credential="/tmp/Endpoint_SlaveEndpointTest_UnauthorizedRequest_2_RtriLS/credential"
--default_role="*" --disk_watch_interval="1mins" --docker="docker" --docker_kill_orphans="true"
--docker_registry="https://registry-1.docker.io" --docker_remove_delay="6hrs" --docker_socket="/var/run/docker.sock"
--docker_stop_timeout="0ns" --docker_store_dir="/tmp/mesos/store/docker" --docker_volume_checkpoint_dir="/var/run/mesos/isolators/docker/volume"
--enforce_container_disk_quota="false" --executor_registration_timeout="1mins" --executor_shutdown_grace_period="5secs"
--fetcher_cache_dir="/tmp/Endpoint_SlaveEndpointTest_UnauthorizedRequest_2_RtriLS/fetch" --fetcher_cache_size="2GB"
--frameworks_home="" --gc_delay="1weeks" --gc_disk_headroom="0.1" --hadoop_home="" --help="false"
--hostname_lookup="true" --http_authenticators="basic" --http_command_executor="false" --http_credentials="/tmp/Endpoint_SlaveEndpointTest_UnauthorizedRequest_2_RtriLS/http_credentials"
--image_provisioner_backend="copy" --initialize_driver_logging="true" --io_switchboard_enable_server="true"
--isolation="posix/cpu,posix/mem" --launcher="posix" --launcher_dir="/mesos/mesos-1.2.0/_build/src"
--logbufsecs="0" --logging_level="INFO" --max_completed_executors_per_framework="150" --oversubscribed_resources_interval="15secs"
--perf_duration="10secs" --perf_interval="1mins" --qos_correction_interval_min="0ns" --quiet="false"
--recover="reconnect" --recovery_timeout="15mins" --registration_backoff_factor="10ms" --resources="cpus:2;gpus:0;mem:1024;disk:1024;ports:[31000-32000]"
--revocable_cpu_low_priority="true" --runtime_dir="/tmp/Endpoint_SlaveEndpointTest_UnauthorizedRequest_2_RtriLS"
--sandbox_directory="/mnt/mesos/sandbox" --strict="true" --switch_user="true" --systemd_enable_support="true"
--systemd_runtime_directory="/run/systemd/system" --version="false" --work_dir="/tmp/Endpoint_SlaveEndpointTest_UnauthorizedRequest_2_FXFCMk"
I1203 02:31:22.476438 31312 credentials.hpp:86] Loading credential for authentication from
'/tmp/Endpoint_SlaveEndpointTest_UnauthorizedRequest_2_RtriLS/credential'
I1203 02:31:22.476577 31312 slave.cpp:346] Agent using credential for: test-principal
I1203 02:31:22.476596 31312 credentials.hpp:37] Loading credentials for authentication from
'/tmp/Endpoint_SlaveEndpointTest_UnauthorizedRequest_2_RtriLS/http_credentials'
I1203 02:31:22.476785 31312 http.cpp:922] Using default 'basic' HTTP authenticator for realm
'mesos-agent-readonly'
I1203 02:31:22.476904 31312 http.cpp:922] Using default 'basic' HTTP authenticator for realm
'mesos-agent-readwrite'
I1203 02:31:22.477843 31312 slave.cpp:533] Agent resources: cpus(*):2; mem(*):1024; disk(*):1024;
ports(*):[31000-32000]
I1203 02:31:22.477918 31312 slave.cpp:541] Agent attributes: [  ]
I1203 02:31:22.477931 31312 slave.cpp:546] Agent hostname: 8a1bcb44aaf1
I1203 02:31:22.479292 31301 state.cpp:57] Recovering state from '/tmp/Endpoint_SlaveEndpointTest_UnauthorizedRequest_2_FXFCMk/meta'
I1203 02:31:22.479605 31297 status_update_manager.cpp:203] Recovering status update manager
I1203 02:31:22.479799 31305 containerizer.cpp:579] Recovering containerizer
I1203 02:31:22.481184 31297 provisioner.cpp:253] Provisioner recovery complete
I1203 02:31:22.481670 31298 slave.cpp:5414] Finished recovery
I1203 02:31:22.482247 31298 slave.cpp:5588] Querying resource estimator for oversubscribable
resources
I1203 02:31:22.482502 31297 slave.cpp:5602] Received oversubscribable resources {} from the
resource estimator
I1203 02:31:22.484653 31303 process.cpp:3679] Handling HTTP event for process 'slave(655)'
with path: '/slave(655)/containers'
I1203 02:31:22.486084 31306 http.cpp:874] Authorizing principal 'test-principal' to GET the
'/containers' endpoint
I1203 02:31:22.489135 31278 slave.cpp:790] Agent terminating
[       OK ] Endpoint/SlaveEndpointTest.UnauthorizedRequest/2 (28 ms)
[ RUN      ] Endpoint/SlaveEndpointTest.NoAuthorizer/0
I1203 02:31:22.498481 31278 containerizer.cpp:206] Using isolation: posix/cpu,posix/mem,filesystem/posix,network/cni
W1203 02:31:22.499168 31278 backend.cpp:76] Failed to create 'aufs' backend: AufsBackend requires
root privileges, but is running as user mesos
W1203 02:31:22.499398 31278 backend.cpp:76] Failed to create 'bind' backend: BindBackend requires
root privileges
I1203 02:31:22.501587 31278 cluster.cpp:435] Creating default 'local' authorizer
I1203 02:31:22.503106 31311 slave.cpp:208] Mesos agent started on (656)@172.17.0.2:58747
I1203 02:31:22.503134 31311 slave.cpp:209] Flags at startup: --acls="" --appc_simple_discovery_uri_prefix="http://"
--appc_store_dir="/tmp/mesos/store/appc" --authenticate_http_readonly="true" --authenticate_http_readwrite="true"
--authenticatee="crammd5" --authentication_backoff_factor="1secs" --authorizer="local" --cgroups_cpu_enable_pids_and_tids_count="false"
--cgroups_enable_cfs="false" --cgroups_hierarchy="/sys/fs/cgroup" --cgroups_limit_swap="false"
--cgroups_root="mesos" --container_disk_watch_interval="15secs" --containerizers="mesos" --credential="/tmp/Endpoint_SlaveEndpointTest_NoAuthorizer_0_HWJ5U4/credential"
--default_role="*" --disk_watch_interval="1mins" --docker="docker" --docker_kill_orphans="true"
--docker_registry="https://registry-1.docker.io" --docker_remove_delay="6hrs" --docker_socket="/var/run/docker.sock"
--docker_stop_timeout="0ns" --docker_store_dir="/tmp/mesos/store/docker" --docker_volume_checkpoint_dir="/var/run/mesos/isolators/docker/volume"
--enforce_container_disk_quota="false" --executor_registration_timeout="1mins" --executor_shutdown_grace_period="5secs"
--fetcher_cache_dir="/tmp/Endpoint_SlaveEndpointTest_NoAuthorizer_0_HWJ5U4/fetch" --fetcher_cache_size="2GB"
--frameworks_home="" --gc_delay="1weeks" --gc_disk_headroom="0.1" --hadoop_home="" --help="false"
--hostname_lookup="true" --http_authenticators="basic" --http_command_executor="false" --http_credentials="/tmp/Endpoint_SlaveEndpointTest_NoAuthorizer_0_HWJ5U4/http_credentials"
--image_provisioner_backend="copy" --initialize_driver_logging="true" --io_switchboard_enable_server="true"
--isolation="posix/cpu,posix/mem" --launcher="posix" --launcher_dir="/mesos/mesos-1.2.0/_build/src"
--logbufsecs="0" --logging_level="INFO" --max_completed_executors_per_framework="150" --oversubscribed_resources_interval="15secs"
--perf_duration="10secs" --perf_interval="1mins" --qos_correction_interval_min="0ns" --quiet="false"
--recover="reconnect" --recovery_timeout="15mins" --registration_backoff_factor="10ms" --resources="cpus:2;gpus:0;mem:1024;disk:1024;ports:[31000-32000]"
--revocable_cpu_low_priority="true" --runtime_dir="/tmp/Endpoint_SlaveEndpointTest_NoAuthorizer_0_HWJ5U4"
--sandbox_directory="/mnt/mesos/sandbox" --strict="true" --switch_user="true" --systemd_enable_support="true"
--systemd_runtime_directory="/run/systemd/system" --version="false" --work_dir="/tmp/Endpoint_SlaveEndpointTest_NoAuthorizer_0_d50ZRw"
I1203 02:31:22.503841 31311 credentials.hpp:86] Loading credential for authentication from
'/tmp/Endpoint_SlaveEndpointTest_NoAuthorizer_0_HWJ5U4/credential'
I1203 02:31:22.504011 31311 slave.cpp:346] Agent using credential for: test-principal
I1203 02:31:22.504036 31311 credentials.hpp:37] Loading credentials for authentication from
'/tmp/Endpoint_SlaveEndpointTest_NoAuthorizer_0_HWJ5U4/http_credentials'
I1203 02:31:22.504307 31311 http.cpp:922] Using default 'basic' HTTP authenticator for realm
'mesos-agent-readonly'
I1203 02:31:22.504458 31311 http.cpp:922] Using default 'basic' HTTP authenticator for realm
'mesos-agent-readwrite'
I1203 02:31:22.506188 31311 slave.cpp:533] Agent resources: cpus(*):2; mem(*):1024; disk(*):1024;
ports(*):[31000-32000]
I1203 02:31:22.506285 31311 slave.cpp:541] Agent attributes: [  ]
I1203 02:31:22.506300 31311 slave.cpp:546] Agent hostname: 8a1bcb44aaf1
I1203 02:31:22.507969 31303 state.cpp:57] Recovering state from '/tmp/Endpoint_SlaveEndpointTest_NoAuthorizer_0_d50ZRw/meta'
I1203 02:31:22.508399 31300 status_update_manager.cpp:203] Recovering status update manager
I1203 02:31:22.508728 31311 containerizer.cpp:579] Recovering containerizer
I1203 02:31:22.510426 31302 provisioner.cpp:253] Provisioner recovery complete
I1203 02:31:22.510942 31307 slave.cpp:5414] Finished recovery
I1203 02:31:22.511518 31307 slave.cpp:5588] Querying resource estimator for oversubscribable
resources
I1203 02:31:22.511798 31312 slave.cpp:5602] Received oversubscribable resources {} from the
resource estimator
I1203 02:31:22.513687 31299 process.cpp:3679] Handling HTTP event for process 'slave(656)'
with path: '/slave(656)/monitor/statistics'
I1203 02:31:22.515108 31302 http.cpp:874] Authorizing principal 'test-principal' to GET the
'/monitor/statistics' endpoint
I1203 02:31:22.518807 31307 slave.cpp:790] Agent terminating
[       OK ] Endpoint/SlaveEndpointTest.NoAuthorizer/0 (30 ms)
[ RUN      ] Endpoint/SlaveEndpointTest.NoAuthorizer/1
I1203 02:31:22.528986 31278 containerizer.cpp:206] Using isolation: posix/cpu,posix/mem,filesystem/posix,network/cni
W1203 02:31:22.529556 31278 backend.cpp:76] Failed to create 'aufs' backend: AufsBackend requires
root privileges, but is running as user mesos
W1203 02:31:22.529700 31278 backend.cpp:76] Failed to create 'bind' backend: BindBackend requires
root privileges
I1203 02:31:22.531641 31278 cluster.cpp:435] Creating default 'local' authorizer
I1203 02:31:22.533260 31307 slave.cpp:208] Mesos agent started on (657)@172.17.0.2:58747
I1203 02:31:22.533288 31307 slave.cpp:209] Flags at startup: --acls="" --appc_simple_discovery_uri_prefix="http://"
--appc_store_dir="/tmp/mesos/store/appc" --authenticate_http_readonly="true" --authenticate_http_readwrite="true"
--authenticatee="crammd5" --authentication_backoff_factor="1secs" --authorizer="local" --cgroups_cpu_enable_pids_and_tids_count="false"
--cgroups_enable_cfs="false" --cgroups_hierarchy="/sys/fs/cgroup" --cgroups_limit_swap="false"
--cgroups_root="mesos" --container_disk_watch_interval="15secs" --containerizers="mesos" --credential="/tmp/Endpoint_SlaveEndpointTest_NoAuthorizer_1_nENpoh/credential"
--default_role="*" --disk_watch_interval="1mins" --docker="docker" --docker_kill_orphans="true"
--docker_registry="https://registry-1.docker.io" --docker_remove_delay="6hrs" --docker_socket="/var/run/docker.sock"
--docker_stop_timeout="0ns" --docker_store_dir="/tmp/mesos/store/docker" --docker_volume_checkpoint_dir="/var/run/mesos/isolators/docker/volume"
--enforce_container_disk_quota="false" --executor_registration_timeout="1mins" --executor_shutdown_grace_period="5secs"
--fetcher_cache_dir="/tmp/Endpoint_SlaveEndpointTest_NoAuthorizer_1_nENpoh/fetch" --fetcher_cache_size="2GB"
--frameworks_home="" --gc_delay="1weeks" --gc_disk_headroom="0.1" --hadoop_home="" --help="false"
--hostname_lookup="true" --http_authenticators="basic" --http_command_executor="false" --http_credentials="/tmp/Endpoint_SlaveEndpointTest_NoAuthorizer_1_nENpoh/http_credentials"
--image_provisioner_backend="copy" --initialize_driver_logging="true" --io_switchboard_enable_server="true"
--isolation="posix/cpu,posix/mem" --launcher="posix" --launcher_dir="/mesos/mesos-1.2.0/_build/src"
--logbufsecs="0" --logging_level="INFO" --max_completed_executors_per_framework="150" --oversubscribed_resources_interval="15secs"
--perf_duration="10secs" --perf_interval="1mins" --qos_correction_interval_min="0ns" --quiet="false"
--recover="reconnect" --recovery_timeout="15mins" --registration_backoff_factor="10ms" --resources="cpus:2;gpus:0;mem:1024;disk:1024;ports:[31000-32000]"
--revocable_cpu_low_priority="true" --runtime_dir="/tmp/Endpoint_SlaveEndpointTest_NoAuthorizer_1_nENpoh"
--sandbox_directory="/mnt/mesos/sandbox" --strict="true" --switch_user="true" --systemd_enable_support="true"
--systemd_runtime_directory="/run/systemd/system" --version="false" --work_dir="/tmp/Endpoint_SlaveEndpointTest_NoAuthorizer_1_FUGngJ"
I1203 02:31:22.533957 31307 credentials.hpp:86] Loading credential for authentication from
'/tmp/Endpoint_SlaveEndpointTest_NoAuthorizer_1_nENpoh/credential'
I1203 02:31:22.534116 31307 slave.cpp:346] Agent using credential for: test-principal
I1203 02:31:22.534140 31307 credentials.hpp:37] Loading credentials for authentication from
'/tmp/Endpoint_SlaveEndpointTest_NoAuthorizer_1_nENpoh/http_credentials'
I1203 02:31:22.534400 31307 http.cpp:922] Using default 'basic' HTTP authenticator for realm
'mesos-agent-readonly'
I1203 02:31:22.534538 31307 http.cpp:922] Using default 'basic' HTTP authenticator for realm
'mesos-agent-readwrite'
I1203 02:31:22.535809 31307 slave.cpp:533] Agent resources: cpus(*):2; mem(*):1024; disk(*):1024;
ports(*):[31000-32000]
I1203 02:31:22.535907 31307 slave.cpp:541] Agent attributes: [  ]
I1203 02:31:22.535920 31307 slave.cpp:546] Agent hostname: 8a1bcb44aaf1
I1203 02:31:22.537295 31298 state.cpp:57] Recovering state from '/tmp/Endpoint_SlaveEndpointTest_NoAuthorizer_1_FUGngJ/meta'
I1203 02:31:22.537654 31304 status_update_manager.cpp:203] Recovering status update manager
I1203 02:31:22.537894 31311 containerizer.cpp:579] Recovering containerizer
I1203 02:31:22.539939 31297 provisioner.cpp:253] Provisioner recovery complete
I1203 02:31:22.540374 31299 slave.cpp:5414] Finished recovery
I1203 02:31:22.540992 31299 slave.cpp:5588] Querying resource estimator for oversubscribable
resources
I1203 02:31:22.541280 31297 slave.cpp:5602] Received oversubscribable resources {} from the
resource estimator
I1203 02:31:22.543256 31306 process.cpp:3679] Handling HTTP event for process 'slave(657)'
with path: '/slave(657)/monitor/statistics.json'
I1203 02:31:22.544895 31300 http.cpp:874] Authorizing principal 'test-principal' to GET the
'/monitor/statistics.json' endpoint
I1203 02:31:22.549172 31303 slave.cpp:790] Agent terminating
[       OK ] Endpoint/SlaveEndpointTest.NoAuthorizer/1 (31 ms)
[ RUN      ] Endpoint/SlaveEndpointTest.NoAuthorizer/2
I1203 02:31:22.560431 31278 containerizer.cpp:206] Using isolation: posix/cpu,posix/mem,filesystem/posix,network/cni
W1203 02:31:22.560991 31278 backend.cpp:76] Failed to create 'aufs' backend: AufsBackend requires
root privileges, but is running as user mesos
W1203 02:31:22.561169 31278 backend.cpp:76] Failed to create 'bind' backend: BindBackend requires
root privileges
I1203 02:31:22.563043 31278 cluster.cpp:435] Creating default 'local' authorizer
I1203 02:31:22.564720 31309 slave.cpp:208] Mesos agent started on (658)@172.17.0.2:58747
I1203 02:31:22.564746 31309 slave.cpp:209] Flags at startup: --acls="" --appc_simple_discovery_uri_prefix="http://"
--appc_store_dir="/tmp/mesos/store/appc" --authenticate_http_readonly="true" --authenticate_http_readwrite="true"
--authenticatee="crammd5" --authentication_backoff_factor="1secs" --authorizer="local" --cgroups_cpu_enable_pids_and_tids_count="false"
--cgroups_enable_cfs="false" --cgroups_hierarchy="/sys/fs/cgroup" --cgroups_limit_swap="false"
--cgroups_root="mesos" --container_disk_watch_interval="15secs" --containerizers="mesos" --credential="/tmp/Endpoint_SlaveEndpointTest_NoAuthorizer_2_pIiPbu/credential"
--default_role="*" --disk_watch_interval="1mins" --docker="docker" --docker_kill_orphans="true"
--docker_registry="https://registry-1.docker.io" --docker_remove_delay="6hrs" --docker_socket="/var/run/docker.sock"
--docker_stop_timeout="0ns" --docker_store_dir="/tmp/mesos/store/docker" --docker_volume_checkpoint_dir="/var/run/mesos/isolators/docker/volume"
--enforce_container_disk_quota="false" --executor_registration_timeout="1mins" --executor_shutdown_grace_period="5secs"
--fetcher_cache_dir="/tmp/Endpoint_SlaveEndpointTest_NoAuthorizer_2_pIiPbu/fetch" --fetcher_cache_size="2GB"
--frameworks_home="" --gc_delay="1weeks" --gc_disk_headroom="0.1" --hadoop_home="" --help="false"
--hostname_lookup="true" --http_authenticators="basic" --http_command_executor="false" --http_credentials="/tmp/Endpoint_SlaveEndpointTest_NoAuthorizer_2_pIiPbu/http_credentials"
--image_provisioner_backend="copy" --initialize_driver_logging="true" --io_switchboard_enable_server="true"
--isolation="posix/cpu,posix/mem" --launcher="posix" --launcher_dir="/mesos/mesos-1.2.0/_build/src"
--logbufsecs="0" --logging_level="INFO" --max_completed_executors_per_framework="150" --oversubscribed_resources_interval="15secs"
--perf_duration="10secs" --perf_interval="1mins" --qos_correction_interval_min="0ns" --quiet="false"
--recover="reconnect" --recovery_timeout="15mins" --registration_backoff_factor="10ms" --resources="cpus:2;gpus:0;mem:1024;disk:1024;ports:[31000-32000]"
--revocable_cpu_low_priority="true" --runtime_dir="/tmp/Endpoint_SlaveEndpointTest_NoAuthorizer_2_pIiPbu"
--sandbox_directory="/mnt/mesos/sandbox" --strict="true" --switch_user="true" --systemd_enable_support="true"
--systemd_runtime_directory="/run/systemd/system" --version="false" --work_dir="/tmp/Endpoint_SlaveEndpointTest_NoAuthorizer_2_fcCGYV"
I1203 02:31:22.565237 31309 credentials.hpp:86] Loading credential for authentication from
'/tmp/Endpoint_SlaveEndpointTest_NoAuthorizer_2_pIiPbu/credential'
I1203 02:31:22.565392 31309 slave.cpp:346] Agent using credential for: test-principal
I1203 02:31:22.565415 31309 credentials.hpp:37] Loading credentials for authentication from
'/tmp/Endpoint_SlaveEndpointTest_NoAuthorizer_2_pIiPbu/http_credentials'
I1203 02:31:22.565661 31309 http.cpp:922] Using default 'basic' HTTP authenticator for realm
'mesos-agent-readonly'
I1203 02:31:22.565806 31309 http.cpp:922] Using default 'basic' HTTP authenticator for realm
'mesos-agent-readwrite'
I1203 02:31:22.567188 31309 slave.cpp:533] Agent resources: cpus(*):2; mem(*):1024; disk(*):1024;
ports(*):[31000-32000]
I1203 02:31:22.567333 31309 slave.cpp:541] Agent attributes: [  ]
I1203 02:31:22.567353 31309 slave.cpp:546] Agent hostname: 8a1bcb44aaf1
I1203 02:31:22.568895 31300 state.cpp:57] Recovering state from '/tmp/Endpoint_SlaveEndpointTest_NoAuthorizer_2_fcCGYV/meta'
I1203 02:31:22.569170 31311 status_update_manager.cpp:203] Recovering status update manager
I1203 02:31:22.569505 31306 containerizer.cpp:579] Recovering containerizer
I1203 02:31:22.570878 31300 provisioner.cpp:253] Provisioner recovery complete
I1203 02:31:22.571337 31304 slave.cpp:5414] Finished recovery
I1203 02:31:22.571830 31304 slave.cpp:5588] Querying resource estimator for oversubscribable
resources
I1203 02:31:22.572100 31305 slave.cpp:5602] Received oversubscribable resources {} from the
resource estimator
I1203 02:31:22.574328 31300 process.cpp:3679] Handling HTTP event for process 'slave(658)'
with path: '/slave(658)/containers'
I1203 02:31:22.576014 31298 http.cpp:874] Authorizing principal 'test-principal' to GET the
'/containers' endpoint
I1203 02:31:22.580386 31299 slave.cpp:790] Agent terminating
[       OK ] Endpoint/SlaveEndpointTest.NoAuthorizer/2 (31 ms)
[----------] 9 tests from Endpoint/SlaveEndpointTest (728 ms total)

[----------] Global test environment tear-down
[==========] 1404 tests from 160 test cases ran. (513862 ms total)
[  PASSED  ] 1403 tests.
[  FAILED  ] 1 test, listed below:
[  FAILED  ] MasterTest.MaxCompletedTasksPerFrameworkFlag

 1 FAILED TEST
  YOU HAVE 9 DISABLED TESTS

make[4]: *** [check-local] Error 1
make[4]: Leaving directory `/mesos/mesos-1.2.0/_build/src'
make[3]: *** [check-am] Error 2
make[3]: Leaving directory `/mesos/mesos-1.2.0/_build/src'
make[2]: *** [check] Error 2
make[2]: Leaving directory `/mesos/mesos-1.2.0/_build/src'
make[1]: *** [check-recursive] Error 1
make[1]: Leaving directory `/mesos/mesos-1.2.0/_build'
make: *** [distcheck] Error 1
+ docker rmi mesos-1480729371-2199
Untagged: mesos-1480729371-2199:latest
Deleted: sha256:19b0c37bcebfe20373e3e13619e4b699374f4653444c601da9f2f42ca4606f01
Deleted: sha256:89157263d5afb4eec705a0b05ed3084a1353f8cdf29a9ac4101f77ea4c46d047
Deleted: sha256:ab144ed65015369513c86999b48a15bbbf25eaab2e3fae861621e8cb28600807
Deleted: sha256:8cd5b0fa883191d5070c8fea67f090de43b9bd0e487634d4a9c1fc18e55a4951
Deleted: sha256:8f726852d0a0f767875c856930cc6a65b707546cb70a119d815d1941ee7cdd9f
Deleted: sha256:0c03a8a10098d31096027e147a5f15231adf8ff3b6752212a89c54178ef1742f
Deleted: sha256:4cded27a5362abf88efd897887beb3c6e2093d1f8627fdbe7224a0719d4c83e5
Deleted: sha256:11b1b1d8eebcdfe07de768d3047e7d83cf911bc364b6f9caf1a3cfa5047e181e
Deleted: sha256:0db1eeedc6cd9096ee0da7c956e4f36467c4fc8941daed901eeea2a28fa2277e
Deleted: sha256:04ad559a6aeb461792e1dbaf6d79d5721ead0de0a28d5bf71bfd8174ffba0c5b
Deleted: sha256:99696a950fc2152a059542431d915fc808b5ea2a9f5dafbd530e2f6140e3c85f
Deleted: sha256:949af0c1db6ed5724b06955e5a1df965733e46c0776bee955b97781f4a3119e1
Deleted: sha256:e7602b73e7afa01711bd481ca372027f464da8d903d701fe7333a7df04c613b3
Deleted: sha256:804b9abad0d4bf578dacf55fb40ef1358e3b36b5edc3f5540ff0e81fe400663d
Deleted: sha256:faf845478a3b7dd064c2cfdf934555d3e0dad5f5d55c606040e3bbdb7a4d3e8f
Deleted: sha256:ba1801f5e7baa24951ca42580325aee3497071dadfb98a61ef21759f8249dd59
Deleted: sha256:a90eb725ea416168cb1b6ad036c5823605e23ae1416c16b1a4ab47684f561efc
Deleted: sha256:675a6d848bcefffe21a99c6b2d16b9a41079576bb087b4e27d381baeb4cf9e5a
Deleted: sha256:73940fb386decd6f349e81def418f3443c1e803a2631035c1ca3f7e62fefcb60
Deleted: sha256:9335cba58c3acba74f151fba5b71fc43e96c236524678187a65b1262ac88c72b
Deleted: sha256:afde5b51312d2e16ccbb0758b6139da0a13de24199216e70a31f310619960af3
Deleted: sha256:bd4300f0b62cfbd7e93450fb1fcc9f1adf3319456a4709f3b42df61708bd02fb
Deleted: sha256:eeb78fc18e568a19ea40e4c9a8858713ee992585cc5a058ad4d4e5a250b645e3
Deleted: sha256:291b6af59392cf78e08f955ac436c1b68d8365051cfa4729fe510cbd397aecea
Build step 'Execute shell' marked build as failure

Mime
View raw message