mesos-builds mailing list archives

Site index · List index
Message view « Date » · « Thread »
Top « Date » · « Thread »
From Apache Jenkins Server <jenk...@builds.apache.org>
Subject Build failed in Jenkins: Mesos-Windows #897
Date Thu, 01 Dec 2016 21:03:51 GMT
See <https://builds.apache.org/job/Mesos-Windows/897/changes>

Changes:

[josephwu] CMake: Added loop_tests.cpp to the build.

[josephwu] CMake: Added IO Switchboard to the build.

------------------------------------------
[...truncated 7208 lines...]
W1201 13:03:52.809417  2888 fcntl.hpp:30] `os::cloexec` has been called, but is a no-op on
Windows
W1201 13:03:52.809417  2888 fcntl.hpp:82] `os::isNonblock` has been called, but is a stub
on Windows
W1201 13:03:52.811435  1572 fcntl.hpp:82] `os::isNonblock` has been called, but is a[    
  OK ] HTTPConnectionTest.RequestStreaming (23 ms)
[----------] 8 tests from HTTPConnectionTest (218 ms total)

[----------] 2 tests from URLTest
[ RUN      ] URLTest.Stringification
[       OK ] URLTest.Stringification (1 ms)
[ RUN      ] URLTest.ParseUrls
[       OK ] URLTest.ParseUrls (1 ms)
[----------] 2 tests from URLTest (3 ms total)

[----------] 6 tests from HttpAuthenticationTest
[ RUN      ] HttpAuthenticationTest.NoAuthenticator
[       OK ] HttpAuthenticationTest.NoAuthenticator (17 ms)
[ RUN      ] HttpAuthenticationTest.Unauthorized
[       OK ] HttpAuthenticationTest.Unauthorized (20 ms)
[ RUN      ] HttpAuthenticationTest.Forbidden
[       OK ] HttpAuthenticationTest.Forbidden (20 ms)
[ RUN      ] HttpAuthenticationTest.Authenticated
[       OK ] HttpAuthenticationTest.Authenticated (20 ms)
[ RUN      ] HttpAuthenticationTest.Pipelining
[       OK ] HttpAuthenticationTest.Pipelining (31 ms)
[ RUN      ] HttpAuthenticationTest.Basic
 stub on Windows
W1201 13:03:52.815408  2888 fcntl.hpp:82] `os::isNonblock` has been called, but is a stub
on Windows
W1201 13:03:52.818418  2888 fcntl.hpp:82] `os::isNonblock` has been called, but is a stub
on Windows
W1201 13:03:52.820459  2888 fcntl.hpp:82] `os::isNonblock` has been called, but is a stub
on Windows
W1201 13:03:52.826447  4508 fcntl.hpp:82] `os::isNonblock` has been called, but is a stub
on Windows
W1201 13:03:52.835418  4200 fcntl.hpp:30] `os::cloexec` has been called, but is a no-op on
Windows
W1201 13:03:52.835418  2888 fcntl.hpp:30] `os::cloexec` has been called, but is a no-op on
Windows
W1201 13:03:52.836418  2888 fcntl.hpp:82] `os::isNonblock` has been called, but is a stub
on Windows
W1201 13:03:52.837419  2640 fcntl.hpp:82] `os::isNonblock` has been called, but is a stub
on Windows
W1201 13:03:52.840422  2888 fcntl.hpp:82] `os::isNonblock` has been called, but is a stub
on Windows
W1201 13:03:52.853415  4200 fcntl.hpp:30] `os::cloexec` has been called, but is a no-op on
Windows
W1201 13:03:52.853415  2888 fcntl.hpp:30] `os::cloexec` has been called, but is a no-op on
Windows
W1201 13:03:52.854418  2888 fcntl.hpp:82] `os::isNonblock` has been called, but is a stub
on Windows
W1201 13:03:52.855417  3940 fcntl.hpp:82] `os::isNonblock` has been called, but is a stub
on Windows
W1201 13:03:52.858417  2888 fcntl.hpp:82] `os::isNonblock` has been called, but is a stub
on Windows
W1201 13:03:52.872421  4200 fcntl.hpp:30] `os::cloexec` has been called, but is a no-op on
Windows
W1201 13:03:52.873410  2888 fcntl.hpp:30] `os::cloexec` has been called, but is a no-op on
Windows
W1201 13:03:52.873410  2888 fcntl.hpp:82] `os::isNonblock` has been called, but is a stub
on Windows
W1201 13:03:52.875419  4980 fcntl.hpp:82] `os::isNonblock` has been called, but is a stub
on Windows
W1201 13:03:52.878428  2888 fcntl.hpp:82] `os::isNonblock` has been called, but is a stub
on Windows
W1201 13:03:52.893419  4200 fcntl.hpp:30] `os::cloexec` has been called, but is a no-op on
Windows
W1201 13:03:52.894418  2888 fcntl.hpp:30] `os::cloexec` has been called, but is a no-op on
Windows
W1201 13:03:52.894418  2888 fcntl.hpp:82] `os::isNonblock` has been called, but is a stub
on Windows
W1201 13:03:52.896425  3940 fcntl.hpp:82] `os::isNonblock` has been called, but is a stub
on Windows
W1201 13:03:52.899441  2888 fcntl.hpp:82] `os::isNonblock` has been called, but is a stub
on Windows
W1201 13:03:52.915418  4200 fcntl.hpp:30] `os::cloexec` has been called, but is a no-op on
Windows
W1201 13:03:52.915418  2888 fcntl.hpp:30] `os::cloexec` has been called, but is a no-op on
Windows
W1201 13:03:52.916424  2888 fcntl.hpp:82] `os::isNonblock` has been called, but is a stub
on Windows
W1201 13:03:52.917429  2640 fcntl.hpp:82] `os::isNonblock` has been called, but is a stub
on Windows
W1201 13:03:52.922421  2888 fcntl.hpp:82] `os::isNonblock` has been called, but is a stub
on Windows
W1201 13:03:52.924419  2888 fcntl.hpp:82] `os::isNonblock` has been called, but is a stub
on Windows
W1201 13:03:52.933419  2640 fcntl.hpp:82] `os::isNonblock` has been called, but is a stub
on Windows
W1201 13:03:52.936419  3164 fcntl.hpp:82] `os::isNonblock` has been called, but is a stub
on Windows
W1201 13:03:52.944423  4200 fcntl.hpp:30] `os::cloexec` has been called, but is a no-op on
Windows
W1201 13:03:52.945427  2888 fcntl.hpp:30] `os::cloexec` has been called, but is a no-op on
Windows
W1201 13:03:52.945427  2888 fcntl.hpp:82] `os::isNonblock` has been called, but is a stub
on Windows
W1201 13:03:52.947448  3156 fcntl.hpp:82] `os::isNonblock` has been called, but is a stub
on Windows
W1201 13:03:52.950419  2888 fcntl.hpp:82] `os::isNonblock` has been called, but is a stub
on Windows
W1201 13:03:52.962419  4200 fcntl.hpp:30] `os::cloexec` has been called, but is a no-op on
Windows
W1201 13:03:52.962419  2888 fcntl.hpp:30] `os::cloexec` has been called, but is a no-op on
Windows
W1201 13:03:52.963414  2888 fcntl.hpp:82] `os::isNonblock` has been called, but is a stub
on Windows
W1201 13:03:52.965411  4508 fcntl.hpp:82] `os::isNonblock` has been[       OK ] HttpAuthenticationTest.Basic
(71 ms)
[----------] 6 tests from HttpAuthenticationTest (179 ms total)

[----------] 2 tests from HttpServeTest
[ RUN      ] HttpServeTest.Pipelining
F:\jenkins\jenkins-slave\workspace\Mesos-Windows\3rdparty\libprocess\src\tests\http_tests.cpp(1788):
error: (connect).failure(): Failed to connect to 0.0.0.0:57973: The requested address is not
valid in its context.


[  FAILED  ] HttpServeTest.Pipelining (5 ms)
[ RUN      ] HttpServeTest.Discard
F:\jenkins\jenkins-slave\workspace\Mesos-Windows\3rdparty\libprocess\src\tests\http_tests.cpp(1883):
error: (connect).failure(): Failed to connect to 0.0.0.0:57975: The requested address is not
valid in its context.


[  FAILED  ] HttpServeTest.Discard (3 ms)
[----------] 2 tests from HttpServeTest (8 ms total)

[----------] 4 tests from LoopTest
[ RUN      ] LoopTest.Sync
[       OK ] LoopTest.Sync (1 ms)
[ RUN      ] LoopTest.Async
[       OK ] LoopTest.Async (3 ms)
[ RUN      ] LoopTest.DiscardIterate
[       OK ] LoopTest.DiscardIterate (1 ms)
[ RUN      ] LoopTest.DiscardBody
[       OK ] LoopTest.DiscardBody (2 ms)
[----------] 4 tests from LoopTest (7 ms total)

[----------] 5 tests from MetricsTest
[ RUN      ] MetricsTest.Counter
[       OK ] MetricsTest.Counter (5 ms)
[ RUN      ] MetricsTest.Statistics
[       OK ] MetricsTest.Statistics (2 ms)
[ RUN      ] MetricsTest.SnapshotStatistics
[       OK ] MetricsTest.SnapshotStatistics (29 ms)
[ RUN      ] MetricsTest.Timer
[       OK ] MetricsTest.Timer (1 ms)
[ RUN      ] MetricsTest.AsyncTimer
[       OK ] MetricsTest.AsyncTimer (2 ms)
[----------] 5 tests from MetricsTest (40 ms total)

[----------] 3 tests from MutexTest
[ RUN      ] MutexTest.Lock
[       OK ] MutexTest.Lock (0 ms)
[ RUN      ] MutexTest.Block
[       OK ] MutexTest.Block (0 ms)
[ RUN      ] MutexTest.Queue
[       OK ] MutexTest.Queue (0 ms)
[----------] 3 tests from MutexTest (1 ms total)

[----------] 4 tests from OwnedTest
[ RUN      ] OwnedTest.Access
[       OK ] OwnedTest.Access (0 ms)
[ RUN      ] OwnedTest.Null
[       OK ] OwnedTest.Null (0 ms)
[ RUN      ] OwnedTest.Share
[       OK ] OwnedTest.Share (0 ms)
[ RUN      ] OwnedTest.Release
[       OK ] OwnedTest.Release (0 ms)
[----------] 4 tests from OwnedTest (1 ms total)

[----------] 4 tests from ProcessTest
[ RUN      ] ProcessTest.Event
[       OK ] ProcessTest.Event (0 ms)
[ RUN      ] ProcessTest.Exited
[       OK ] ProcessTest.Exited (3 ms)
[ RUN      ] ProcessTest.InjectExited
[       OK ] ProcessTest.InjectExited (2 ms)
[ RUN      ] ProcessTest.PercentEncodedURLs
[       OK ] ProcessTest.PercentEncodedURLs (26 ms)
[----------] 4 tests from ProcessTest (32 ms total)

[----------] 3 tests from QueueTest
[ RUN      ] QueueTest.Block
[       OK ] QueueTest.Block (0 ms)
[ RUN      ] QueueTest.Noblock
[       OK ] QueueTest.Noblock (1 ms)
[ RUN      ] QueueTest.Queue
[       OK ] QueueTest.Queue (0 ms)
[----------] 3 tests from QueueTest (1 ms total)

[----------] 4 tests from SequenceTest
[ RUN      ] SequenceTest.Serialize
[       OK ] SequenceTest.Serialize (5 ms)
[ RUN      ] SequenceTest.DiscardOne
[       OK ] SequenceTest.DiscardOne (5 ms)
[ RUN      ] SequenceTest.DiscardAll
[       OK ] SequenceTest.DiscardAll (5 ms)
[ RUN      ] SequenceTest.Random
[       OK ] SequenceTest.Random (33 ms)
[----------] 4 tests from SequenceTest (49 ms total)

[----------] 4 tests from SharedTest
[ RUN      ] SharedTest.ConstAccess
[       OK ] SharedTest.ConstAccess (0 ms)
[ RUN      ] SharedTest.Null
[       OK ] SharedTest.Null (0 ms)
[ RUN      ] SharedTest.Reset
[       OK ] SharedTest.Reset (1 ms)
[ RUN      ] SharedTest.Own
[       OK ] SharedTest.Own (1 ms)
[----------] 4 tests from SharedTest (2 ms total)

[----------] 3 tests from StatisticsTest
[ RUN      ] StatisticsTest.Empty
[       OK ] StatisticsTest.Empty (0 ms)
[ RUN      ] StatisticsTest.Single
[       OK ] StatisticsTest.Single (0 ms)
[ RUN      ] StatisticsTest.Statistics
[       OK ] StatisticsTest.Statistics (1 ms)
[----------] 3 tests from StatisticsTest (2 ms total)

[----------] 3 tests from SubprocessTest
[ RUN      ] SubprocessTest.PipeOutputToFileDescriptor
[       OK ] SubprocessTest.PipeOutputToFileDescriptor (19 ms)
[ RUN      ] SubprocessTest.PipeOutputToPath
[       OK ] SubprocessTest.PipeOutputToPath (21 ms)
[ RUN      ] SubprocessTest.EnvironmentEcho
[       OK ] SubprocessTest.EnvironmentEcho (13 ms)
[----------] 3 tests from SubprocessTest (53 ms total)

[----------] 4 tests from TimeTest
[ RUN      ] TimeTest.Arithmetic
[       OK ] TimeTest.Arithmetic (0 ms)
[ RUN      ] TimeTest.RFC1123Output
[       OK ] TimeTest.RFC1123Output (0 ms)
[ RUN      ] TimeTest.RFC3339Output
[       OK ] TimeTest.RFC3339Output (1 ms)
[ RUN      ] TimeTest.Output
[       OK ] TimeTest.Output (0 ms)
[----------] 4 tests from TimeTest (1 ms total)

[----------] 3 tests from TimeSeriesTest
[ RUN      ] TimeSeriesTest.Set
[       OK ] TimeSeriesTest.Set (1 ms)
[ RUN      ] TimeSeriesTest.Sparsify
[       OK ] TimeSeriesTest.Sparsify (1 ms)
[ RUN      ] TimeSeriesTest.Truncate
[       OK ] TimeSeriesTest.Truncate (3 ms)
[----------] 3 tests from TimeSeriesTest (5 ms total)

[----------] Global test environment tear-down
[==========] 109 tests from 24 test cases ran. (906 ms total)
[  PASSED  ] 107 tests.
[  FAILED  ] 2 tests, listed below:
[  FAILED  ] HttpServeTest.Pipelining
[  FAILED  ] HttpServeTest.Discard

 2 FAILED TESTS
  YOU HAVE 44 DISABLED TESTS

 called, but is a stub on Windows
W1201 13:03:52.968411  2888 fcntl.hpp:82] `os::isNonblock` has been called, but is a stub
on Windows
W1201 13:03:52.978423  4200 fcntl.hpp:30] `os::cloexec` has been called, but is a no-op on
Windows
W1201 13:03:52.978423  2888 fcntl.hpp:30] `os::cloexec` has been called, but is a no-op on
Windows
W1201 13:03:52.979418  2888 fcntl.hpp:82] `os::isNonblock` has been called, but is a stub
on Windows
W1201 13:03:52.980418  4980 fcntl.hpp:82] `os::isNonblock` has been called, but is a stub
on Windows
W1201 13:03:52.984427  2888 fcntl.hpp:82] `os::isNonblock` has been called, but is a stub
on Windows
W1201 13:03:52.995421  4200 fcntl.hpp:30] `os::cloexec` has been called, but is a no-op on
Windows
W1201 13:03:52.995421  2888 fcntl.hpp:30] `os::cloexec` has been called, but is a no-op on
Windows
W1201 13:03:52.996417  2888 fcntl.hpp:82] `os::isNonblock` has been called, but is a stub
on Windows
W1201 13:03:52.997417  3164 fcntl.hpp:82] `os::isNonblock` has been called, but is a stub
on Windows
W1201 13:03:53.000427  2888 fcntl.hpp:82] `os::isNonblock` has been called, but is a stub
on Windows
W1201 13:03:53.014418  4200 fcntl.hpp:30] `os::cloexec` has been called, but is a no-op on
Windows
W1201 13:03:53.015420  4200 fcntl.hpp:30] `os::cloexec` has been called, but is a no-op on
Windows
W1201 13:03:53.018421  4200 fcntl.hpp:30] `os::cloexec` has been called, but is a no-op on
Windows
W1201 13:03:53.019412  4200 fcntl.hpp:30] `os::cloexec` has been called, but is a no-op on
Windows
W1201 13:03:53.038417  4200 fcntl.hpp:30] `os::cloexec` has been called, but is a no-op on
Windows
W1201 13:03:53.039419  2888 fcntl.hpp:30] `os::cloexec` has been called, but is a no-op on
Windows
W1201 13:03:53.040422  2888 fcntl.hpp:82] `os::isNonblock` has been called, but is a stub
on Windows
W1201 13:03:53.041409  2864 fcntl.hpp:82] `os::isNonblock` has been called, but is a stub
on Windows
W1201 13:03:53.044414  2888 fcntl.hpp:82] `os::isNonblock` has been called, but is a stub
on Windows
W1201 13:03:53.077422  4200 fcntl.hpp:30] `os::cloexec` has been called, but is a no-op on
Windows
W1201 13:03:53.077422  2888 fcntl.hpp:30] `os::cloexec` has been called, but is a no-op on
Windows
W1201 13:03:53.078429  2888 fcntl.hpp:82] `os::isNonblock` has been called, but is a stub
on Windows
W1201 13:03:53.079429  4508 fcntl.hpp:82] `os::isNonblock` has been called, but is a stub
on Windows
W1201 13:03:53.083416  2888 fcntl.hpp:82] `os::isNonblock` has been called, but is a stub
on Windows
W1201 13:03:53.087427  4200 fcntl.hpp:30] `os::cloexec` has been called, but is a no-op on
Windows
W1201 13:03:53.088429  2888 fcntl.hpp:30] `os::cloexec` has been called, but is a no-op on
Windows
W1201 13:03:53.088429  2888 fcntl.hpp:82] `os::isNonblock` has been called, but is a stub
on Windows
W1201 13:03:53.090430  3940 fcntl.hpp:82] `os::isNonblock` has been called, but is a stub
on Windows
W1201 13:03:53.092417  2888 fcntl.hpp:82] `os::isNonblock` has been called, but is a stub
on Windows

<https://builds.apache.org/job/Mesos-Windows/ws/build>if> 1 NEQ 0 exit /b 1 
Build step 'Execute Windows batch command' marked build as failure

Mime
View raw message