mesos-builds mailing list archives

Site index · List index
Message view « Date » · « Thread »
Top « Date » · « Thread »
From Apache Jenkins Server <jenk...@builds.apache.org>
Subject Build failed in Jenkins: Mesos » cmake,clang,--verbose,GLOG_v=1 MESOS_VERBOSE=1,ubuntu:14.04,(docker||Hadoop)&&(!ubuntu-us1)&&(!ubuntu-6)&&(!ubuntu-eu2) #3031
Date Mon, 12 Dec 2016 01:16:53 GMT
See <https://builds.apache.org/job/Mesos/BUILDTOOL=cmake,COMPILER=clang,CONFIGURATION=--verbose,ENVIRONMENT=GLOG_v=1%20MESOS_VERBOSE=1,OS=ubuntu%3A14.04,label_exp=(docker%7C%7CHadoop)&&(!ubuntu-us1)&&(!ubuntu-6)&&(!ubuntu-eu2)/3031/changes>

Changes:

[vinodkone] Cleaned up expectations in api_tests.cpp.

[vinodkone] Added new test for LAUNCH_NESTED_CONTAINER_SESSION.

[vinodkone] Added a TTY test for LAUNCH_NESTED_CONTAINER_SESSION.

[vinodkone] Removed the TODO in AgentAPITest.AttachContainerOutputFailure test.

[vinodkone] Added AgentAPITest.LaunchNestedContainerSessionDisconnected.

------------------------------------------
[...truncated 161592 lines...]
I1212 01:15:21.000516 24735 slave.cpp:791] Agent terminating
I1212 01:15:21.000614 24731 master.cpp:1258] Agent 2f5996d8-45c1-41dd-8496-aed8b162e570-S0
at slave(665)@172.17.0.2:43349 (21d2aa32d5b7) disconnected
I1212 01:15:21.000653 24731 master.cpp:2977] Disconnecting agent 2f5996d8-45c1-41dd-8496-aed8b162e570-S0
at slave(665)@172.17.0.2:43349 (21d2aa32d5b7)
I1212 01:15:21.000680 24731 master.cpp:2996] Deactivating agent 2f5996d8-45c1-41dd-8496-aed8b162e570-S0
at slave(665)@172.17.0.2:43349 (21d2aa32d5b7)
I1212 01:15:21.000766 24736 hierarchical.cpp:589] Agent 2f5996d8-45c1-41dd-8496-aed8b162e570-S0
deactivated
I1212 01:15:21.002102 24733 master.cpp:1097] Master terminating
I1212 01:15:21.002424 24738 hierarchical.cpp:522] Removed agent 2f5996d8-45c1-41dd-8496-aed8b162e570-S0
W1212 01:15:21.002717 24722 master.hpp:2531] Failed to close HTTP pipe for 2f5996d8-45c1-41dd-8496-aed8b162e570-0000
(default)
I1212 01:15:21.009341 24722 containerizer.cpp:220] Using isolation: posix/cpu,posix/mem,filesystem/posix,network/cni
W1212 01:15:21.009821 24722 backend.cpp:76] Failed to create 'aufs' backend: AufsBackend requires
root privileges, but is running as user mesos
W1212 01:15:21.009965 24722 backend.cpp:76] Failed to create 'bind' backend: BindBackend requires
root privileges
I1212 01:15:21.011157 24728 slave.cpp:209] Mesos agent started on (666)@172.17.0.2:43349
I1212 01:15:21.011183 24728 slave.cpp:210] Flags at startup: --acls="" --appc_simple_discovery_uri_prefix="http://"
--appc_store_dir="/tmp/mesos/store/appc" --authenticate_http_readonly="true" --authenticate_http_readwrite="true"
--authenticatee="crammd5" --authentication_backoff_factor="1secs" --authorizer="local" --cgroups_cpu_enable_pids_and_tids_count="false"
--cgroups_enable_cfs="false" --cgroups_hierarchy="/sys/fs/cgroup" --cgroups_limit_swap="false"
--cgroups_root="mesos" --container_disk_watch_interval="15secs" --containerizers="mesos" --credential="/tmp/Endpoint_SlaveEndpointTest_AuthorizedRequest_0_dhHyUL/credential"
--default_role="*" --disk_watch_interval="1mins" --docker="docker" --docker_kill_orphans="true"
--docker_registry="https://registry-1.docker.io" --docker_remove_delay="6hrs" --docker_socket="/var/run/docker.sock"
--docker_stop_timeout="0ns" --docker_store_dir="/tmp/mesos/store/docker" --docker_volume_checkpoint_dir="/var/run/mesos/isolators/docker/volume"
--enforce_container_disk_quota="false" --executor_registration_timeout="1mins" --executor_shutdown_grace_period="5secs"
--fetcher_cache_dir="/tmp/Endpoint_SlaveEndpointTest_AuthorizedRequest_0_dhHyUL/fetch" --fetcher_cache_size="2GB"
--frameworks_home="" --gc_delay="1weeks" --gc_disk_headroom="0.1" --hadoop_home="" --help="false"
--hostname_lookup="true" --http_authenticators="basic" --http_command_executor="false" --http_credentials="/tmp/Endpoint_SlaveEndpointTest_AuthorizedRequest_0_dhHyUL/http_credentials"
--image_provisioner_backend="copy" --initialize_driver_logging="true" --io_switchboard_enable_server="true"
--isolation="posix/cpu,posix/mem" --launcher="posix" --launcher_dir="/mesos/build/src" --logbufsecs="0"
--logging_level="INFO" --max_completed_executors_per_framework="150" --oversubscribed_resources_interval="15secs"
--perf_duration="10secs" --perf_interval="1mins" --qos_correction_interval_min="0ns" --quiet="false"
--recover="reconnect" --recovery_timeout="15mins" --registration_backoff_factor="10ms" --resources="cpus:2;gpus:0;mem:1024;disk:1024;ports:[31000-32000]"
--revocable_cpu_low_priority="true" --runtime_dir="/tmp/Endpoint_SlaveEndpointTest_AuthorizedRequest_0_dhHyUL"
--sandbox_directory="/mnt/mesos/sandbox" --strict="true" --switch_user="true" --systemd_enable_support="true"
--systemd_runtime_directory="/run/systemd/system" --version="false" --work_dir="/tmp/Endpoint_SlaveEndpointTest_AuthorizedRequest_0_dZ7IeC"
I1212 01:15:21.011482 24728 credentials.hpp:86] Loading credential for authentication from
'/tmp/Endpoint_SlaveEndpointTest_AuthorizedRequest_0_dhHyUL/credential'
I1212 01:15:21.011569 24728 slave.cpp:347] Agent using credential for: test-principal
I1212 01:15:21.011577 24728 credentials.hpp:37] Loading credentials for authentication from
'/tmp/Endpoint_SlaveEndpointTest_AuthorizedRequest_0_dhHyUL/http_credentials'
I1212 01:15:21.011664 24728 http.cpp:922] Using default 'basic' HTTP authenticator for realm
'mesos-agent-readonly'
I1212 01:15:21.011709 24728 http.cpp:922] Using default 'basic' HTTP authenticator for realm
'mesos-agent-readwrite'
I1212 01:15:21.012049 24728 slave.cpp:534] Agent resources: cpus(*):2; mem(*):1024; disk(*):1024;
ports(*):[31000-32000]
I1212 01:15:21.012081 24728 slave.cpp:542] Agent attributes: [  ]
I1212 01:15:21.012085 24728 slave.cpp:547] Agent hostname: 21d2aa32d5b7
I1212 01:15:21.012503 24723 state.cpp:57] Recovering state from '/tmp/Endpoint_SlaveEndpointTest_AuthorizedRequest_0_dZ7IeC/meta'
I1212 01:15:21.012677 24730 status_update_manager.cpp:203] Recovering status update manager
I1212 01:15:21.012858 24727 containerizer.cpp:594] Recovering containerizer
I1212 01:15:21.013648 24726 provisioner.cpp:253] Provisioner recovery complete
I1212 01:15:21.013875 24733 slave.cpp:5415] Finished recovery
I1212 01:15:21.014348 24733 slave.cpp:5589] Querying resource estimator for oversubscribable
resources
I1212 01:15:21.014482 24726 slave.cpp:5603] Received oversubscribable resources {} from the
resource estimator
I1212 01:15:21.015192 24729 process.cpp:3679] Handling HTTP event for process 'slave(666)'
with path: '/slave(666)/monitor/statistics'
I1212 01:15:21.015583 24728 http.cpp:874] Authorizing principal 'test-principal' to GET the
'/monitor/statistics' endpoint
I1212 01:15:21.016904 24724 slave.cpp:791] Agent terminating
I1212 01:15:21.022179 24722 containerizer.cpp:220] Using isolation: posix/cpu,posix/mem,filesystem/posix,network/cni
W1212 01:15:21.022542 24722 backend.cpp:76] Failed to create 'aufs' backend: AufsBackend requires
root privileges, but is running as user mesos
W1212 01:15:21.022620 24722 backend.cpp:76] Failed to create 'bind' backend: BindBackend requires
root privileges
I1212 01:15:21.023833 24735 slave.cpp:209] Mesos agent started on (667)@172.17.0.2:43349
I1212 01:15:21.023893 24735 slave.cpp:210] Flags at startup: --acls="" --appc_simple_discovery_uri_prefix="http://"
--appc_store_dir="/tmp/mesos/store/appc" --authenticate_http_readonly="true" --authenticate_http_readwrite="true"
--authenticatee="crammd5" --authentication_backoff_factor="1secs" --authorizer="local" --cgroups_cpu_enable_pids_and_tids_count="false"
--cgroups_enable_cfs="false" --cgroups_hierarchy="/sys/fs/cgroup" --cgroups_limit_swap="false"
--cgroups_root="mesos" --container_disk_watch_interval="15secs" --containerizers="mesos" --credential="/tmp/Endpoint_SlaveEndpointTest_AuthorizedRequest_1_ozpeJo/credential"
--default_role="*" --disk_watch_interval="1mins" --docker="docker" --docker_kill_orphans="true"
--docker_registry="https://registry-1.docker.io" --docker_remove_delay="6hrs" --docker_socket="/var/run/docker.sock"
--docker_stop_timeout="0ns" --docker_store_dir="/tmp/mesos/store/docker" --docker_volume_checkpoint_dir="/var/run/mesos/isolators/docker/volume"
--enforce_container_disk_quota="false" --executor_registration_timeout="1mins" --executor_shutdown_grace_period="5secs"
--fetcher_cache_dir="/tmp/Endpoint_SlaveEndpointTest_AuthorizedRequest_1_ozpeJo/fetch" --fetcher_cache_size="2GB"
--frameworks_home="" --gc_delay="1weeks" --gc_disk_headroom="0.1" --hadoop_home="" --help="false"
--hostname_lookup="true" --http_authenticators="basic" --http_command_executor="false" --http_credentials="/tmp/Endpoint_SlaveEndpointTest_AuthorizedRequest_1_ozpeJo/http_credentials"
--image_provisioner_backend="copy" --initialize_driver_logging="true" --io_switchboard_enable_server="true"
--isolation="posix/cpu,posix/mem" --launcher="posix" --launcher_dir="/mesos/build/src" --logbufsecs="0"
--logging_level="INFO" --max_completed_executors_per_framework="150" --oversubscribed_resources_interval="15secs"
--perf_duration="10secs" --perf_interval="1mins" --qos_correction_interval_min="0ns" --quiet="false"
--recover="reconnect" --recovery_timeout="15mins" --registration_backoff_factor="10ms" --resources="cpus:2;gpus:0;mem:1024;disk:1024;ports:[31000-32000]"
--revocable_cpu_low_priority="true" --runtime_dir="/tmp/Endpoint_SlaveEndpointTest_AuthorizedRequest_1_ozpeJo"
--sandbox_directory="/mnt/mesos/sandbox" --strict="true" --switch_user="true" --systemd_enable_support="true"
--systemd_runtime_directory="/run/systemd/system" --version="false" --work_dir="/tmp/Endpoint_SlaveEndpointTest_AuthorizedRequest_1_oR0e1e"
I1212 01:15:21.024333 24735 credentials.hpp:86] Loading credential for authentication from
'/tmp/Endpoint_SlaveEndpointTest_AuthorizedRequest_1_ozpeJo/credential'
I1212 01:15:21.024436 24735 slave.cpp:347] Agent using credential for: test-principal
I1212 01:15:21.024449 24735 credentials.hpp:37] Loading credentials for authentication from
'/tmp/Endpoint_SlaveEndpointTest_AuthorizedRequest_1_ozpeJo/http_credentials'
I1212 01:15:21.024541 24735 http.cpp:922] Using default 'basic' HTTP authenticator for realm
'mesos-agent-readonly'
I1212 01:15:21.024591 24735 http.cpp:922] Using default 'basic' HTTP authenticator for realm
'mesos-agent-readwrite'
I1212 01:15:21.025063 24735 slave.cpp:534] Agent resources: cpus(*):2; mem(*):1024; disk(*):1024;
ports(*):[31000-32000]
I1212 01:15:21.025099 24735 slave.cpp:542] Agent attributes: [  ]
I1212 01:15:21.025105 24735 slave.cpp:547] Agent hostname: 21d2aa32d5b7
I1212 01:15:21.025466 24733 state.cpp:57] Recovering state from '/tmp/Endpoint_SlaveEndpointTest_AuthorizedRequest_1_oR0e1e/meta'
I1212 01:15:21.025661 24736 status_update_manager.cpp:203] Recovering status update manager
I1212 01:15:21.025764 24735 containerizer.cpp:594] Recovering containerizer
I1212 01:15:21.026343 24723 provisioner.cpp:253] Provisioner recovery complete
I1212 01:15:21.026554 24732 slave.cpp:5415] Finished recovery
I1212 01:15:21.027001 24732 slave.cpp:5589] Querying resource estimator for oversubscribable
resources
I1212 01:15:21.027189 24725 slave.cpp:5603] Received oversubscribable resources {} from the
resource estimator
I1212 01:15:21.027899 24736 process.cpp:3679] Handling HTTP event for process 'slave(667)'
with path: '/slave(667)/monitor/statistics.json'
I1212 01:15:21.028437 24726 http.cpp:874] Authorizing principal 'test-principal' to GET the
'/monitor/statistics.json' endpoint
I1212 01:15:21.029960 24722 slave.cpp:791] Agent terminating
I1212 01:15:21.035341 24722 containerizer.cpp:220] Using isolation: posix/cpu,posix/mem,filesystem/posix,network/cni
W1212 01:15:21.035712 24722 backend.cpp:76] Failed to create 'aufs' backend: AufsBackend requires
root privileges, but is running as user mesos
W1212 01:15:21.035811 24722 backend.cpp:76] Failed to create 'bind' backend: BindBackend requires
root privileges
I1212 01:15:21.037083 24723 slave.cpp:209] Mesos agent started on (668)@172.17.0.2:43349
I1212 01:15:21.037117 24723 slave.cpp:210] Flags at startup: --acls="" --appc_simple_discovery_uri_prefix="http://"
--appc_store_dir="/tmp/mesos/store/appc" --authenticate_http_readonly="true" --authenticate_http_readwrite="true"
--authenticatee="crammd5" --authentication_backoff_factor="1secs" --authorizer="local" --cgroups_cpu_enable_pids_and_tids_count="false"
--cgroups_enable_cfs="false" --cgroups_hierarchy="/sys/fs/cgroup" --cgroups_limit_swap="false"
--cgroups_root="mesos" --container_disk_watch_interval="15secs" --containerizers="mesos" --credential="/tmp/Endpoint_SlaveEndpointTest_AuthorizedRequest_2_XmntG1/credential"
--default_role="*" --disk_watch_interval="1mins" --docker="docker" --docker_kill_orphans="true"
--docker_registry="https://registry-1.docker.io" --docker_remove_delay="6hrs" --docker_socket="/var/run/docker.sock"
--docker_stop_timeout="0ns" --docker_store_dir="/tmp/mesos/store/docker" --docker_volume_checkpoint_dir="/var/run/mesos/isolators/docker/volume"
--enforce_container_disk_quota="false" --executor_registration_timeout="1mins" --executor_shutdown_grace_period="5secs"
--fetcher_cache_dir="/tmp/Endpoint_SlaveEndpointTest_AuthorizedRequest_2_XmntG1/fetch" --fetcher_cache_size="2GB"
--frameworks_home="" --gc_delay="1weeks" --gc_disk_headroom="0.1" --hadoop_home="" --help="false"
--hostname_lookup="true" --http_authenticators="basic" --http_command_executor="false" --http_credentials="/tmp/Endpoint_SlaveEndpointTest_AuthorizedRequest_2_XmntG1/http_credentials"
--image_provisioner_backend="copy" --initialize_driver_logging="true" --io_switchboard_enable_server="true"
--isolation="posix/cpu,posix/mem" --launcher="posix" --launcher_dir="/mesos/build/src" --logbufsecs="0"
--logging_level="INFO" --max_completed_executors_per_framework="150" --oversubscribed_resources_interval="15secs"
--perf_duration="10secs" --perf_interval="1mins" --qos_correction_interval_min="0ns" --quiet="false"
--recover="reconnect" --recovery_timeout="15mins" --registration_backoff_factor="10ms" --resources="cpus:2;gpus:0;mem:1024;disk:1024;ports:[31000-32000]"
--revocable_cpu_low_priority="true" --runtime_dir="/tmp/Endpoint_SlaveEndpointTest_AuthorizedRequest_2_XmntG1"
--sandbox_directory="/mnt/mesos/sandbox" --strict="true" --switch_user="true" --systemd_enable_support="true"
--systemd_runtime_directory="/run/systemd/system" --version="false" --work_dir="/tmp/Endpoint_SlaveEndpointTest_AuthorizedRequest_2_vSgkWR"
I1212 01:15:21.037509 24723 credentials.hpp:86] Loading credential for authentication from
'/tmp/Endpoint_SlaveEndpointTest_AuthorizedRequest_2_XmntG1/credential'
I1212 01:15:21.037613 24723 slave.cpp:347] Agent using credential for: test-principal
I1212 01:15:21.037627 24723 credentials.hpp:37] Loading credentials for authentication from
'/tmp/Endpoint_SlaveEndpointTest_AuthorizedRequest_2_XmntG1/http_credentials'
I1212 01:15:21.037739 24723 http.cpp:922] Using default 'basic' HTTP authenticator for realm
'mesos-agent-readonly'
I1212 01:15:21.037791 24723 http.cpp:922] Using default 'basic' HTTP authenticator for realm
'mesos-agent-readwrite'
I1212 01:15:21.038132 24723 slave.cpp:534] Agent resources: cpus(*):2; mem(*):1024; disk(*):1024;
ports(*):[31000-32000]
I1212 01:15:21.038172 24723 slave.cpp:542] Agent attributes: [  ]
I1212 01:15:21.038178 24723 slave.cpp:547] Agent hostname: 21d2aa32d5b7
I1212 01:15:21.038599 24731 state.cpp:57] Recovering state from '/tmp/Endpoint_SlaveEndpointTest_AuthorizedRequest_2_vSgkWR/meta'
I1212 01:15:21.038827 24728 status_update_manager.cpp:203] Recovering status update manager
I1212 01:15:21.038944 24733 containerizer.cpp:594] Recovering containerizer
I1212 01:15:21.039716 24730 provisioner.cpp:253] Provisioner recovery complete
I1212 01:15:21.039935 24738 slave.cpp:5415] Finished recovery
I1212 01:15:21.040385 24738 slave.cpp:5589] Querying resource estimator for oversubscribable
resources
I1212 01:15:21.040565 24737 slave.cpp:5603] Received oversubscribable resources {} from the
resource estimator
I1212 01:15:21.041210 24725 process.cpp:3679] Handling HTTP event for process 'slave(668)'
with path: '/slave(668)/containers'
I1212 01:15:21.041735 24728 http.cpp:874] Authorizing principal 'test-principal' to GET the
'/containers' endpoint
I1212 01:15:21.043241 24735 slave.cpp:791] Agent terminating
I1212 01:15:21.048790 24722 containerizer.cpp:220] Using isolation: posix/cpu,posix/mem,filesystem/posix,network/cni
W1212 01:15:21.049151 24722 backend.cpp:76] Failed to create 'aufs' backend: AufsBackend requires
root privileges, but is running as user mesos
W1212 01:15:21.049235 24722 backend.cpp:76] Failed to create 'bind' backend: BindBackend requires
root privileges
I1212 01:15:21.050444 24733 slave.cpp:209] Mesos agent started on (669)@172.17.0.2:43349
I1212 01:15:21.050472 24733 slave.cpp:210] Flags at startup: --acls="" --appc_simple_discovery_uri_prefix="http://"
--appc_store_dir="/tmp/mesos/store/appc" --authenticate_http_readonly="true" --authenticate_http_readwrite="true"
--authenticatee="crammd5" --authentication_backoff_factor="1secs" --authorizer="local" --cgroups_cpu_enable_pids_and_tids_count="false"
--cgroups_enable_cfs="false" --cgroups_hierarchy="/sys/fs/cgroup" --cgroups_limit_swap="false"
--cgroups_root="mesos" --container_disk_watch_interval="15secs" --containerizers="mesos" --credential="/tmp/Endpoint_SlaveEndpointTest_UnauthorizedRequest_0_zhEnME/credential"
--default_role="*" --disk_watch_interval="1mins" --docker="docker" --docker_kill_orphans="true"
--docker_registry="https://registry-1.docker.io" --docker_remove_delay="6hrs" --docker_socket="/var/run/docker.sock"
--docker_stop_timeout="0ns" --docker_store_dir="/tmp/mesos/store/docker" --docker_volume_checkpoint_dir="/var/run/mesos/isolators/docker/volume"
--enforce_container_disk_quota="false" --executor_registration_timeout="1mins" --executor_shutdown_grace_period="5secs"
--fetcher_cache_dir="/tmp/Endpoint_SlaveEndpointTest_UnauthorizedRequest_0_zhEnME/fetch" --fetcher_cache_size="2GB"
--frameworks_home="" --gc_delay="1weeks" --gc_disk_headroom="0.1" --hadoop_home="" --help="false"
--hostname_lookup="true" --http_authenticators="basic" --http_command_executor="false" --http_credentials="/tmp/Endpoint_SlaveEndpointTest_UnauthorizedRequest_0_zhEnME/http_credentials"
--image_provisioner_backend="copy" --initialize_driver_logging="true" --io_switchboard_enable_server="true"
--isolation="posix/cpu,posix/mem" --launcher="posix" --launcher_dir="/mesos/build/src" --logbufsecs="0"
--logging_level="INFO" --max_completed_executors_per_framework="150" --oversubscribed_resources_interval="15secs"
--perf_duration="10secs" --perf_interval="1mins" --qos_correction_interval_min="0ns" --quiet="false"
--recover="reconnect" --recovery_timeout="15mins" --registration_backoff_factor="10ms" --resources="cpus:2;gpus:0;mem:1024;disk:1024;ports:[31000-32000]"
--revocable_cpu_low_priority="true" --runtime_dir="/tmp/Endpoint_SlaveEndpointTest_UnauthorizedRequest_0_zhEnME"
--sandbox_directory="/mnt/mesos/sandbox" --strict="true" --switch_user="true" --systemd_enable_support="true"
--systemd_runtime_directory="/run/systemd/system" --version="false" --work_dir="/tmp/Endpoint_SlaveEndpointTest_UnauthorizedRequest_0_nWV3Zu"
I1212 01:15:21.050868 24733 credentials.hpp:86] Loading credential for authentication from
'/tmp/Endpoint_SlaveEndpointTest_UnauthorizedRequest_0_zhEnME/credential'
I1212 01:15:21.050951 24733 slave.cpp:347] Agent using credential for: test-principal
I1212 01:15:21.050966 24733 credentials.hpp:37] Loading credentials for authentication from
'/tmp/Endpoint_SlaveEndpointTest_UnauthorizedRequest_0_zhEnME/http_credentials'
I1212 01:15:21.051071 24733 http.cpp:922] Using default 'basic' HTTP authenticator for realm
'mesos-agent-readonly'
I1212 01:15:21.051118 24733 http.cpp:922] Using default 'basic' HTTP authenticator for realm
'mesos-agent-readwrite'
I1212 01:15:21.051647 24733 slave.cpp:534] Agent resources: cpus(*):2; mem(*):1024; disk(*):1024;
ports(*):[31000-32000]
I1212 01:15:21.051687 24733 slave.cpp:542] Agent attributes: [  ]
I1212 01:15:21.051692 24733 slave.cpp:547] Agent hostname: 21d2aa32d5b7
I1212 01:15:21.052112 24735 state.cpp:57] Recovering state from '/tmp/Endpoint_SlaveEndpointTest_UnauthorizedRequest_0_nWV3Zu/meta'
I1212 01:15:21.052350 24728 status_update_manager.cpp:203] Recovering status update manager
I1212 01:15:21.052515 24733 containerizer.cpp:594] Recovering containerizer
I1212 01:15:21.053207 24730 provisioner.cpp:253] Provisioner recovery complete
I1212 01:15:21.053433 24737 slave.cpp:5415] Finished recovery
I1212 01:15:21.053889 24737 slave.cpp:5589] Querying resource estimator for oversubscribable
resources
I1212 01:15:21.054015 24725 slave.cpp:5603] Received oversubscribable resources {} from the
resource estimator
I1212 01:15:21.054635 24734 process.cpp:3679] Handling HTTP event for process 'slave(669)'
with path: '/slave(669)/monitor/statistics'
I1212 01:15:21.055193 24724 http.cpp:874] Authorizing principal 'test-principal' to GET the
'/monitor/statistics' endpoint
I1212 01:15:21.056454 24736 slave.cpp:791] Agent terminating
I1212 01:15:21.062108 24722 containerizer.cpp:220] Using isolation: posix/cpu,posix/mem,filesystem/posix,network/cni
W1212 01:15:21.062466 24722 backend.cpp:76] Failed to create 'aufs' backend: AufsBackend requires
root privileges, but is running as user mesos
W1212 01:15:21.062559 24722 backend.cpp:76] Failed to create 'bind' backend: BindBackend requires
root privileges
I1212 01:15:21.063819 24736 slave.cpp:209] Mesos agent started on (670)@172.17.0.2:43349
I1212 01:15:21.063854 24736 slave.cpp:210] Flags at startup: --acls="" --appc_simple_discovery_uri_prefix="http://"
--appc_store_dir="/tmp/mesos/store/appc" --authenticate_http_readonly="true" --authenticate_http_readwrite="true"
--authenticatee="crammd5" --authentication_backoff_factor="1secs" --authorizer="local" --cgroups_cpu_enable_pids_and_tids_count="false"
--cgroups_enable_cfs="false" --cgroups_hierarchy="/sys/fs/cgroup" --cgroups_limit_swap="false"
--cgroups_root="mesos" --container_disk_watch_interval="15secs" --containerizers="mesos" --credential="/tmp/Endpoint_SlaveEndpointTest_UnauthorizedRequest_1_gBAY0h/credential"
--default_role="*" --disk_watch_interval="1mins" --docker="docker" --docker_kill_orphans="true"
--docker_registry="https://registry-1.docker.io" --docker_remove_delay="6hrs" --docker_socket="/var/run/docker.sock"
--docker_stop_timeout="0ns" --docker_store_dir="/tmp/mesos/store/docker" --docker_volume_checkpoint_dir="/var/run/mesos/isolators/docker/volume"
--enforce_container_disk_quota="false" --executor_registration_timeout="1mins" --executor_shutdown_grace_period="5secs"
--fetcher_cache_dir="/tmp/Endpoint_SlaveEndpointTest_UnauthorizedRequest_1_gBAY0h/fetch" --fetcher_cache_size="2GB"
--frameworks_home="" --gc_delay="1weeks" --gc_disk_headroom="0.1" --hadoop_home="" --help="false"
--hostname_lookup="true" --http_authenticators="basic" --http_command_executor="false" --http_credentials="/tmp/Endpoint_SlaveEndpointTest_UnauthorizedRequest_1_gBAY0h/http_credentials"
--image_provisioner_backend="copy" --initialize_driver_logging="true" --io_switchboard_enable_server="true"
--isolation="posix/cpu,posix/mem" --launcher="posix" --launcher_dir="/mesos/build/src" --logbufsecs="0"
--logging_level="INFO" --max_completed_executors_per_framework="150" --oversubscribed_resources_interval="15secs"
--perf_duration="10secs" --perf_interval="1mins" --qos_correction_interval_min="0ns" --quiet="false"
--recover="reconnect" --recovery_timeout="15mins" --registration_backoff_factor="10ms" --resources="cpus:2;gpus:0;mem:1024;disk:1024;ports:[31000-32000]"
--revocable_cpu_low_priority="true" --runtime_dir="/tmp/Endpoint_SlaveEndpointTest_UnauthorizedRequest_1_gBAY0h"
--sandbox_directory="/mnt/mesos/sandbox" --strict="true" --switch_user="true" --systemd_enable_support="true"
--systemd_runtime_directory="/run/systemd/system" --version="false" --work_dir="/tmp/Endpoint_SlaveEndpointTest_UnauthorizedRequest_1_gXIuc8"
I1212 01:15:21.064270 24736 credentials.hpp:86] Loading credential for authentication from
'/tmp/Endpoint_SlaveEndpointTest_UnauthorizedRequest_1_gBAY0h/credential'
I1212 01:15:21.064374 24736 slave.cpp:347] Agent using credential for: test-principal
I1212 01:15:21.064388 24736 credentials.hpp:37] Loading credentials for authentication from
'/tmp/Endpoint_SlaveEndpointTest_UnauthorizedRequest_1_gBAY0h/http_credentials'
I1212 01:15:21.064498 24736 http.cpp:922] Using default 'basic' HTTP authenticator for realm
'mesos-agent-readonly'
I1212 01:15:21.064558 24736 http.cpp:922] Using default 'basic' HTTP authenticator for realm
'mesos-agent-readwrite'
I1212 01:15:21.065083 24736 slave.cpp:534] Agent resources: cpus(*):2; mem(*):1024; disk(*):1024;
ports(*):[31000-32000]
I1212 01:15:21.065124 24736 slave.cpp:542] Agent attributes: [  ]
I1212 01:15:21.065127 24736 slave.cpp:547] Agent hostname: 21d2aa32d5b7
I1212 01:15:21.065508 24734 state.cpp:57] Recovering state from '/tmp/Endpoint_SlaveEndpointTest_UnauthorizedRequest_1_gXIuc8/meta'
I1212 01:15:21.065742 24731 status_update_manager.cpp:203] Recovering status update manager
I1212 01:15:21.065824 24731 containerizer.cpp:594] Recovering containerizer
I1212 01:15:21.066320 24733 provisioner.cpp:253] Provisioner recovery complete
I1212 01:15:21.066443 24736 slave.cpp:5415] Finished recovery
I1212 01:15:21.066743 24736 slave.cpp:5589] Querying resource estimator for oversubscribable
resources
I1212 01:15:21.066841 24732 slave.cpp:5603] Received oversubscribable resources {} from the
resource estimator
I1212 01:15:21.067541 24731 process.cpp:3679] Handling HTTP event for process 'slave(670)'
with path: '/slave(670)/monitor/statistics.json'
I1212 01:15:21.067888 24724 http.cpp:874] Authorizing principal 'test-principal' to GET the
'/monitor/statistics.json' endpoint
I1212 01:15:21.069185 24725 slave.cpp:791] Agent terminating
I1212 01:15:21.074753 24722 containerizer.cpp:220] Using isolation: posix/cpu,posix/mem,filesystem/posix,network/cni
W1212 01:15:21.075109 24722 backend.cpp:76] Failed to create 'aufs' backend: AufsBackend requires
root privileges, but is running as user mesos
W1212 01:15:21.075203 24722 backend.cpp:76] Failed to create 'bind' backend: BindBackend requires
root privileges
I1212 01:15:21.076434 24738 slave.cpp:209] Mesos agent started on (671)@172.17.0.2:43349
I1212 01:15:21.076460 24738 slave.cpp:210] Flags at startup: --acls="" --appc_simple_discovery_uri_prefix="http://"
--appc_store_dir="/tmp/mesos/store/appc" --authenticate_http_readonly="true" --authenticate_http_readwrite="true"
--authenticatee="crammd5" --authentication_backoff_factor="1secs" --authorizer="local" --cgroups_cpu_enable_pids_and_tids_count="false"
--cgroups_enable_cfs="false" --cgroups_hierarchy="/sys/fs/cgroup" --cgroups_limit_swap="false"
--cgroups_root="mesos" --container_disk_watch_interval="15secs" --containerizers="mesos" --credential="/tmp/Endpoint_SlaveEndpointTest_UnauthorizedRequest_2_g4UOnV/credential"
--default_role="*" --disk_watch_interval="1mins" --docker="docker" --docker_kill_orphans="true"
--docker_registry="https://registry-1.docker.io" --docker_remove_delay="6hrs" --docker_socket="/var/run/docker.sock"
--docker_stop_timeout="0ns" --docker_store_dir="/tmp/mesos/store/docker" --docker_volume_checkpoint_dir="/var/run/mesos/isolators/docker/volume"
--enforce_container_disk_quota="false" --executor_registration_timeout="1mins" --executor_shutdown_grace_period="5secs"
--fetcher_cache_dir="/tmp/Endpoint_SlaveEndpointTest_UnauthorizedRequest_2_g4UOnV/fetch" --fetcher_cache_size="2GB"
--frameworks_home="" --gc_delay="1weeks" --gc_disk_headroom="0.1" --hadoop_home="" --help="false"
--hostname_lookup="true" --http_authenticators="basic" --http_command_executor="false" --http_credentials="/tmp/Endpoint_SlaveEndpointTest_UnauthorizedRequest_2_g4UOnV/http_credentials"
--image_provisioner_backend="copy" --initialize_driver_logging="true" --io_switchboard_enable_server="true"
--isolation="posix/cpu,posix/mem" --launcher="posix" --launcher_dir="/mesos/build/src" --logbufsecs="0"
--logging_level="INFO" --max_completed_executors_per_framework="150" --oversubscribed_resources_interval="15secs"
--perf_duration="10secs" --perf_interval="1mins" --qos_correction_interval_min="0ns" --quiet="false"
--recover="reconnect" --recovery_timeout="15mins" --registration_backoff_factor="10ms" --resources="cpus:2;gpus:0;mem:1024;disk:1024;ports:[31000-32000]"
--revocable_cpu_low_priority="true" --runtime_dir="/tmp/Endpoint_SlaveEndpointTest_UnauthorizedRequest_2_g4UOnV"
--sandbox_directory="/mnt/mesos/sandbox" --strict="true" --switch_user="true" --systemd_enable_support="true"
--systemd_runtime_directory="/run/systemd/system" --version="false" --work_dir="/tmp/Endpoint_SlaveEndpointTest_UnauthorizedRequest_2_ml6hxL"
I1212 01:15:21.076854 24738 credentials.hpp:86] Loading credential for authentication from
'/tmp/Endpoint_SlaveEndpointTest_UnauthorizedRequest_2_g4UOnV/credential'
I1212 01:15:21.076947 24738 slave.cpp:347] Agent using credential for: test-principal
I1212 01:15:21.076961 24738 credentials.hpp:37] Loading credentials for authentication from
'/tmp/Endpoint_SlaveEndpointTest_UnauthorizedRequest_2_g4UOnV/http_credentials'
I1212 01:15:21.077069 24738 http.cpp:922] Using default 'basic' HTTP authenticator for realm
'mesos-agent-readonly'
I1212 01:15:21.077118 24738 http.cpp:922] Using default 'basic' HTTP authenticator for realm
'mesos-agent-readwrite'
I1212 01:15:21.077607 24738 slave.cpp:534] Agent resources: cpus(*):2; mem(*):1024; disk(*):1024;
ports(*):[31000-32000]
I1212 01:15:21.077646 24738 slave.cpp:542] Agent attributes: [  ]
I1212 01:15:21.077652 24738 slave.cpp:547] Agent hostname: 21d2aa32d5b7
I1212 01:15:21.078131 24728 state.cpp:57] Recovering state from '/tmp/Endpoint_SlaveEndpointTest_UnauthorizedRequest_2_ml6hxL/meta'
I1212 01:15:21.078310 24736 status_update_manager.cpp:203] Recovering status update manager
I1212 01:15:21.078395 24736 containerizer.cpp:594] Recovering containerizer
I1212 01:15:21.078953 24737 provisioner.cpp:253] Provisioner recovery complete
I1212 01:15:21.079147 24726 slave.cpp:5415] Finished recovery
I1212 01:15:21.079628 24726 slave.cpp:5589] Querying resource estimator for oversubscribable
resources
I1212 01:15:21.079741 24725 slave.cpp:5603] Received oversubscribable resources {} from the
resource estimator
I1212 01:15:21.080375 24732 process.cpp:3679] Handling HTTP event for process 'slave(671)'
with path: '/slave(671)/containers'
I1212 01:15:21.080835 24727 http.cpp:874] Authorizing principal 'test-principal' to GET the
'/containers' endpoint
I1212 01:15:21.081954 24738 slave.cpp:791] Agent terminating
I1212 01:15:21.087497 24722 containerizer.cpp:220] Using isolation: posix/cpu,posix/mem,filesystem/posix,network/cni
W1212 01:15:21.087893 24722 backend.cpp:76] Failed to create 'aufs' backend: AufsBackend requires
root privileges, but is running as user mesos
W1212 01:15:21.087980 24722 backend.cpp:76] Failed to create 'bind' backend: BindBackend requires
root privileges
I1212 01:15:21.088618 24722 cluster.cpp:446] Creating default 'local' authorizer
I1212 01:15:21.089169 24725 slave.cpp:209] Mesos agent started on (672)@172.17.0.2:43349
I1212 01:15:21.089200 24725 slave.cpp:210] Flags at startup: --acls="" --appc_simple_discovery_uri_prefix="http://"
--appc_store_dir="/tmp/mesos/store/appc" --authenticate_http_readonly="true" --authenticate_http_readwrite="true"
--authenticatee="crammd5" --authentication_backoff_factor="1secs" --authorizer="local" --cgroups_cpu_enable_pids_and_tids_count="false"
--cgroups_enable_cfs="false" --cgroups_hierarchy="/sys/fs/cgroup" --cgroups_limit_swap="false"
--cgroups_root="mesos" --container_disk_watch_interval="15secs" --containerizers="mesos" --credential="/tmp/Endpoint_SlaveEndpointTest_NoAuthorizer_0_OUARSy/credential"
--default_role="*" --disk_watch_interval="1mins" --docker="docker" --docker_kill_orphans="true"
--docker_registry="https://registry-1.docker.io" --docker_remove_delay="6hrs" --docker_socket="/var/run/docker.sock"
--docker_stop_timeout="0ns" --docker_store_dir="/tmp/mesos/store/docker" --docker_volume_checkpoint_dir="/var/run/mesos/isolators/docker/volume"
--enforce_container_disk_quota="false" --executor_registration_timeout="1mins" --executor_shutdown_grace_period="5secs"
--fetcher_cache_dir="/tmp/Endpoint_SlaveEndpointTest_NoAuthorizer_0_OUARSy/fetch" --fetcher_cache_size="2GB"
--frameworks_home="" --gc_delay="1weeks" --gc_disk_headroom="0.1" --hadoop_home="" --help="false"
--hostname_lookup="true" --http_authenticators="basic" --http_command_executor="false" --http_credentials="/tmp/Endpoint_SlaveEndpointTest_NoAuthorizer_0_OUARSy/http_credentials"
--image_provisioner_backend="copy" --initialize_driver_logging="true" --io_switchboard_enable_server="true"
--isolation="posix/cpu,posix/mem" --launcher="posix" --launcher_dir="/mesos/build/src" --logbufsecs="0"
--logging_level="INFO" --max_completed_executors_per_framework="150" --oversubscribed_resources_interval="15secs"
--perf_duration="10secs" --perf_interval="1mins" --qos_correction_interval_min="0ns" --quiet="false"
--recover="reconnect" --recovery_timeout="15mins" --registration_backoff_factor="10ms" --resources="cpus:2;gpus:0;mem:1024;disk:1024;ports:[31000-32000]"
--revocable_cpu_low_priority="true" --runtime_dir="/tmp/Endpoint_SlaveEndpointTest_NoAuthorizer_0_OUARSy"
--sandbox_directory="/mnt/mesos/sandbox" --strict="true" --switch_user="true" --systemd_enable_support="true"
--systemd_runtime_directory="/run/systemd/system" --version="false" --work_dir="/tmp/Endpoint_SlaveEndpointTest_NoAuthorizer_0_Ogmi0o"
I1212 01:15:21.089731 24725 credentials.hpp:86] Loading credential for authentication from
'/tmp/Endpoint_SlaveEndpointTest_NoAuthorizer_0_OUARSy/credential'
I1212 01:15:21.089838 24725 slave.cpp:347] Agent using credential for: test-principal
I1212 01:15:21.089853 24725 credentials.hpp:37] Loading credentials for authentication from
'/tmp/Endpoint_SlaveEndpointTest_NoAuthorizer_0_OUARSy/http_credentials'
I1212 01:15:21.089963 24725 http.cpp:922] Using default 'basic' HTTP authenticator for realm
'mesos-agent-readonly'
I1212 01:15:21.090019 24725 http.cpp:922] Using default 'basic' HTTP authenticator for realm
'mesos-agent-readwrite'
I1212 01:15:21.090456 24725 slave.cpp:534] Agent resources: cpus(*):2; mem(*):1024; disk(*):1024;
ports(*):[31000-32000]
I1212 01:15:21.090497 24725 slave.cpp:542] Agent attributes: [  ]
I1212 01:15:21.090502 24725 slave.cpp:547] Agent hostname: 21d2aa32d5b7
I1212 01:15:21.090903 24727 state.cpp:57] Recovering state from '/tmp/Endpoint_SlaveEndpointTest_NoAuthorizer_0_Ogmi0o/meta'
I1212 01:15:21.091038 24737 status_update_manager.cpp:203] Recovering status update manager
I1212 01:15:21.091197 24729 containerizer.cpp:594] Recovering containerizer
I1212 01:15:21.091802 24737 provisioner.cpp:253] Provisioner recovery complete
I1212 01:15:21.091995 24729 slave.cpp:5415] Finished recovery
I1212 01:15:21.092393 24729 slave.cpp:5589] Querying resource estimator for oversubscribable
resources
I1212 01:15:21.092545 24726 slave.cpp:5603] Received oversubscribable resources {} from the
resource estimator
I1212 01:15:21.093107 24735 process.cpp:3679] Handling HTTP event for process 'slave(672)'
with path: '/slave(672)/monitor/statistics'
I1212 01:15:21.093540 24732 http.cpp:874] Authorizing principal 'test-principal' to GET the
'/monitor/statistics' endpoint
I1212 01:15:21.094892 24722 slave.cpp:791] Agent terminating
I1212 01:15:21.099975 24722 containerizer.cpp:220] Using isolation: posix/cpu,posix/mem,filesystem/posix,network/cni
W1212 01:15:21.100250 24722 backend.cpp:76] Failed to create 'aufs' backend: AufsBackend requires
root privileges, but is running as user mesos
W1212 01:15:21.100319 24722 backend.cpp:76] Failed to create 'bind' backend: BindBackend requires
root privileges
I1212 01:15:21.101009 24722 cluster.cpp:446] Creating default 'local' authorizer
I1212 01:15:21.101636 24731 slave.cpp:209] Mesos agent started on (673)@172.17.0.2:43349
I1212 01:15:21.101671 24731 slave.cpp:210] Flags at startup: --acls="" --appc_simple_discovery_uri_prefix="http://"
--appc_store_dir="/tmp/mesos/store/appc" --authenticate_http_readonly="true" --authenticate_http_readwrite="true"
--authenticatee="crammd5" --authentication_backoff_factor="1secs" --authorizer="local" --cgroups_cpu_enable_pids_and_tids_count="false"
--cgroups_enable_cfs="false" --cgroups_hierarchy="/sys/fs/cgroup" --cgroups_limit_swap="false"
--cgroups_root="mesos" --container_disk_watch_interval="15secs" --containerizers="mesos" --credential="/tmp/Endpoint_SlaveEndpointTest_NoAuthorizer_1_15Lhwc/credential"
--default_role="*" --disk_watch_interval="1mins" --docker="docker" --docker_kill_orphans="true"
--docker_registry="https://registry-1.docker.io" --docker_remove_delay="6hrs" --docker_socket="/var/run/docker.sock"
--docker_stop_timeout="0ns" --docker_store_dir="/tmp/mesos/store/docker" --docker_volume_checkpoint_dir="/var/run/mesos/isolators/docker/volume"
--enforce_container_disk_quota="false" --executor_registration_timeout="1mins" --executor_shutdown_grace_period="5secs"
--fetcher_cache_dir="/tmp/Endpoint_SlaveEndpointTest_NoAuthorizer_1_15Lhwc/fetch" --fetcher_cache_size="2GB"
--frameworks_home="" --gc_delay="1weeks" --gc_disk_headroom="0.1" --hadoop_home="" --help="false"
--hostname_lookup="true" --http_authenticators="basic" --http_command_executor="false" --http_credentials="/tmp/Endpoint_SlaveEndpointTest_NoAuthorizer_1_15Lhwc/http_credentials"
--image_provisioner_backend="copy" --initialize_driver_logging="true" --io_switchboard_enable_server="true"
--isolation="posix/cpu,posix/mem" --launcher="posix" --launcher_dir="/mesos/build/src" --logbufsecs="0"
--logging_level="INFO" --max_completed_executors_per_framework="150" --oversubscribed_resources_interval="15secs"
--perf_duration="10secs" --perf_interval="1mins" --qos_correction_interval_min="0ns" --quiet="false"
--recover="reconnect" --recovery_timeout="15mins" --registration_backoff_factor="10ms" --resources="cpus:2;gpus:0;mem:1024;disk:1024;ports:[31000-32000]"
--revocable_cpu_low_priority="true" --runtime_dir="/tmp/Endpoint_SlaveEndpointTest_NoAuthorizer_1_15Lhwc"
--sandbox_directory="/mnt/mesos/sandbox" --strict="true" --switch_user="true" --systemd_enable_support="true"
--systemd_runtime_directory="/run/systemd/system" --version="false" --work_dir="/tmp/Endpoint_SlaveEndpointTest_NoAuthorizer_1_78PCB2"
I1212 01:15:21.102037 24731 credentials.hpp:86] Loading credential for authentication from
'/tmp/Endpoint_SlaveEndpointTest_NoAuthorizer_1_15Lhwc/credential'
I1212 01:15:21.102136 24731 slave.cpp:347] Agent using credential for: test-principal
I1212 01:15:21.102151 24731 credentials.hpp:37] Loading credentials for authentication from
'/tmp/Endpoint_SlaveEndpointTest_NoAuthorizer_1_15Lhwc/http_credentials'
I1212 01:15:21.102262 24731 http.cpp:922] Using default 'basic' HTTP authenticator for realm
'mesos-agent-readonly'
I1212 01:15:21.102309 24731 http.cpp:922] Using default 'basic' HTTP authenticator for realm
'mesos-agent-readwrite'
I1212 01:15:21.102727 24731 slave.cpp:534] Agent resources: cpus(*):2; mem(*):1024; disk(*):1024;
ports(*):[31000-32000]
I1212 01:15:21.102767 24731 slave.cpp:542] Agent attributes: [  ]
I1212 01:15:21.102774 24731 slave.cpp:547] Agent hostname: 21d2aa32d5b7
I1212 01:15:21.103178 24738 state.cpp:57] Recovering state from '/tmp/Endpoint_SlaveEndpointTest_NoAuthorizer_1_78PCB2/meta'
I1212 01:15:21.103382 24726 status_update_manager.cpp:203] Recovering status update manager
I1212 01:15:21.103494 24733 containerizer.cpp:594] Recovering containerizer
I1212 01:15:21.104107 24724 provisioner.cpp:253] Provisioner recovery complete
I1212 01:15:21.104377 24738 slave.cpp:5415] Finished recovery
I1212 01:15:21.104794 24738 slave.cpp:5589] Querying resource estimator for oversubscribable
resources
I1212 01:15:21.104918 24736 slave.cpp:5603] Received oversubscribable resources {} from the
resource estimator
I1212 01:15:21.105535 24736 process.cpp:3679] Handling HTTP event for process 'slave(673)'
with path: '/slave(673)/monitor/statistics.json'
I1212 01:15:21.105947 24737 http.cpp:874] Authorizing principal 'test-principal' to GET the
'/monitor/statistics.json' endpoint
I1212 01:15:21.107108 24724 slave.cpp:791] Agent terminating
I1212 01:15:21.112929 24722 containerizer.cpp:220] Using isolation: posix/cpu,posix/mem,filesystem/posix,network/cni
W1212 01:15:21.113288 24722 backend.cpp:76] Failed to create 'aufs' backend: AufsBackend requires
root privileges, but is running as user mesos
W1212 01:15:21.113376 24722 backend.cpp:76] Failed to create 'bind' backend: BindBackend requires
root privileges
I1212 01:15:21.113960 24722 cluster.cpp:446] Creating default 'local' authorizer
I1212 01:15:21.114569 24737 slave.cpp:209] Mesos agent started on (674)@172.17.0.2:43349
I1212 01:15:21.114603 24737 slave.cpp:210] Flags at startup: --acls="" --appc_simple_discovery_uri_prefix="http://"
--appc_store_dir="/tmp/mesos/store/appc" --authenticate_http_readonly="true" --authenticate_http_readwrite="true"
--authenticatee="crammd5" --authentication_backoff_factor="1secs" --authorizer="local" --cgroups_cpu_enable_pids_and_tids_count="false"
--cgroups_enable_cfs="false" --cgroups_hierarchy="/sys/fs/cgroup" --cgroups_limit_swap="false"
--cgroups_root="mesos" --container_disk_watch_interval="15secs" --containerizers="mesos" --credential="/tmp/Endpoint_SlaveEndpointTest_NoAuthorizer_2_jNhRhQ/credential"
--default_role="*" --disk_watch_interval="1mins" --docker="docker" --docker_kill_orphans="true"
--docker_registry="https://registry-1.docker.io" --docker_remove_delay="6hrs" --docker_socket="/var/run/docker.sock"
--docker_stop_timeout="0ns" --docker_store_dir="/tmp/mesos/store/docker" --docker_volume_checkpoint_dir="/var/run/mesos/isolators/docker/volume"
--enforce_container_disk_quota="false" --executor_registration_timeout="1mins" --executor_shutdown_grace_period="5secs"
--fetcher_cache_dir="/tmp/Endpoint_SlaveEndpointTest_NoAuthorizer_2_jNhRhQ/fetch" --fetcher_cache_size="2GB"
--frameworks_home="" --gc_delay="1weeks" --gc_disk_headroom="0.1" --hadoop_home="" --help="false"
--hostname_lookup="true" --http_authenticators="basic" --http_command_executor="false" --http_credentials="/tmp/Endpoint_SlaveEndpointTest_NoAuthorizer_2_jNhRhQ/http_credentials"
--image_provisioner_backend="copy" --initialize_driver_logging="true" --io_switchboard_enable_server="true"
--isolation="posix/cpu,posix/mem" --launcher="posix" --launcher_dir="/mesos/build/src" --logbufsecs="0"
--logging_level="INFO" --max_completed_executors_per_framework="150" --oversubscribed_resources_interval="15secs"
--perf_duration="10secs" --perf_interval="1mins" --qos_correction_interval_min="0ns" --quiet="false"
--recover="reconnect" --recovery_timeout="15mins" --registration_backoff_factor="10ms" --resources="cpus:2;gpus:0;mem:1024;disk:1024;ports:[31000-32000]"
--revocable_cpu_low_priority="true" --runtime_dir="/tmp/Endpoint_SlaveEndpointTest_NoAuthorizer_2_jNhRhQ"
--sandbox_directory="/mnt/mesos/sandbox" --strict="true" --switch_user="true" --systemd_enable_support="true"
--systemd_runtime_directory="/run/systemd/system" --version="false" --work_dir="/tmp/Endpoint_SlaveEndpointTest_NoAuthorizer_2_FER8kG"
I1212 01:15:21.114960 24737 credentials.hpp:86] Loading credential for authentication from
'/tmp/Endpoint_SlaveEndpointTest_NoAuthorizer_2_jNhRhQ/credential'
I1212 01:15:21.115053 24737 slave.cpp:347] Agent using credential for: test-principal
I1212 01:15:21.115063 24737 credentials.hpp:37] Loading credentials for authentication from
'/tmp/Endpoint_SlaveEndpointTest_NoAuthorizer_2_jNhRhQ/http_credentials'
I1212 01:15:21.115144 24737 http.cpp:922] Using default 'basic' HTTP authenticator for realm
'mesos-agent-readonly'
I1212 01:15:21.115209 24737 http.cpp:922] Using default 'basic' HTTP authenticator for realm
'mesos-agent-readwrite'
I1212 01:15:21.115654 24737 slave.cpp:534] Agent resources: cpus(*):2; mem(*):1024; disk(*):1024;
ports(*):[31000-32000]
I1212 01:15:21.115686 24737 slave.cpp:542] Agent attributes: [  ]
I1212 01:15:21.115691 24737 slave.cpp:547] Agent hostname: 21d2aa32d5b7
I1212 01:15:21.116107 24724 state.cpp:57] Recovering state from '/tmp/Endpoint_SlaveEndpointTest_NoAuthorizer_2_FER8kG/meta'
I1212 01:15:21.116246 24727 status_update_manager.cpp:203] Recovering status update manager
I1212 01:15:21.116340 24730 containerizer.cpp:594] Recovering containerizer
I1212 01:15:21.116819 24733 provisioner.cpp:253] Provisioner recovery complete
I1212 01:15:21.116968 24732 slave.cpp:5415] Finished recovery
I1212 01:15:21.117455 24732 slave.cpp:5589] Querying resource estimator for oversubscribable
resources
I1212 01:15:21.117549 24737 slave.cpp:5603] Received oversubscribable resources {} from the
resource estimator
I1212 01:15:21.118326 24730 process.cpp:3679] Handling HTTP event for process 'slave(674)'
with path: '/slave(674)/containers'
I1212 01:15:21.118830 24724 http.cpp:874] Authorizing principal 'test-principal' to GET the
'/containers' endpoint
I1212 01:15:21.120383 24733 slave.cpp:791] Agent terminating
make[3]: *** [CMakeFiles/check] Error 1
make[2]: *** [CMakeFiles/check.dir/all] Error 2
make[1]: *** [CMakeFiles/check.dir/rule] Error 2
make: *** [check] Error 2
+ docker rmi mesos-1481503153-19486
Untagged: mesos-1481503153-19486:latest
Deleted: sha256:e10013eab1f3d16cd65c3978a58f0c2b42a25d6ec09ccab15667a7f7eb8bbd6d
Deleted: sha256:17e8983eb3567d9874dbd160f433385803cda66733405174ea97b5235632b12b
Deleted: sha256:71e8afc606af1ace7b5efb57b3f2d4178468de2fa0a12a86b331b9752060f6c2
Deleted: sha256:85dbec3fb99c03ab0b78ec640c108cc9e6687dd3d05a2b17d694282a985226bc
Deleted: sha256:2e5893f4c0d472027e96f4644de0b0e667b29bf09d77647c1137530ce3d1c9a5
Deleted: sha256:583fc183e0dc590f762e0cb31e883818341d95dd2cfd00a80b70e0ee229103a3
Deleted: sha256:01b1bd36622747d1dd2f277460834cacfd7d362be624eca5f3fc7ceb866fd7b4
Deleted: sha256:e175c9fa02f6e698993aa87eb423f19f362e041648e3c694cd346fa3a2405588
Deleted: sha256:a78a0202d58e9bf88cf9c00918872b580ff852187baf88d62ac84fb2fc18321e
Deleted: sha256:eadafd11b7874786c9cb3f5da78f703bd6261415953fbaef93f18731a4fc6922
Deleted: sha256:e7a29cf76868c196bd670de4ccc55a8081ea4bb02feae113b34110a9ee998a8c
Deleted: sha256:11ff1e4ef58d9b70786864187d40cbb2468c08e39476ce2fdfe4e4dad98cdeee
Deleted: sha256:61f5972db0723bf93fd5432871ae0449fa8326b0b654b89fb5e6707a5339eb80
Deleted: sha256:915dcdda1ea1a721e7fda6868e0b8534e1b41ef66d7824e58f6bcdb45b15656d
Deleted: sha256:7cda07be27b01364d6db7c4fbe12a13ca5c34970359327e69ff7d519acbdfa51
Deleted: sha256:c822bf8ce5e0e72d57956c8f9a58c0fc146458e3d2efbd3844e3db9fa45e1686
Deleted: sha256:046ac2d811b3cea75516666aefff6c6fd25487c97f34f23b3492c426c5af67ba
Deleted: sha256:35effe11451061e02739ed755e027ae26acc9d276a7ec755f39068d3547a3540
Deleted: sha256:5611c54a5345bbc047fb5ce551e306e24632d226ccde51ac16873f4fa324f1b2
Deleted: sha256:dc509d6e0b2c66dc40b82002c1efe6f0670594077f400d0382fae0ffcde3097c
Deleted: sha256:f9715539a1ff181cadd08e82bb710dd2ac727973e6cbcdd7aaef071e32ed7078
Deleted: sha256:063063b30d90ba5f28e663a8515215bbdda4572bc9f39397f94cdd2799edf220
Deleted: sha256:0387ba7c131aae3660c74fe29e0a15ea023abe73004e1633ccc1d07489bfe47e
Deleted: sha256:0d7f517024ba32e993be41f45494d231608f78c16b6e76817267a97b21e399e5
Build step 'Execute shell' marked build as failure

Mime
View raw message