mesos-builds mailing list archives

Site index · List index
Message view « Date » · « Thread »
Top « Date » · « Thread »
From Apache Jenkins Server <jenk...@builds.apache.org>
Subject Build failed in Jenkins: Mesos » cmake,gcc,--verbose,GLOG_v=1 MESOS_VERBOSE=1,ubuntu:14.04,(docker||Hadoop)&&(!ubuntu-us1)&&(!ubuntu-6)&&(!ubuntu-eu2) #3023
Date Fri, 09 Dec 2016 14:46:50 GMT
See <https://builds.apache.org/job/Mesos/BUILDTOOL=cmake,COMPILER=gcc,CONFIGURATION=--verbose,ENVIRONMENT=GLOG_v=1%20MESOS_VERBOSE=1,OS=ubuntu%3A14.04,label_exp=(docker%7C%7CHadoop)&&(!ubuntu-us1)&&(!ubuntu-6)&&(!ubuntu-eu2)/3023/changes>

Changes:

[bmahler] Added implicit role tests for multi-role frameworks.

[toenshoff] Improved equality check in SlaveTest.StateEndpoint.

------------------------------------------
[...truncated 160100 lines...]
I1209 14:45:53.889331 26731 http.cpp:874] Authorizing principal 'test-principal' to GET the
'/monitor/statistics' endpoint
I1209 14:45:53.890607 26729 slave.cpp:790] Agent terminating
[       OK ] Endpoint/SlaveEndpointTest.AuthorizedRequest/0 (13 ms)
[ RUN      ] Endpoint/SlaveEndpointTest.AuthorizedRequest/1
I1209 14:45:53.896268 26729 containerizer.cpp:217] Using isolation: posix/cpu,posix/mem,filesystem/posix,network/cni
W1209 14:45:53.896631 26729 backend.cpp:76] Failed to create 'aufs' backend: AufsBackend requires
root privileges, but is running as user mesos
W1209 14:45:53.896728 26729 backend.cpp:76] Failed to create 'bind' backend: BindBackend requires
root privileges
I1209 14:45:53.897979 26739 slave.cpp:208] Mesos agent started on (659)@172.17.0.2:58228
I1209 14:45:53.897997 26739 slave.cpp:209] Flags at startup: --acls="" --appc_simple_discovery_uri_prefix="http://"
--appc_store_dir="/tmp/mesos/store/appc" --authenticate_http_readonly="true" --authenticate_http_readwrite="true"
--authenticatee="crammd5" --authentication_backoff_factor="1secs" --authorizer="local" --cgroups_cpu_enable_pids_and_tids_count="false"
--cgroups_enable_cfs="false" --cgroups_hierarchy="/sys/fs/cgroup" --cgroups_limit_swap="false"
--cgroups_root="mesos" --container_disk_watch_interval="15secs" --containerizers="mesos" --credential="/tmp/Endpoint_SlaveEndpointTest_AuthorizedRequest_1_8ii6fo/credential"
--default_role="*" --disk_watch_interval="1mins" --docker="docker" --docker_kill_orphans="true"
--docker_registry="https://registry-1.docker.io" --docker_remove_delay="6hrs" --docker_socket="/var/run/docker.sock"
--docker_stop_timeout="0ns" --docker_store_dir="/tmp/mesos/store/docker" --docker_volume_checkpoint_dir="/var/run/mesos/isolators/docker/volume"
--enforce_container_disk_quota="false" --executor_registration_timeout="1mins" --executor_shutdown_grace_period="5secs"
--fetcher_cache_dir="/tmp/Endpoint_SlaveEndpointTest_AuthorizedRequest_1_8ii6fo/fetch" --fetcher_cache_size="2GB"
--frameworks_home="" --gc_delay="1weeks" --gc_disk_headroom="0.1" --hadoop_home="" --help="false"
--hostname_lookup="true" --http_authenticators="basic" --http_command_executor="false" --http_credentials="/tmp/Endpoint_SlaveEndpointTest_AuthorizedRequest_1_8ii6fo/http_credentials"
--image_provisioner_backend="copy" --initialize_driver_logging="true" --io_switchboard_enable_server="true"
--isolation="posix/cpu,posix/mem" --launcher="posix" --launcher_dir="/mesos/build/src" --logbufsecs="0"
--logging_level="INFO" --max_completed_executors_per_framework="150" --oversubscribed_resources_interval="15secs"
--perf_duration="10secs" --perf_interval="1mins" --qos_correction_interval_min="0ns" --quiet="false"
--recover="reconnect" --recovery_timeout="15mins" --registration_backoff_factor="10ms" --resources="cpus:2;gpus:0;mem:1024;disk:1024;ports:[31000-32000]"
--revocable_cpu_low_priority="true" --runtime_dir="/tmp/Endpoint_SlaveEndpointTest_AuthorizedRequest_1_8ii6fo"
--sandbox_directory="/mnt/mesos/sandbox" --strict="true" --switch_user="true" --systemd_enable_support="true"
--systemd_runtime_directory="/run/systemd/system" --version="false" --work_dir="/tmp/Endpoint_SlaveEndpointTest_AuthorizedRequest_1_XVWHy3"
I1209 14:45:53.898406 26739 credentials.hpp:86] Loading credential for authentication from
'/tmp/Endpoint_SlaveEndpointTest_AuthorizedRequest_1_8ii6fo/credential'
I1209 14:45:53.898522 26739 slave.cpp:346] Agent using credential for: test-principal
I1209 14:45:53.898541 26739 credentials.hpp:37] Loading credentials for authentication from
'/tmp/Endpoint_SlaveEndpointTest_AuthorizedRequest_1_8ii6fo/http_credentials'
I1209 14:45:53.898674 26739 http.cpp:922] Using default 'basic' HTTP authenticator for realm
'mesos-agent-readonly'
I1209 14:45:53.898730 26739 http.cpp:922] Using default 'basic' HTTP authenticator for realm
'mesos-agent-readwrite'
I1209 14:45:53.899196 26739 slave.cpp:533] Agent resources: cpus(*):2; mem(*):1024; disk(*):1024;
ports(*):[31000-32000]
I1209 14:45:53.899240 26739 slave.cpp:541] Agent attributes: [  ]
I1209 14:45:53.899250 26739 slave.cpp:546] Agent hostname: c876ce477d08
I1209 14:45:53.899639 26731 state.cpp:57] Recovering state from '/tmp/Endpoint_SlaveEndpointTest_AuthorizedRequest_1_XVWHy3/meta'
I1209 14:45:53.899813 26736 status_update_manager.cpp:203] Recovering status update manager
I1209 14:45:53.900089 26732 containerizer.cpp:591] Recovering containerizer
I1209 14:45:53.900686 26736 provisioner.cpp:253] Provisioner recovery complete
I1209 14:45:53.900853 26736 slave.cpp:5414] Finished recovery
I1209 14:45:53.901262 26736 slave.cpp:5588] Querying resource estimator for oversubscribable
resources
I1209 14:45:53.901473 26732 slave.cpp:5602] Received oversubscribable resources {} from the
resource estimator
I1209 14:45:53.902091 26736 process.cpp:3679] Handling HTTP event for process 'slave(659)'
with path: '/slave(659)/monitor/statistics.json'
I1209 14:45:53.902446 26742 http.cpp:874] Authorizing principal 'test-principal' to GET the
'/monitor/statistics.json' endpoint
I1209 14:45:53.903527 26741 slave.cpp:790] Agent terminating
[       OK ] Endpoint/SlaveEndpointTest.AuthorizedRequest/1 (12 ms)
[ RUN      ] Endpoint/SlaveEndpointTest.AuthorizedRequest/2
I1209 14:45:53.908059 26729 containerizer.cpp:217] Using isolation: posix/cpu,posix/mem,filesystem/posix,network/cni
W1209 14:45:53.908336 26729 backend.cpp:76] Failed to create 'aufs' backend: AufsBackend requires
root privileges, but is running as user mesos
W1209 14:45:53.908404 26729 backend.cpp:76] Failed to create 'bind' backend: BindBackend requires
root privileges
I1209 14:45:53.909723 26744 slave.cpp:208] Mesos agent started on (660)@172.17.0.2:58228
I1209 14:45:53.909744 26744 slave.cpp:209] Flags at startup: --acls="" --appc_simple_discovery_uri_prefix="http://"
--appc_store_dir="/tmp/mesos/store/appc" --authenticate_http_readonly="true" --authenticate_http_readwrite="true"
--authenticatee="crammd5" --authentication_backoff_factor="1secs" --authorizer="local" --cgroups_cpu_enable_pids_and_tids_count="false"
--cgroups_enable_cfs="false" --cgroups_hierarchy="/sys/fs/cgroup" --cgroups_limit_swap="false"
--cgroups_root="mesos" --container_disk_watch_interval="15secs" --containerizers="mesos" --credential="/tmp/Endpoint_SlaveEndpointTest_AuthorizedRequest_2_GHFraJ/credential"
--default_role="*" --disk_watch_interval="1mins" --docker="docker" --docker_kill_orphans="true"
--docker_registry="https://registry-1.docker.io" --docker_remove_delay="6hrs" --docker_socket="/var/run/docker.sock"
--docker_stop_timeout="0ns" --docker_store_dir="/tmp/mesos/store/docker" --docker_volume_checkpoint_dir="/var/run/mesos/isolators/docker/volume"
--enforce_container_disk_quota="false" --executor_registration_timeout="1mins" --executor_shutdown_grace_period="5secs"
--fetcher_cache_dir="/tmp/Endpoint_SlaveEndpointTest_AuthorizedRequest_2_GHFraJ/fetch" --fetcher_cache_size="2GB"
--frameworks_home="" --gc_delay="1weeks" --gc_disk_headroom="0.1" --hadoop_home="" --help="false"
--hostname_lookup="true" --http_authenticators="basic" --http_command_executor="false" --http_credentials="/tmp/Endpoint_SlaveEndpointTest_AuthorizedRequest_2_GHFraJ/http_credentials"
--image_provisioner_backend="copy" --initialize_driver_logging="true" --io_switchboard_enable_server="true"
--isolation="posix/cpu,posix/mem" --launcher="posix" --launcher_dir="/mesos/build/src" --logbufsecs="0"
--logging_level="INFO" --max_completed_executors_per_framework="150" --oversubscribed_resources_interval="15secs"
--perf_duration="10secs" --perf_interval="1mins" --qos_correction_interval_min="0ns" --quiet="false"
--recover="reconnect" --recovery_timeout="15mins" --registration_backoff_factor="10ms" --resources="cpus:2;gpus:0;mem:1024;disk:1024;ports:[31000-32000]"
--revocable_cpu_low_priority="true" --runtime_dir="/tmp/Endpoint_SlaveEndpointTest_AuthorizedRequest_2_GHFraJ"
--sandbox_directory="/mnt/mesos/sandbox" --strict="true" --switch_user="true" --systemd_enable_support="true"
--systemd_runtime_directory="/run/systemd/system" --version="false" --work_dir="/tmp/Endpoint_SlaveEndpointTest_AuthorizedRequest_2_Jse5qo"
I1209 14:45:53.910118 26744 credentials.hpp:86] Loading credential for authentication from
'/tmp/Endpoint_SlaveEndpointTest_AuthorizedRequest_2_GHFraJ/credential'
I1209 14:45:53.910220 26744 slave.cpp:346] Agent using credential for: test-principal
I1209 14:45:53.910235 26744 credentials.hpp:37] Loading credentials for authentication from
'/tmp/Endpoint_SlaveEndpointTest_AuthorizedRequest_2_GHFraJ/http_credentials'
I1209 14:45:53.910346 26744 http.cpp:922] Using default 'basic' HTTP authenticator for realm
'mesos-agent-readonly'
I1209 14:45:53.910393 26744 http.cpp:922] Using default 'basic' HTTP authenticator for realm
'mesos-agent-readwrite'
I1209 14:45:53.910815 26744 slave.cpp:533] Agent resources: cpus(*):2; mem(*):1024; disk(*):1024;
ports(*):[31000-32000]
I1209 14:45:53.910857 26744 slave.cpp:541] Agent attributes: [  ]
I1209 14:45:53.910864 26744 slave.cpp:546] Agent hostname: c876ce477d08
I1209 14:45:53.911298 26736 state.cpp:57] Recovering state from '/tmp/Endpoint_SlaveEndpointTest_AuthorizedRequest_2_Jse5qo/meta'
I1209 14:45:53.911454 26738 status_update_manager.cpp:203] Recovering status update manager
I1209 14:45:53.911674 26740 containerizer.cpp:591] Recovering containerizer
I1209 14:45:53.912230 26735 provisioner.cpp:253] Provisioner recovery complete
I1209 14:45:53.912515 26732 slave.cpp:5414] Finished recovery
I1209 14:45:53.913038 26732 slave.cpp:5588] Querying resource estimator for oversubscribable
resources
I1209 14:45:53.913233 26741 slave.cpp:5602] Received oversubscribable resources {} from the
resource estimator
I1209 14:45:53.913947 26731 process.cpp:3679] Handling HTTP event for process 'slave(660)'
with path: '/slave(660)/containers'
I1209 14:45:53.914481 26733 http.cpp:874] Authorizing principal 'test-principal' to GET the
'/containers' endpoint
I1209 14:45:53.916187 26731 slave.cpp:790] Agent terminating
[       OK ] Endpoint/SlaveEndpointTest.AuthorizedRequest/2 (12 ms)
[ RUN      ] Endpoint/SlaveEndpointTest.UnauthorizedRequest/0
I1209 14:45:53.921975 26729 containerizer.cpp:217] Using isolation: posix/cpu,posix/mem,filesystem/posix,network/cni
W1209 14:45:53.922395 26729 backend.cpp:76] Failed to create 'aufs' backend: AufsBackend requires
root privileges, but is running as user mesos
W1209 14:45:53.922489 26729 backend.cpp:76] Failed to create 'bind' backend: BindBackend requires
root privileges
I1209 14:45:53.923934 26741 slave.cpp:208] Mesos agent started on (661)@172.17.0.2:58228
I1209 14:45:53.923951 26741 slave.cpp:209] Flags at startup: --acls="" --appc_simple_discovery_uri_prefix="http://"
--appc_store_dir="/tmp/mesos/store/appc" --authenticate_http_readonly="true" --authenticate_http_readwrite="true"
--authenticatee="crammd5" --authentication_backoff_factor="1secs" --authorizer="local" --cgroups_cpu_enable_pids_and_tids_count="false"
--cgroups_enable_cfs="false" --cgroups_hierarchy="/sys/fs/cgroup" --cgroups_limit_swap="false"
--cgroups_root="mesos" --container_disk_watch_interval="15secs" --containerizers="mesos" --credential="/tmp/Endpoint_SlaveEndpointTest_UnauthorizedRequest_0_24Dad4/credential"
--default_role="*" --disk_watch_interval="1mins" --docker="docker" --docker_kill_orphans="true"
--docker_registry="https://registry-1.docker.io" --docker_remove_delay="6hrs" --docker_socket="/var/run/docker.sock"
--docker_stop_timeout="0ns" --docker_store_dir="/tmp/mesos/store/docker" --docker_volume_checkpoint_dir="/var/run/mesos/isolators/docker/volume"
--enforce_container_disk_quota="false" --executor_registration_timeout="1mins" --executor_shutdown_grace_period="5secs"
--fetcher_cache_dir="/tmp/Endpoint_SlaveEndpointTest_UnauthorizedRequest_0_24Dad4/fetch" --fetcher_cache_size="2GB"
--frameworks_home="" --gc_delay="1weeks" --gc_disk_headroom="0.1" --hadoop_home="" --help="false"
--hostname_lookup="true" --http_authenticators="basic" --http_command_executor="false" --http_credentials="/tmp/Endpoint_SlaveEndpointTest_UnauthorizedRequest_0_24Dad4/http_credentials"
--image_provisioner_backend="copy" --initialize_driver_logging="true" --io_switchboard_enable_server="true"
--isolation="posix/cpu,posix/mem" --launcher="posix" --launcher_dir="/mesos/build/src" --logbufsecs="0"
--logging_level="INFO" --max_completed_executors_per_framework="150" --oversubscribed_resources_interval="15secs"
--perf_duration="10secs" --perf_interval="1mins" --qos_correction_interval_min="0ns" --quiet="false"
--recover="reconnect" --recovery_timeout="15mins" --registration_backoff_factor="10ms" --resources="cpus:2;gpus:0;mem:1024;disk:1024;ports:[31000-32000]"
--revocable_cpu_low_priority="true" --runtime_dir="/tmp/Endpoint_SlaveEndpointTest_UnauthorizedRequest_0_24Dad4"
--sandbox_directory="/mnt/mesos/sandbox" --strict="true" --switch_user="true" --systemd_enable_support="true"
--systemd_runtime_directory="/run/systemd/system" --version="false" --work_dir="/tmp/Endpoint_SlaveEndpointTest_UnauthorizedRequest_0_Ba1CrJ"
I1209 14:45:53.924386 26741 credentials.hpp:86] Loading credential for authentication from
'/tmp/Endpoint_SlaveEndpointTest_UnauthorizedRequest_0_24Dad4/credential'
I1209 14:45:53.924482 26741 slave.cpp:346] Agent using credential for: test-principal
I1209 14:45:53.924504 26741 credentials.hpp:37] Loading credentials for authentication from
'/tmp/Endpoint_SlaveEndpointTest_UnauthorizedRequest_0_24Dad4/http_credentials'
I1209 14:45:53.924633 26741 http.cpp:922] Using default 'basic' HTTP authenticator for realm
'mesos-agent-readonly'
I1209 14:45:53.924685 26741 http.cpp:922] Using default 'basic' HTTP authenticator for realm
'mesos-agent-readwrite'
I1209 14:45:53.925076 26741 slave.cpp:533] Agent resources: cpus(*):2; mem(*):1024; disk(*):1024;
ports(*):[31000-32000]
I1209 14:45:53.925118 26741 slave.cpp:541] Agent attributes: [  ]
I1209 14:45:53.925128 26741 slave.cpp:546] Agent hostname: c876ce477d08
I1209 14:45:53.925549 26735 state.cpp:57] Recovering state from '/tmp/Endpoint_SlaveEndpointTest_UnauthorizedRequest_0_Ba1CrJ/meta'
I1209 14:45:53.925678 26740 status_update_manager.cpp:203] Recovering status update manager
I1209 14:45:53.925935 26735 containerizer.cpp:591] Recovering containerizer
I1209 14:45:53.926542 26744 provisioner.cpp:253] Provisioner recovery complete
I1209 14:45:53.926692 26738 slave.cpp:5414] Finished recovery
I1209 14:45:53.927086 26738 slave.cpp:5588] Querying resource estimator for oversubscribable
resources
I1209 14:45:53.927232 26741 slave.cpp:5602] Received oversubscribable resources {} from the
resource estimator
I1209 14:45:53.927811 26741 process.cpp:3679] Handling HTTP event for process 'slave(661)'
with path: '/slave(661)/monitor/statistics'
I1209 14:45:53.928184 26745 http.cpp:874] Authorizing principal 'test-principal' to GET the
'/monitor/statistics' endpoint
I1209 14:45:53.929149 26742 slave.cpp:790] Agent terminating
[       OK ] Endpoint/SlaveEndpointTest.UnauthorizedRequest/0 (12 ms)
[ RUN      ] Endpoint/SlaveEndpointTest.UnauthorizedRequest/1
I1209 14:45:53.933740 26729 containerizer.cpp:217] Using isolation: posix/cpu,posix/mem,filesystem/posix,network/cni
W1209 14:45:53.934016 26729 backend.cpp:76] Failed to create 'aufs' backend: AufsBackend requires
root privileges, but is running as user mesos
W1209 14:45:53.934092 26729 backend.cpp:76] Failed to create 'bind' backend: BindBackend requires
root privileges
I1209 14:45:53.935083 26739 slave.cpp:208] Mesos agent started on (662)@172.17.0.2:58228
I1209 14:45:53.935101 26739 slave.cpp:209] Flags at startup: --acls="" --appc_simple_discovery_uri_prefix="http://"
--appc_store_dir="/tmp/mesos/store/appc" --authenticate_http_readonly="true" --authenticate_http_readwrite="true"
--authenticatee="crammd5" --authentication_backoff_factor="1secs" --authorizer="local" --cgroups_cpu_enable_pids_and_tids_count="false"
--cgroups_enable_cfs="false" --cgroups_hierarchy="/sys/fs/cgroup" --cgroups_limit_swap="false"
--cgroups_root="mesos" --container_disk_watch_interval="15secs" --containerizers="mesos" --credential="/tmp/Endpoint_SlaveEndpointTest_UnauthorizedRequest_1_KBeaop/credential"
--default_role="*" --disk_watch_interval="1mins" --docker="docker" --docker_kill_orphans="true"
--docker_registry="https://registry-1.docker.io" --docker_remove_delay="6hrs" --docker_socket="/var/run/docker.sock"
--docker_stop_timeout="0ns" --docker_store_dir="/tmp/mesos/store/docker" --docker_volume_checkpoint_dir="/var/run/mesos/isolators/docker/volume"
--enforce_container_disk_quota="false" --executor_registration_timeout="1mins" --executor_shutdown_grace_period="5secs"
--fetcher_cache_dir="/tmp/Endpoint_SlaveEndpointTest_UnauthorizedRequest_1_KBeaop/fetch" --fetcher_cache_size="2GB"
--frameworks_home="" --gc_delay="1weeks" --gc_disk_headroom="0.1" --hadoop_home="" --help="false"
--hostname_lookup="true" --http_authenticators="basic" --http_command_executor="false" --http_credentials="/tmp/Endpoint_SlaveEndpointTest_UnauthorizedRequest_1_KBeaop/http_credentials"
--image_provisioner_backend="copy" --initialize_driver_logging="true" --io_switchboard_enable_server="true"
--isolation="posix/cpu,posix/mem" --launcher="posix" --launcher_dir="/mesos/build/src" --logbufsecs="0"
--logging_level="INFO" --max_completed_executors_per_framework="150" --oversubscribed_resources_interval="15secs"
--perf_duration="10secs" --perf_interval="1mins" --qos_correction_interval_min="0ns" --quiet="false"
--recover="reconnect" --recovery_timeout="15mins" --registration_backoff_factor="10ms" --resources="cpus:2;gpus:0;mem:1024;disk:1024;ports:[31000-32000]"
--revocable_cpu_low_priority="true" --runtime_dir="/tmp/Endpoint_SlaveEndpointTest_UnauthorizedRequest_1_KBeaop"
--sandbox_directory="/mnt/mesos/sandbox" --strict="true" --switch_user="true" --systemd_enable_support="true"
--systemd_runtime_directory="/run/systemd/system" --version="false" --work_dir="/tmp/Endpoint_SlaveEndpointTest_UnauthorizedRequest_1_jVdEA4"
I1209 14:45:53.935407 26739 credentials.hpp:86] Loading credential for authentication from
'/tmp/Endpoint_SlaveEndpointTest_UnauthorizedRequest_1_KBeaop/credential'
I1209 14:45:53.935509 26739 slave.cpp:346] Agent using credential for: test-principal
I1209 14:45:53.935528 26739 credentials.hpp:37] Loading credentials for authentication from
'/tmp/Endpoint_SlaveEndpointTest_UnauthorizedRequest_1_KBeaop/http_credentials'
I1209 14:45:53.935652 26739 http.cpp:922] Using default 'basic' HTTP authenticator for realm
'mesos-agent-readonly'
I1209 14:45:53.935703 26739 http.cpp:922] Using default 'basic' HTTP authenticator for realm
'mesos-agent-readwrite'
I1209 14:45:53.936125 26739 slave.cpp:533] Agent resources: cpus(*):2; mem(*):1024; disk(*):1024;
ports(*):[31000-32000]
I1209 14:45:53.936170 26739 slave.cpp:541] Agent attributes: [  ]
I1209 14:45:53.936178 26739 slave.cpp:546] Agent hostname: c876ce477d08
I1209 14:45:53.936501 26739 state.cpp:57] Recovering state from '/tmp/Endpoint_SlaveEndpointTest_UnauthorizedRequest_1_jVdEA4/meta'
I1209 14:45:53.936815 26741 status_update_manager.cpp:203] Recovering status update manager
I1209 14:45:53.936882 26741 containerizer.cpp:591] Recovering containerizer
I1209 14:45:53.937563 26738 provisioner.cpp:253] Provisioner recovery complete
I1209 14:45:53.937788 26741 slave.cpp:5414] Finished recovery
I1209 14:45:53.938174 26741 slave.cpp:5588] Querying resource estimator for oversubscribable
resources
I1209 14:45:53.938369 26737 slave.cpp:5602] Received oversubscribable resources {} from the
resource estimator
I1209 14:45:53.939100 26745 process.cpp:3679] Handling HTTP event for process 'slave(662)'
with path: '/slave(662)/monitor/statistics.json'
I1209 14:45:53.939502 26742 http.cpp:874] Authorizing principal 'test-principal' to GET the
'/monitor/statistics.json' endpoint
I1209 14:45:53.940704 26729 slave.cpp:790] Agent terminating
[       OK ] Endpoint/SlaveEndpointTest.UnauthorizedRequest/1 (12 ms)
[ RUN      ] Endpoint/SlaveEndpointTest.UnauthorizedRequest/2
I1209 14:45:53.945529 26729 containerizer.cpp:217] Using isolation: posix/cpu,posix/mem,filesystem/posix,network/cni
W1209 14:45:53.945817 26729 backend.cpp:76] Failed to create 'aufs' backend: AufsBackend requires
root privileges, but is running as user mesos
W1209 14:45:53.945885 26729 backend.cpp:76] Failed to create 'bind' backend: BindBackend requires
root privileges
I1209 14:45:53.946837 26732 slave.cpp:208] Mesos agent started on (663)@172.17.0.2:58228
I1209 14:45:53.946856 26732 slave.cpp:209] Flags at startup: --acls="" --appc_simple_discovery_uri_prefix="http://"
--appc_store_dir="/tmp/mesos/store/appc" --authenticate_http_readonly="true" --authenticate_http_readwrite="true"
--authenticatee="crammd5" --authentication_backoff_factor="1secs" --authorizer="local" --cgroups_cpu_enable_pids_and_tids_count="false"
--cgroups_enable_cfs="false" --cgroups_hierarchy="/sys/fs/cgroup" --cgroups_limit_swap="false"
--cgroups_root="mesos" --container_disk_watch_interval="15secs" --containerizers="mesos" --credential="/tmp/Endpoint_SlaveEndpointTest_UnauthorizedRequest_2_0xVKGK/credential"
--default_role="*" --disk_watch_interval="1mins" --docker="docker" --docker_kill_orphans="true"
--docker_registry="https://registry-1.docker.io" --docker_remove_delay="6hrs" --docker_socket="/var/run/docker.sock"
--docker_stop_timeout="0ns" --docker_store_dir="/tmp/mesos/store/docker" --docker_volume_checkpoint_dir="/var/run/mesos/isolators/docker/volume"
--enforce_container_disk_quota="false" --executor_registration_timeout="1mins" --executor_shutdown_grace_period="5secs"
--fetcher_cache_dir="/tmp/Endpoint_SlaveEndpointTest_UnauthorizedRequest_2_0xVKGK/fetch" --fetcher_cache_size="2GB"
--frameworks_home="" --gc_delay="1weeks" --gc_disk_headroom="0.1" --hadoop_home="" --help="false"
--hostname_lookup="true" --http_authenticators="basic" --http_command_executor="false" --http_credentials="/tmp/Endpoint_SlaveEndpointTest_UnauthorizedRequest_2_0xVKGK/http_credentials"
--image_provisioner_backend="copy" --initialize_driver_logging="true" --io_switchboard_enable_server="true"
--isolation="posix/cpu,posix/mem" --launcher="posix" --launcher_dir="/mesos/build/src" --logbufsecs="0"
--logging_level="INFO" --max_completed_executors_per_framework="150" --oversubscribed_resources_interval="15secs"
--perf_duration="10secs" --perf_interval="1mins" --qos_correction_interval_min="0ns" --quiet="false"
--recover="reconnect" --recovery_timeout="15mins" --registration_backoff_factor="10ms" --resources="cpus:2;gpus:0;mem:1024;disk:1024;ports:[31000-32000]"
--revocable_cpu_low_priority="true" --runtime_dir="/tmp/Endpoint_SlaveEndpointTest_UnauthorizedRequest_2_0xVKGK"
--sandbox_directory="/mnt/mesos/sandbox" --strict="true" --switch_user="true" --systemd_enable_support="true"
--systemd_runtime_directory="/run/systemd/system" --version="false" --work_dir="/tmp/Endpoint_SlaveEndpointTest_UnauthorizedRequest_2_ZXejRp"
I1209 14:45:53.947264 26732 credentials.hpp:86] Loading credential for authentication from
'/tmp/Endpoint_SlaveEndpointTest_UnauthorizedRequest_2_0xVKGK/credential'
I1209 14:45:53.947360 26732 slave.cpp:346] Agent using credential for: test-principal
I1209 14:45:53.947376 26732 credentials.hpp:37] Loading credentials for authentication from
'/tmp/Endpoint_SlaveEndpointTest_UnauthorizedRequest_2_0xVKGK/http_credentials'
I1209 14:45:53.947485 26732 http.cpp:922] Using default 'basic' HTTP authenticator for realm
'mesos-agent-readonly'
I1209 14:45:53.947532 26732 http.cpp:922] Using default 'basic' HTTP authenticator for realm
'mesos-agent-readwrite'
I1209 14:45:53.947993 26732 slave.cpp:533] Agent resources: cpus(*):2; mem(*):1024; disk(*):1024;
ports(*):[31000-32000]
I1209 14:45:53.948038 26732 slave.cpp:541] Agent attributes: [  ]
I1209 14:45:53.948056 26732 slave.cpp:546] Agent hostname: c876ce477d08
I1209 14:45:53.948487 26736 state.cpp:57] Recovering state from '/tmp/Endpoint_SlaveEndpointTest_UnauthorizedRequest_2_ZXejRp/meta'
I1209 14:45:53.948619 26732 status_update_manager.cpp:203] Recovering status update manager
I1209 14:45:53.948849 26740 containerizer.cpp:591] Recovering containerizer
I1209 14:45:53.949478 26733 provisioner.cpp:253] Provisioner recovery complete
I1209 14:45:53.949704 26740 slave.cpp:5414] Finished recovery
I1209 14:45:53.950101 26740 slave.cpp:5588] Querying resource estimator for oversubscribable
resources
I1209 14:45:53.950237 26737 slave.cpp:5602] Received oversubscribable resources {} from the
resource estimator
I1209 14:45:53.950917 26731 process.cpp:3679] Handling HTTP event for process 'slave(663)'
with path: '/slave(663)/containers'
I1209 14:45:53.951546 26741 http.cpp:874] Authorizing principal 'test-principal' to GET the
'/containers' endpoint
I1209 14:45:53.952555 26737 slave.cpp:790] Agent terminating
[       OK ] Endpoint/SlaveEndpointTest.UnauthorizedRequest/2 (11 ms)
[ RUN      ] Endpoint/SlaveEndpointTest.NoAuthorizer/0
I1209 14:45:53.957208 26729 containerizer.cpp:217] Using isolation: posix/cpu,posix/mem,filesystem/posix,network/cni
W1209 14:45:53.957638 26729 backend.cpp:76] Failed to create 'aufs' backend: AufsBackend requires
root privileges, but is running as user mesos
W1209 14:45:53.957736 26729 backend.cpp:76] Failed to create 'bind' backend: BindBackend requires
root privileges
I1209 14:45:53.958405 26729 cluster.cpp:446] Creating default 'local' authorizer
I1209 14:45:53.959061 26739 slave.cpp:208] Mesos agent started on (664)@172.17.0.2:58228
I1209 14:45:53.959086 26739 slave.cpp:209] Flags at startup: --acls="" --appc_simple_discovery_uri_prefix="http://"
--appc_store_dir="/tmp/mesos/store/appc" --authenticate_http_readonly="true" --authenticate_http_readwrite="true"
--authenticatee="crammd5" --authentication_backoff_factor="1secs" --authorizer="local" --cgroups_cpu_enable_pids_and_tids_count="false"
--cgroups_enable_cfs="false" --cgroups_hierarchy="/sys/fs/cgroup" --cgroups_limit_swap="false"
--cgroups_root="mesos" --container_disk_watch_interval="15secs" --containerizers="mesos" --credential="/tmp/Endpoint_SlaveEndpointTest_NoAuthorizer_0_0owN65/credential"
--default_role="*" --disk_watch_interval="1mins" --docker="docker" --docker_kill_orphans="true"
--docker_registry="https://registry-1.docker.io" --docker_remove_delay="6hrs" --docker_socket="/var/run/docker.sock"
--docker_stop_timeout="0ns" --docker_store_dir="/tmp/mesos/store/docker" --docker_volume_checkpoint_dir="/var/run/mesos/isolators/docker/volume"
--enforce_container_disk_quota="false" --executor_registration_timeout="1mins" --executor_shutdown_grace_period="5secs"
--fetcher_cache_dir="/tmp/Endpoint_SlaveEndpointTest_NoAuthorizer_0_0owN65/fetch" --fetcher_cache_size="2GB"
--frameworks_home="" --gc_delay="1weeks" --gc_disk_headroom="0.1" --hadoop_home="" --help="false"
--hostname_lookup="true" --http_authenticators="basic" --http_command_executor="false" --http_credentials="/tmp/Endpoint_SlaveEndpointTest_NoAuthorizer_0_0owN65/http_credentials"
--image_provisioner_backend="copy" --initialize_driver_logging="true" --io_switchboard_enable_server="true"
--isolation="posix/cpu,posix/mem" --launcher="posix" --launcher_dir="/mesos/build/src" --logbufsecs="0"
--logging_level="INFO" --max_completed_executors_per_framework="150" --oversubscribed_resources_interval="15secs"
--perf_duration="10secs" --perf_interval="1mins" --qos_correction_interval_min="0ns" --quiet="false"
--recover="reconnect" --recovery_timeout="15mins" --registration_backoff_factor="10ms" --resources="cpus:2;gpus:0;mem:1024;disk:1024;ports:[31000-32000]"
--revocable_cpu_low_priority="true" --runtime_dir="/tmp/Endpoint_SlaveEndpointTest_NoAuthorizer_0_0owN65"
--sandbox_directory="/mnt/mesos/sandbox" --strict="true" --switch_user="true" --systemd_enable_support="true"
--systemd_runtime_directory="/run/systemd/system" --version="false" --work_dir="/tmp/Endpoint_SlaveEndpointTest_NoAuthorizer_0_XE6vfL"
I1209 14:45:53.959517 26739 credentials.hpp:86] Loading credential for authentication from
'/tmp/Endpoint_SlaveEndpointTest_NoAuthorizer_0_0owN65/credential'
I1209 14:45:53.959627 26739 slave.cpp:346] Agent using credential for: test-principal
I1209 14:45:53.959645 26739 credentials.hpp:37] Loading credentials for authentication from
'/tmp/Endpoint_SlaveEndpointTest_NoAuthorizer_0_0owN65/http_credentials'
I1209 14:45:53.959789 26739 http.cpp:922] Using default 'basic' HTTP authenticator for realm
'mesos-agent-readonly'
I1209 14:45:53.959841 26739 http.cpp:922] Using default 'basic' HTTP authenticator for realm
'mesos-agent-readwrite'
I1209 14:45:53.960217 26739 slave.cpp:533] Agent resources: cpus(*):2; mem(*):1024; disk(*):1024;
ports(*):[31000-32000]
I1209 14:45:53.960260 26739 slave.cpp:541] Agent attributes: [  ]
I1209 14:45:53.960268 26739 slave.cpp:546] Agent hostname: c876ce477d08
I1209 14:45:53.960682 26743 state.cpp:57] Recovering state from '/tmp/Endpoint_SlaveEndpointTest_NoAuthorizer_0_XE6vfL/meta'
I1209 14:45:53.960940 26739 status_update_manager.cpp:203] Recovering status update manager
I1209 14:45:53.961105 26734 containerizer.cpp:591] Recovering containerizer
I1209 14:45:53.961802 26737 provisioner.cpp:253] Provisioner recovery complete
I1209 14:45:53.962049 26733 slave.cpp:5414] Finished recovery
I1209 14:45:53.962455 26733 slave.cpp:5588] Querying resource estimator for oversubscribable
resources
I1209 14:45:53.962678 26735 slave.cpp:5602] Received oversubscribable resources {} from the
resource estimator
I1209 14:45:53.963438 26735 process.cpp:3679] Handling HTTP event for process 'slave(664)'
with path: '/slave(664)/monitor/statistics'
I1209 14:45:53.963879 26738 http.cpp:874] Authorizing principal 'test-principal' to GET the
'/monitor/statistics' endpoint
I1209 14:45:53.965611 26729 slave.cpp:790] Agent terminating
[       OK ] Endpoint/SlaveEndpointTest.NoAuthorizer/0 (14 ms)
[ RUN      ] Endpoint/SlaveEndpointTest.NoAuthorizer/1
I1209 14:45:53.972450 26729 containerizer.cpp:217] Using isolation: posix/cpu,posix/mem,filesystem/posix,network/cni
W1209 14:45:53.972856 26729 backend.cpp:76] Failed to create 'aufs' backend: AufsBackend requires
root privileges, but is running as user mesos
W1209 14:45:53.972980 26729 backend.cpp:76] Failed to create 'bind' backend: BindBackend requires
root privileges
I1209 14:45:53.973665 26729 cluster.cpp:446] Creating default 'local' authorizer
I1209 14:45:53.974328 26740 slave.cpp:208] Mesos agent started on (665)@172.17.0.2:58228
I1209 14:45:53.974344 26740 slave.cpp:209] Flags at startup: --acls="" --appc_simple_discovery_uri_prefix="http://"
--appc_store_dir="/tmp/mesos/store/appc" --authenticate_http_readonly="true" --authenticate_http_readwrite="true"
--authenticatee="crammd5" --authentication_backoff_factor="1secs" --authorizer="local" --cgroups_cpu_enable_pids_and_tids_count="false"
--cgroups_enable_cfs="false" --cgroups_hierarchy="/sys/fs/cgroup" --cgroups_limit_swap="false"
--cgroups_root="mesos" --container_disk_watch_interval="15secs" --containerizers="mesos" --credential="/tmp/Endpoint_SlaveEndpointTest_NoAuthorizer_1_wPl3Fr/credential"
--default_role="*" --disk_watch_interval="1mins" --docker="docker" --docker_kill_orphans="true"
--docker_registry="https://registry-1.docker.io" --docker_remove_delay="6hrs" --docker_socket="/var/run/docker.sock"
--docker_stop_timeout="0ns" --docker_store_dir="/tmp/mesos/store/docker" --docker_volume_checkpoint_dir="/var/run/mesos/isolators/docker/volume"
--enforce_container_disk_quota="false" --executor_registration_timeout="1mins" --executor_shutdown_grace_period="5secs"
--fetcher_cache_dir="/tmp/Endpoint_SlaveEndpointTest_NoAuthorizer_1_wPl3Fr/fetch" --fetcher_cache_size="2GB"
--frameworks_home="" --gc_delay="1weeks" --gc_disk_headroom="0.1" --hadoop_home="" --help="false"
--hostname_lookup="true" --http_authenticators="basic" --http_command_executor="false" --http_credentials="/tmp/Endpoint_SlaveEndpointTest_NoAuthorizer_1_wPl3Fr/http_credentials"
--image_provisioner_backend="copy" --initialize_driver_logging="true" --io_switchboard_enable_server="true"
--isolation="posix/cpu,posix/mem" --launcher="posix" --launcher_dir="/mesos/build/src" --logbufsecs="0"
--logging_level="INFO" --max_completed_executors_per_framework="150" --oversubscribed_resources_interval="15secs"
--perf_duration="10secs" --perf_interval="1mins" --qos_correction_interval_min="0ns" --quiet="false"
--recover="reconnect" --recovery_timeout="15mins" --registration_backoff_factor="10ms" --resources="cpus:2;gpus:0;mem:1024;disk:1024;ports:[31000-32000]"
--revocable_cpu_low_priority="true" --runtime_dir="/tmp/Endpoint_SlaveEndpointTest_NoAuthorizer_1_wPl3Fr"
--sandbox_directory="/mnt/mesos/sandbox" --strict="true" --switch_user="true" --systemd_enable_support="true"
--systemd_runtime_directory="/run/systemd/system" --version="false" --work_dir="/tmp/Endpoint_SlaveEndpointTest_NoAuthorizer_1_D2klM6"
I1209 14:45:53.974784 26740 credentials.hpp:86] Loading credential for authentication from
'/tmp/Endpoint_SlaveEndpointTest_NoAuthorizer_1_wPl3Fr/credential'
I1209 14:45:53.974910 26740 slave.cpp:346] Agent using credential for: test-principal
I1209 14:45:53.974934 26740 credentials.hpp:37] Loading credentials for authentication from
'/tmp/Endpoint_SlaveEndpointTest_NoAuthorizer_1_wPl3Fr/http_credentials'
I1209 14:45:53.975087 26740 http.cpp:922] Using default 'basic' HTTP authenticator for realm
'mesos-agent-readonly'
I1209 14:45:53.975148 26740 http.cpp:922] Using default 'basic' HTTP authenticator for realm
'mesos-agent-readwrite'
I1209 14:45:53.975721 26740 slave.cpp:533] Agent resources: cpus(*):2; mem(*):1024; disk(*):1024;
ports(*):[31000-32000]
I1209 14:45:53.975766 26740 slave.cpp:541] Agent attributes: [  ]
I1209 14:45:53.975775 26740 slave.cpp:546] Agent hostname: c876ce477d08
I1209 14:45:53.976173 26742 state.cpp:57] Recovering state from '/tmp/Endpoint_SlaveEndpointTest_NoAuthorizer_1_D2klM6/meta'
I1209 14:45:53.976414 26735 status_update_manager.cpp:203] Recovering status update manager
I1209 14:45:53.976575 26730 containerizer.cpp:591] Recovering containerizer
I1209 14:45:53.977216 26745 provisioner.cpp:253] Provisioner recovery complete
I1209 14:45:53.977407 26741 slave.cpp:5414] Finished recovery
I1209 14:45:53.977990 26741 slave.cpp:5588] Querying resource estimator for oversubscribable
resources
I1209 14:45:53.978118 26743 slave.cpp:5602] Received oversubscribable resources {} from the
resource estimator
I1209 14:45:53.978760 26743 process.cpp:3679] Handling HTTP event for process 'slave(665)'
with path: '/slave(665)/monitor/statistics.json'
I1209 14:45:53.979275 26739 http.cpp:874] Authorizing principal 'test-principal' to GET the
'/monitor/statistics.json' endpoint
I1209 14:45:53.980598 26729 slave.cpp:790] Agent terminating
[       OK ] Endpoint/SlaveEndpointTest.NoAuthorizer/1 (13 ms)
[ RUN      ] Endpoint/SlaveEndpointTest.NoAuthorizer/2
I1209 14:45:53.985100 26729 containerizer.cpp:217] Using isolation: posix/cpu,posix/mem,filesystem/posix,network/cni
W1209 14:45:53.985386 26729 backend.cpp:76] Failed to create 'aufs' backend: AufsBackend requires
root privileges, but is running as user mesos
W1209 14:45:53.985530 26729 backend.cpp:76] Failed to create 'bind' backend: BindBackend requires
root privileges
I1209 14:45:53.986151 26729 cluster.cpp:446] Creating default 'local' authorizer
I1209 14:45:53.986624 26743 slave.cpp:208] Mesos agent started on (666)@172.17.0.2:58228
I1209 14:45:53.986640 26743 slave.cpp:209] Flags at startup: --acls="" --appc_simple_discovery_uri_prefix="http://"
--appc_store_dir="/tmp/mesos/store/appc" --authenticate_http_readonly="true" --authenticate_http_readwrite="true"
--authenticatee="crammd5" --authentication_backoff_factor="1secs" --authorizer="local" --cgroups_cpu_enable_pids_and_tids_count="false"
--cgroups_enable_cfs="false" --cgroups_hierarchy="/sys/fs/cgroup" --cgroups_limit_swap="false"
--cgroups_root="mesos" --container_disk_watch_interval="15secs" --containerizers="mesos" --credential="/tmp/Endpoint_SlaveEndpointTest_NoAuthorizer_2_WtcjoN/credential"
--default_role="*" --disk_watch_interval="1mins" --docker="docker" --docker_kill_orphans="true"
--docker_registry="https://registry-1.docker.io" --docker_remove_delay="6hrs" --docker_socket="/var/run/docker.sock"
--docker_stop_timeout="0ns" --docker_store_dir="/tmp/mesos/store/docker" --docker_volume_checkpoint_dir="/var/run/mesos/isolators/docker/volume"
--enforce_container_disk_quota="false" --executor_registration_timeout="1mins" --executor_shutdown_grace_period="5secs"
--fetcher_cache_dir="/tmp/Endpoint_SlaveEndpointTest_NoAuthorizer_2_WtcjoN/fetch" --fetcher_cache_size="2GB"
--frameworks_home="" --gc_delay="1weeks" --gc_disk_headroom="0.1" --hadoop_home="" --help="false"
--hostname_lookup="true" --http_authenticators="basic" --http_command_executor="false" --http_credentials="/tmp/Endpoint_SlaveEndpointTest_NoAuthorizer_2_WtcjoN/http_credentials"
--image_provisioner_backend="copy" --initialize_driver_logging="true" --io_switchboard_enable_server="true"
--isolation="posix/cpu,posix/mem" --launcher="posix" --launcher_dir="/mesos/build/src" --logbufsecs="0"
--logging_level="INFO" --max_completed_executors_per_framework="150" --oversubscribed_resources_interval="15secs"
--perf_duration="10secs" --perf_interval="1mins" --qos_correction_interval_min="0ns" --quiet="false"
--recover="reconnect" --recovery_timeout="15mins" --registration_backoff_factor="10ms" --resources="cpus:2;gpus:0;mem:1024;disk:1024;ports:[31000-32000]"
--revocable_cpu_low_priority="true" --runtime_dir="/tmp/Endpoint_SlaveEndpointTest_NoAuthorizer_2_WtcjoN"
--sandbox_directory="/mnt/mesos/sandbox" --strict="true" --switch_user="true" --systemd_enable_support="true"
--systemd_runtime_directory="/run/systemd/system" --version="false" --work_dir="/tmp/Endpoint_SlaveEndpointTest_NoAuthorizer_2_NLtsss"
I1209 14:45:53.986953 26743 credentials.hpp:86] Loading credential for authentication from
'/tmp/Endpoint_SlaveEndpointTest_NoAuthorizer_2_WtcjoN/credential'
I1209 14:45:53.987035 26743 slave.cpp:346] Agent using credential for: test-principal
I1209 14:45:53.987047 26743 credentials.hpp:37] Loading credentials for authentication from
'/tmp/Endpoint_SlaveEndpointTest_NoAuthorizer_2_WtcjoN/http_credentials'
I1209 14:45:53.987134 26743 http.cpp:922] Using default 'basic' HTTP authenticator for realm
'mesos-agent-readonly'
I1209 14:45:53.987174 26743 http.cpp:922] Using default 'basic' HTTP authenticator for realm
'mesos-agent-readwrite'
I1209 14:45:53.987469 26743 slave.cpp:533] Agent resources: cpus(*):2; mem(*):1024; disk(*):1024;
ports(*):[31000-32000]
I1209 14:45:53.987504 26743 slave.cpp:541] Agent attributes: [  ]
I1209 14:45:53.987509 26743 slave.cpp:546] Agent hostname: c876ce477d08
I1209 14:45:53.988042 26730 state.cpp:57] Recovering state from '/tmp/Endpoint_SlaveEndpointTest_NoAuthorizer_2_NLtsss/meta'
I1209 14:45:53.988155 26743 status_update_manager.cpp:203] Recovering status update manager
I1209 14:45:53.988292 26735 containerizer.cpp:591] Recovering containerizer
I1209 14:45:53.989163 26739 provisioner.cpp:253] Provisioner recovery complete
I1209 14:45:53.989398 26730 slave.cpp:5414] Finished recovery
I1209 14:45:53.989859 26730 slave.cpp:5588] Querying resource estimator for oversubscribable
resources
I1209 14:45:53.990044 26739 slave.cpp:5602] Received oversubscribable resources {} from the
resource estimator
I1209 14:45:53.990697 26730 process.cpp:3679] Handling HTTP event for process 'slave(666)'
with path: '/slave(666)/containers'
I1209 14:45:53.991195 26737 http.cpp:874] Authorizing principal 'test-principal' to GET the
'/containers' endpoint
I1209 14:45:53.992879 26729 slave.cpp:790] Agent terminating
[       OK ] Endpoint/SlaveEndpointTest.NoAuthorizer/2 (12 ms)
[----------] 9 tests from Endpoint/SlaveEndpointTest (115 ms total)

[----------] Global test environment tear-down
[==========] 1376 tests from 157 test cases ran. (199603 ms total)
[  PASSED  ] 1376 tests.

  YOU HAVE 9 DISABLED TESTS

Inconsistency detected by ld.so: dl-close.c: 762: _dl_close: Assertion `map->l_init_called'
failed!
make[3]: *** [CMakeFiles/check] Error 127
make[3]: Leaving directory `/mesos/build'
make[2]: Leaving directory `/mesos/build'
make[2]: *** [CMakeFiles/check.dir/all] Error 2
make[1]: Leaving directory `/mesos/build'
make[1]: *** [CMakeFiles/check.dir/rule] Error 2
make: *** [check] Error 2
+ docker rmi mesos-1481291896-6953
Untagged: mesos-1481291896-6953:latest
Deleted: sha256:a63699372075162f03f6f36427ee32fe6ddbd3faf48b35c7b26a0b926512b27a
Deleted: sha256:f105103ca85dc7bb0dbe49416c45680df4ef794c5f8547da7f27498fb408546b
Deleted: sha256:c75b0b3a58235a7bfbe5e7c47f6a13ad454ed5e209af7a71cbdfe06de45ed797
Deleted: sha256:b5109636343d8200d552124cc296300ac8fdaa906be6e90463f0d90366caf9ca
Deleted: sha256:fbb6657b26c164570b5d6320842b122620cb95ac202ee37917cfa36874db8af1
Deleted: sha256:5485184e70c6eea6d065282aedf5e07ee8901e7888f57f74aad4639e878cd7ea
Deleted: sha256:ebbc324f2bc3235c88fdf16f82c66baa09f47f7bc39d71b6e57216f585fdc652
Deleted: sha256:fe57d6a720476b7d40b53fe39589598d545863febc76e0e1551ecc9905d3d610
Deleted: sha256:31d522d415310c164df4c125922deebc6ad3fc7c9013cc256368518f06feded3
Deleted: sha256:bb2f5b7083b3c6488ab5f0552c9f1a46adf00b4510d226c48440d5f8add0b9e6
Deleted: sha256:4b151428aa58c984f0afc8ab74f18d85e97b1f5e465eb1ce05d39c6ee7d5ea78
Deleted: sha256:0dc5b4d122a4f0304e27a2617fad1e126236319a1613b873135d0f700909ea76
Deleted: sha256:c3475f1296c9a703356e55216affd18aedd380d3502e4551caf6ce9f414ce7aa
Deleted: sha256:29b75c649622271ec5feb54c45f48f274ee9932e8b796e75d01c052c2a0ad9ac
Deleted: sha256:d8ec4ebbd7131e4cfe7f15c71bf75b97cd505e5089710a31df107d1b43e62fd2
Deleted: sha256:de295ee723177114c21fbcf06d4f92205fc355a8232e5dc09769376057981d7f
Deleted: sha256:df5c8f7b7f33310d38703adacfa176627cc291041706e341563b13052a70e9be
Deleted: sha256:203d0986229b1fc4ef60468c5dceb8e3882da9eacbe2dea19506305d5d2c3c23
Deleted: sha256:844b02164207237e09ecf9720bc85377733feab79a18aba8b66975646655d06e
Deleted: sha256:f5552641c0d61ee3b59574292aac98dce34da68bf958fc31ecd4e12b06cb791c
Deleted: sha256:85a4354310c4e05fc252276bedbee4362be841f4c40bb4b1ece6cfaaf073b0f8
Deleted: sha256:0ec19f948df025658c86ea8d7aca3b610a2bf80240dc5430a7e2e14a9d3d106f
Deleted: sha256:7728f0eabf8d25ed34054595c1245b6db6310f5e0ef8af0895f59588aaf23bed
Deleted: sha256:397db907874e31d2c5fa4a6e0347ad161c0dcce5034e2401072665065dfac7d3
Build step 'Execute shell' marked build as failure

Mime
View raw message