mesos-builds mailing list archives

Site index · List index
Message view « Date » · « Thread »
Top « Date » · « Thread »
From Apache Jenkins Server <jenk...@builds.apache.org>
Subject Build failed in Jenkins: Mesos » cmake,clang,--verbose --enable-libevent --enable-ssl,GLOG_v=1 MESOS_VERBOSE=1,ubuntu:14.04,(docker||Hadoop)&&(!ubuntu-us1)&&(!ubuntu-6)&&(!ubuntu-eu2) #3028
Date Sat, 10 Dec 2016 02:16:56 GMT
See <https://builds.apache.org/job/Mesos/BUILDTOOL=cmake,COMPILER=clang,CONFIGURATION=--verbose%20--enable-libevent%20--enable-ssl,ENVIRONMENT=GLOG_v=1%20MESOS_VERBOSE=1,OS=ubuntu%3A14.04,label_exp=(docker%7C%7CHadoop)&&(!ubuntu-us1)&&(!ubuntu-6)&&(!ubuntu-eu2)/3028/changes>

Changes:

[bmahler] Updated `Role::resources()` in master to handle multi-role frameworks.

[bmahler] Updated master and agent endpoints to expose FrameworkInfo::roles.

------------------------------------------
[...truncated 173216 lines...]
[       OK ] Endpoint/SlaveEndpointTest.AuthorizedRequest/0 (15 ms)
[ RUN      ] Endpoint/SlaveEndpointTest.AuthorizedRequest/1
I1210 02:15:35.262307 25233 containerizer.cpp:220] Using isolation: posix/cpu,posix/mem,filesystem/posix,network/cni
W1210 02:15:35.262631 25233 backend.cpp:76] Failed to create 'aufs' backend: AufsBackend requires
root privileges, but is running as user mesos
W1210 02:15:35.262719 25233 backend.cpp:76] Failed to create 'bind' backend: BindBackend requires
root privileges
I1210 02:15:35.263707 25236 slave.cpp:209] Mesos agent started on (659)@172.17.0.3:60285
I1210 02:15:35.263732 25236 slave.cpp:210] Flags at startup: --acls="" --appc_simple_discovery_uri_prefix="http://"
--appc_store_dir="/tmp/mesos/store/appc" --authenticate_http_readonly="true" --authenticate_http_readwrite="true"
--authenticatee="crammd5" --authentication_backoff_factor="1secs" --authorizer="local" --cgroups_cpu_enable_pids_and_tids_count="false"
--cgroups_enable_cfs="false" --cgroups_hierarchy="/sys/fs/cgroup" --cgroups_limit_swap="false"
--cgroups_root="mesos" --container_disk_watch_interval="15secs" --containerizers="mesos" --credential="/tmp/Endpoint_SlaveEndpointTest_AuthorizedRequest_1_60jfvp/credential"
--default_role="*" --disk_watch_interval="1mins" --docker="docker" --docker_kill_orphans="true"
--docker_registry="https://registry-1.docker.io" --docker_remove_delay="6hrs" --docker_socket="/var/run/docker.sock"
--docker_stop_timeout="0ns" --docker_store_dir="/tmp/mesos/store/docker" --docker_volume_checkpoint_dir="/var/run/mesos/isolators/docker/volume"
--enforce_container_disk_quota="false" --executor_registration_timeout="1mins" --executor_shutdown_grace_period="5secs"
--fetcher_cache_dir="/tmp/Endpoint_SlaveEndpointTest_AuthorizedRequest_1_60jfvp/fetch" --fetcher_cache_size="2GB"
--frameworks_home="" --gc_delay="1weeks" --gc_disk_headroom="0.1" --hadoop_home="" --help="false"
--hostname_lookup="true" --http_authenticators="basic" --http_command_executor="false" --http_credentials="/tmp/Endpoint_SlaveEndpointTest_AuthorizedRequest_1_60jfvp/http_credentials"
--image_provisioner_backend="copy" --initialize_driver_logging="true" --io_switchboard_enable_server="true"
--isolation="posix/cpu,posix/mem" --launcher="posix" --launcher_dir="/mesos/build/src" --logbufsecs="0"
--logging_level="INFO" --max_completed_executors_per_framework="150" --oversubscribed_resources_interval="15secs"
--perf_duration="10secs" --perf_interval="1mins" --qos_correction_interval_min="0ns" --quiet="false"
--recover="reconnect" --recovery_timeout="15mins" --registration_backoff_factor="10ms" --resources="cpus:2;gpus:0;mem:1024;disk:1024;ports:[31000-32000]"
--revocable_cpu_low_priority="true" --runtime_dir="/tmp/Endpoint_SlaveEndpointTest_AuthorizedRequest_1_60jfvp"
--sandbox_directory="/mnt/mesos/sandbox" --strict="true" --switch_user="true" --systemd_enable_support="true"
--systemd_runtime_directory="/run/systemd/system" --version="false" --work_dir="/tmp/Endpoint_SlaveEndpointTest_AuthorizedRequest_1_jObu4P"
I1210 02:15:35.263999 25236 credentials.hpp:86] Loading credential for authentication from
'/tmp/Endpoint_SlaveEndpointTest_AuthorizedRequest_1_60jfvp/credential'
I1210 02:15:35.264078 25236 slave.cpp:347] Agent using credential for: test-principal
I1210 02:15:35.264089 25236 credentials.hpp:37] Loading credentials for authentication from
'/tmp/Endpoint_SlaveEndpointTest_AuthorizedRequest_1_60jfvp/http_credentials'
I1210 02:15:35.264174 25236 http.cpp:922] Using default 'basic' HTTP authenticator for realm
'mesos-agent-readonly'
I1210 02:15:35.264221 25236 http.cpp:922] Using default 'basic' HTTP authenticator for realm
'mesos-agent-readwrite'
I1210 02:15:35.264536 25236 slave.cpp:534] Agent resources: cpus(*):2; mem(*):1024; disk(*):1024;
ports(*):[31000-32000]
I1210 02:15:35.264569 25236 slave.cpp:542] Agent attributes: [  ]
I1210 02:15:35.264574 25236 slave.cpp:547] Agent hostname: 3f03f3f12f58
I1210 02:15:35.264991 25248 state.cpp:57] Recovering state from '/tmp/Endpoint_SlaveEndpointTest_AuthorizedRequest_1_jObu4P/meta'
I1210 02:15:35.265236 25246 status_update_manager.cpp:203] Recovering status update manager
I1210 02:15:35.265316 25248 containerizer.cpp:594] Recovering containerizer
I1210 02:15:35.265889 25243 provisioner.cpp:253] Provisioner recovery complete
I1210 02:15:35.266065 25245 slave.cpp:5415] Finished recovery
I1210 02:15:35.266472 25245 slave.cpp:5589] Querying resource estimator for oversubscribable
resources
I1210 02:15:35.266557 25243 slave.cpp:5603] Received oversubscribable resources {} from the
resource estimator
I1210 02:15:35.267221 25236 process.cpp:3679] Handling HTTP event for process 'slave(659)'
with path: '/slave(659)/monitor/statistics.json'
I1210 02:15:35.267686 25239 http.cpp:874] Authorizing principal 'test-principal' to GET the
'/monitor/statistics.json' endpoint
I1210 02:15:35.268837 25244 slave.cpp:791] Agent terminating
[       OK ] Endpoint/SlaveEndpointTest.AuthorizedRequest/1 (11 ms)
[ RUN      ] Endpoint/SlaveEndpointTest.AuthorizedRequest/2
I1210 02:15:35.273526 25233 containerizer.cpp:220] Using isolation: posix/cpu,posix/mem,filesystem/posix,network/cni
W1210 02:15:35.273845 25233 backend.cpp:76] Failed to create 'aufs' backend: AufsBackend requires
root privileges, but is running as user mesos
W1210 02:15:35.273914 25233 backend.cpp:76] Failed to create 'bind' backend: BindBackend requires
root privileges
I1210 02:15:35.275241 25241 slave.cpp:209] Mesos agent started on (660)@172.17.0.3:60285
I1210 02:15:35.275269 25241 slave.cpp:210] Flags at startup: --acls="" --appc_simple_discovery_uri_prefix="http://"
--appc_store_dir="/tmp/mesos/store/appc" --authenticate_http_readonly="true" --authenticate_http_readwrite="true"
--authenticatee="crammd5" --authentication_backoff_factor="1secs" --authorizer="local" --cgroups_cpu_enable_pids_and_tids_count="false"
--cgroups_enable_cfs="false" --cgroups_hierarchy="/sys/fs/cgroup" --cgroups_limit_swap="false"
--cgroups_root="mesos" --container_disk_watch_interval="15secs" --containerizers="mesos" --credential="/tmp/Endpoint_SlaveEndpointTest_AuthorizedRequest_2_UKWqkH/credential"
--default_role="*" --disk_watch_interval="1mins" --docker="docker" --docker_kill_orphans="true"
--docker_registry="https://registry-1.docker.io" --docker_remove_delay="6hrs" --docker_socket="/var/run/docker.sock"
--docker_stop_timeout="0ns" --docker_store_dir="/tmp/mesos/store/docker" --docker_volume_checkpoint_dir="/var/run/mesos/isolators/docker/volume"
--enforce_container_disk_quota="false" --executor_registration_timeout="1mins" --executor_shutdown_grace_period="5secs"
--fetcher_cache_dir="/tmp/Endpoint_SlaveEndpointTest_AuthorizedRequest_2_UKWqkH/fetch" --fetcher_cache_size="2GB"
--frameworks_home="" --gc_delay="1weeks" --gc_disk_headroom="0.1" --hadoop_home="" --help="false"
--hostname_lookup="true" --http_authenticators="basic" --http_command_executor="false" --http_credentials="/tmp/Endpoint_SlaveEndpointTest_AuthorizedRequest_2_UKWqkH/http_credentials"
--image_provisioner_backend="copy" --initialize_driver_logging="true" --io_switchboard_enable_server="true"
--isolation="posix/cpu,posix/mem" --launcher="posix" --launcher_dir="/mesos/build/src" --logbufsecs="0"
--logging_level="INFO" --max_completed_executors_per_framework="150" --oversubscribed_resources_interval="15secs"
--perf_duration="10secs" --perf_interval="1mins" --qos_correction_interval_min="0ns" --quiet="false"
--recover="reconnect" --recovery_timeout="15mins" --registration_backoff_factor="10ms" --resources="cpus:2;gpus:0;mem:1024;disk:1024;ports:[31000-32000]"
--revocable_cpu_low_priority="true" --runtime_dir="/tmp/Endpoint_SlaveEndpointTest_AuthorizedRequest_2_UKWqkH"
--sandbox_directory="/mnt/mesos/sandbox" --strict="true" --switch_user="true" --systemd_enable_support="true"
--systemd_runtime_directory="/run/systemd/system" --version="false" --work_dir="/tmp/Endpoint_SlaveEndpointTest_AuthorizedRequest_2_T6xQR7"
I1210 02:15:35.275599 25241 credentials.hpp:86] Loading credential for authentication from
'/tmp/Endpoint_SlaveEndpointTest_AuthorizedRequest_2_UKWqkH/credential'
I1210 02:15:35.275670 25241 slave.cpp:347] Agent using credential for: test-principal
I1210 02:15:35.275681 25241 credentials.hpp:37] Loading credentials for authentication from
'/tmp/Endpoint_SlaveEndpointTest_AuthorizedRequest_2_UKWqkH/http_credentials'
I1210 02:15:35.275759 25241 http.cpp:922] Using default 'basic' HTTP authenticator for realm
'mesos-agent-readonly'
I1210 02:15:35.275795 25241 http.cpp:922] Using default 'basic' HTTP authenticator for realm
'mesos-agent-readwrite'
I1210 02:15:35.276114 25241 slave.cpp:534] Agent resources: cpus(*):2; mem(*):1024; disk(*):1024;
ports(*):[31000-32000]
I1210 02:15:35.276144 25241 slave.cpp:542] Agent attributes: [  ]
I1210 02:15:35.276152 25241 slave.cpp:547] Agent hostname: 3f03f3f12f58
I1210 02:15:35.276479 25234 state.cpp:57] Recovering state from '/tmp/Endpoint_SlaveEndpointTest_AuthorizedRequest_2_T6xQR7/meta'
I1210 02:15:35.276638 25241 status_update_manager.cpp:203] Recovering status update manager
I1210 02:15:35.276734 25245 containerizer.cpp:594] Recovering containerizer
I1210 02:15:35.277237 25243 provisioner.cpp:253] Provisioner recovery complete
I1210 02:15:35.277433 25245 slave.cpp:5415] Finished recovery
I1210 02:15:35.277766 25245 slave.cpp:5589] Querying resource estimator for oversubscribable
resources
I1210 02:15:35.277932 25249 slave.cpp:5603] Received oversubscribable resources {} from the
resource estimator
I1210 02:15:35.278740 25238 process.cpp:3679] Handling HTTP event for process 'slave(660)'
with path: '/slave(660)/containers'
I1210 02:15:35.279081 25242 http.cpp:874] Authorizing principal 'test-principal' to GET the
'/containers' endpoint
I1210 02:15:35.280172 25242 slave.cpp:791] Agent terminating
[       OK ] Endpoint/SlaveEndpointTest.AuthorizedRequest/2 (11 ms)
[ RUN      ] Endpoint/SlaveEndpointTest.UnauthorizedRequest/0
I1210 02:15:35.284884 25233 containerizer.cpp:220] Using isolation: posix/cpu,posix/mem,filesystem/posix,network/cni
W1210 02:15:35.285169 25233 backend.cpp:76] Failed to create 'aufs' backend: AufsBackend requires
root privileges, but is running as user mesos
W1210 02:15:35.285259 25233 backend.cpp:76] Failed to create 'bind' backend: BindBackend requires
root privileges
I1210 02:15:35.286275 25241 slave.cpp:209] Mesos agent started on (661)@172.17.0.3:60285
I1210 02:15:35.286399 25241 slave.cpp:210] Flags at startup: --acls="" --appc_simple_discovery_uri_prefix="http://"
--appc_store_dir="/tmp/mesos/store/appc" --authenticate_http_readonly="true" --authenticate_http_readwrite="true"
--authenticatee="crammd5" --authentication_backoff_factor="1secs" --authorizer="local" --cgroups_cpu_enable_pids_and_tids_count="false"
--cgroups_enable_cfs="false" --cgroups_hierarchy="/sys/fs/cgroup" --cgroups_limit_swap="false"
--cgroups_root="mesos" --container_disk_watch_interval="15secs" --containerizers="mesos" --credential="/tmp/Endpoint_SlaveEndpointTest_UnauthorizedRequest_0_ulA0gZ/credential"
--default_role="*" --disk_watch_interval="1mins" --docker="docker" --docker_kill_orphans="true"
--docker_registry="https://registry-1.docker.io" --docker_remove_delay="6hrs" --docker_socket="/var/run/docker.sock"
--docker_stop_timeout="0ns" --docker_store_dir="/tmp/mesos/store/docker" --docker_volume_checkpoint_dir="/var/run/mesos/isolators/docker/volume"
--enforce_container_disk_quota="false" --executor_registration_timeout="1mins" --executor_shutdown_grace_period="5secs"
--fetcher_cache_dir="/tmp/Endpoint_SlaveEndpointTest_UnauthorizedRequest_0_ulA0gZ/fetch" --fetcher_cache_size="2GB"
--frameworks_home="" --gc_delay="1weeks" --gc_disk_headroom="0.1" --hadoop_home="" --help="false"
--hostname_lookup="true" --http_authenticators="basic" --http_command_executor="false" --http_credentials="/tmp/Endpoint_SlaveEndpointTest_UnauthorizedRequest_0_ulA0gZ/http_credentials"
--image_provisioner_backend="copy" --initialize_driver_logging="true" --io_switchboard_enable_server="true"
--isolation="posix/cpu,posix/mem" --launcher="posix" --launcher_dir="/mesos/build/src" --logbufsecs="0"
--logging_level="INFO" --max_completed_executors_per_framework="150" --oversubscribed_resources_interval="15secs"
--perf_duration="10secs" --perf_interval="1mins" --qos_correction_interval_min="0ns" --quiet="false"
--recover="reconnect" --recovery_timeout="15mins" --registration_backoff_factor="10ms" --resources="cpus:2;gpus:0;mem:1024;disk:1024;ports:[31000-32000]"
--revocable_cpu_low_priority="true" --runtime_dir="/tmp/Endpoint_SlaveEndpointTest_UnauthorizedRequest_0_ulA0gZ"
--sandbox_directory="/mnt/mesos/sandbox" --strict="true" --switch_user="true" --systemd_enable_support="true"
--systemd_runtime_directory="/run/systemd/system" --version="false" --work_dir="/tmp/Endpoint_SlaveEndpointTest_UnauthorizedRequest_0_HYNzMp"
I1210 02:15:35.286674 25241 credentials.hpp:86] Loading credential for authentication from
'/tmp/Endpoint_SlaveEndpointTest_UnauthorizedRequest_0_ulA0gZ/credential'
I1210 02:15:35.286753 25241 slave.cpp:347] Agent using credential for: test-principal
I1210 02:15:35.286767 25241 credentials.hpp:37] Loading credentials for authentication from
'/tmp/Endpoint_SlaveEndpointTest_UnauthorizedRequest_0_ulA0gZ/http_credentials'
I1210 02:15:35.286864 25241 http.cpp:922] Using default 'basic' HTTP authenticator for realm
'mesos-agent-readonly'
I1210 02:15:35.286902 25241 http.cpp:922] Using default 'basic' HTTP authenticator for realm
'mesos-agent-readwrite'
I1210 02:15:35.287215 25241 slave.cpp:534] Agent resources: cpus(*):2; mem(*):1024; disk(*):1024;
ports(*):[31000-32000]
I1210 02:15:35.287245 25241 slave.cpp:542] Agent attributes: [  ]
I1210 02:15:35.287252 25241 slave.cpp:547] Agent hostname: 3f03f3f12f58
I1210 02:15:35.287576 25239 state.cpp:57] Recovering state from '/tmp/Endpoint_SlaveEndpointTest_UnauthorizedRequest_0_HYNzMp/meta'
I1210 02:15:35.287778 25247 status_update_manager.cpp:203] Recovering status update manager
I1210 02:15:35.287930 25236 containerizer.cpp:594] Recovering containerizer
I1210 02:15:35.288440 25239 provisioner.cpp:253] Provisioner recovery complete
I1210 02:15:35.288615 25236 slave.cpp:5415] Finished recovery
I1210 02:15:35.289093 25236 slave.cpp:5589] Querying resource estimator for oversubscribable
resources
I1210 02:15:35.289276 25245 slave.cpp:5603] Received oversubscribable resources {} from the
resource estimator
I1210 02:15:35.289935 25245 process.cpp:3679] Handling HTTP event for process 'slave(661)'
with path: '/slave(661)/monitor/statistics'
I1210 02:15:35.290442 25246 http.cpp:874] Authorizing principal 'test-principal' to GET the
'/monitor/statistics' endpoint
I1210 02:15:35.291414 25233 slave.cpp:791] Agent terminating
[       OK ] Endpoint/SlaveEndpointTest.UnauthorizedRequest/0 (11 ms)
[ RUN      ] Endpoint/SlaveEndpointTest.UnauthorizedRequest/1
I1210 02:15:35.296800 25233 containerizer.cpp:220] Using isolation: posix/cpu,posix/mem,filesystem/posix,network/cni
W1210 02:15:35.297231 25233 backend.cpp:76] Failed to create 'aufs' backend: AufsBackend requires
root privileges, but is running as user mesos
W1210 02:15:35.297332 25233 backend.cpp:76] Failed to create 'bind' backend: BindBackend requires
root privileges
I1210 02:15:35.298491 25240 slave.cpp:209] Mesos agent started on (662)@172.17.0.3:60285
I1210 02:15:35.298513 25240 slave.cpp:210] Flags at startup: --acls="" --appc_simple_discovery_uri_prefix="http://"
--appc_store_dir="/tmp/mesos/store/appc" --authenticate_http_readonly="true" --authenticate_http_readwrite="true"
--authenticatee="crammd5" --authentication_backoff_factor="1secs" --authorizer="local" --cgroups_cpu_enable_pids_and_tids_count="false"
--cgroups_enable_cfs="false" --cgroups_hierarchy="/sys/fs/cgroup" --cgroups_limit_swap="false"
--cgroups_root="mesos" --container_disk_watch_interval="15secs" --containerizers="mesos" --credential="/tmp/Endpoint_SlaveEndpointTest_UnauthorizedRequest_1_eIqXkh/credential"
--default_role="*" --disk_watch_interval="1mins" --docker="docker" --docker_kill_orphans="true"
--docker_registry="https://registry-1.docker.io" --docker_remove_delay="6hrs" --docker_socket="/var/run/docker.sock"
--docker_stop_timeout="0ns" --docker_store_dir="/tmp/mesos/store/docker" --docker_volume_checkpoint_dir="/var/run/mesos/isolators/docker/volume"
--enforce_container_disk_quota="false" --executor_registration_timeout="1mins" --executor_shutdown_grace_period="5secs"
--fetcher_cache_dir="/tmp/Endpoint_SlaveEndpointTest_UnauthorizedRequest_1_eIqXkh/fetch" --fetcher_cache_size="2GB"
--frameworks_home="" --gc_delay="1weeks" --gc_disk_headroom="0.1" --hadoop_home="" --help="false"
--hostname_lookup="true" --http_authenticators="basic" --http_command_executor="false" --http_credentials="/tmp/Endpoint_SlaveEndpointTest_UnauthorizedRequest_1_eIqXkh/http_credentials"
--image_provisioner_backend="copy" --initialize_driver_logging="true" --io_switchboard_enable_server="true"
--isolation="posix/cpu,posix/mem" --launcher="posix" --launcher_dir="/mesos/build/src" --logbufsecs="0"
--logging_level="INFO" --max_completed_executors_per_framework="150" --oversubscribed_resources_interval="15secs"
--perf_duration="10secs" --perf_interval="1mins" --qos_correction_interval_min="0ns" --quiet="false"
--recover="reconnect" --recovery_timeout="15mins" --registration_backoff_factor="10ms" --resources="cpus:2;gpus:0;mem:1024;disk:1024;ports:[31000-32000]"
--revocable_cpu_low_priority="true" --runtime_dir="/tmp/Endpoint_SlaveEndpointTest_UnauthorizedRequest_1_eIqXkh"
--sandbox_directory="/mnt/mesos/sandbox" --strict="true" --switch_user="true" --systemd_enable_support="true"
--systemd_runtime_directory="/run/systemd/system" --version="false" --work_dir="/tmp/Endpoint_SlaveEndpointTest_UnauthorizedRequest_1_VUgFOH"
I1210 02:15:35.298780 25240 credentials.hpp:86] Loading credential for authentication from
'/tmp/Endpoint_SlaveEndpointTest_UnauthorizedRequest_1_eIqXkh/credential'
I1210 02:15:35.298897 25240 slave.cpp:347] Agent using credential for: test-principal
I1210 02:15:35.298909 25240 credentials.hpp:37] Loading credentials for authentication from
'/tmp/Endpoint_SlaveEndpointTest_UnauthorizedRequest_1_eIqXkh/http_credentials'
I1210 02:15:35.299010 25240 http.cpp:922] Using default 'basic' HTTP authenticator for realm
'mesos-agent-readonly'
I1210 02:15:35.299068 25240 http.cpp:922] Using default 'basic' HTTP authenticator for realm
'mesos-agent-readwrite'
I1210 02:15:35.299382 25240 slave.cpp:534] Agent resources: cpus(*):2; mem(*):1024; disk(*):1024;
ports(*):[31000-32000]
I1210 02:15:35.299413 25240 slave.cpp:542] Agent attributes: [  ]
I1210 02:15:35.299422 25240 slave.cpp:547] Agent hostname: 3f03f3f12f58
I1210 02:15:35.299845 25244 state.cpp:57] Recovering state from '/tmp/Endpoint_SlaveEndpointTest_UnauthorizedRequest_1_VUgFOH/meta'
I1210 02:15:35.300024 25249 status_update_manager.cpp:203] Recovering status update manager
I1210 02:15:35.300104 25242 containerizer.cpp:594] Recovering containerizer
I1210 02:15:35.300624 25237 provisioner.cpp:253] Provisioner recovery complete
I1210 02:15:35.300806 25242 slave.cpp:5415] Finished recovery
I1210 02:15:35.301136 25242 slave.cpp:5589] Querying resource estimator for oversubscribable
resources
I1210 02:15:35.301270 25241 slave.cpp:5603] Received oversubscribable resources {} from the
resource estimator
I1210 02:15:35.301995 25249 process.cpp:3679] Handling HTTP event for process 'slave(662)'
with path: '/slave(662)/monitor/statistics.json'
I1210 02:15:35.302418 25249 http.cpp:874] Authorizing principal 'test-principal' to GET the
'/monitor/statistics.json' endpoint
I1210 02:15:35.303697 25233 slave.cpp:791] Agent terminating
[       OK ] Endpoint/SlaveEndpointTest.UnauthorizedRequest/1 (11 ms)
[ RUN      ] Endpoint/SlaveEndpointTest.UnauthorizedRequest/2
I1210 02:15:35.308199 25233 containerizer.cpp:220] Using isolation: posix/cpu,posix/mem,filesystem/posix,network/cni
W1210 02:15:35.308486 25233 backend.cpp:76] Failed to create 'aufs' backend: AufsBackend requires
root privileges, but is running as user mesos
W1210 02:15:35.308562 25233 backend.cpp:76] Failed to create 'bind' backend: BindBackend requires
root privileges
I1210 02:15:35.309767 25243 slave.cpp:209] Mesos agent started on (663)@172.17.0.3:60285
I1210 02:15:35.309794 25243 slave.cpp:210] Flags at startup: --acls="" --appc_simple_discovery_uri_prefix="http://"
--appc_store_dir="/tmp/mesos/store/appc" --authenticate_http_readonly="true" --authenticate_http_readwrite="true"
--authenticatee="crammd5" --authentication_backoff_factor="1secs" --authorizer="local" --cgroups_cpu_enable_pids_and_tids_count="false"
--cgroups_enable_cfs="false" --cgroups_hierarchy="/sys/fs/cgroup" --cgroups_limit_swap="false"
--cgroups_root="mesos" --container_disk_watch_interval="15secs" --containerizers="mesos" --credential="/tmp/Endpoint_SlaveEndpointTest_UnauthorizedRequest_2_6NdGwz/credential"
--default_role="*" --disk_watch_interval="1mins" --docker="docker" --docker_kill_orphans="true"
--docker_registry="https://registry-1.docker.io" --docker_remove_delay="6hrs" --docker_socket="/var/run/docker.sock"
--docker_stop_timeout="0ns" --docker_store_dir="/tmp/mesos/store/docker" --docker_volume_checkpoint_dir="/var/run/mesos/isolators/docker/volume"
--enforce_container_disk_quota="false" --executor_registration_timeout="1mins" --executor_shutdown_grace_period="5secs"
--fetcher_cache_dir="/tmp/Endpoint_SlaveEndpointTest_UnauthorizedRequest_2_6NdGwz/fetch" --fetcher_cache_size="2GB"
--frameworks_home="" --gc_delay="1weeks" --gc_disk_headroom="0.1" --hadoop_home="" --help="false"
--hostname_lookup="true" --http_authenticators="basic" --http_command_executor="false" --http_credentials="/tmp/Endpoint_SlaveEndpointTest_UnauthorizedRequest_2_6NdGwz/http_credentials"
--image_provisioner_backend="copy" --initialize_driver_logging="true" --io_switchboard_enable_server="true"
--isolation="posix/cpu,posix/mem" --launcher="posix" --launcher_dir="/mesos/build/src" --logbufsecs="0"
--logging_level="INFO" --max_completed_executors_per_framework="150" --oversubscribed_resources_interval="15secs"
--perf_duration="10secs" --perf_interval="1mins" --qos_correction_interval_min="0ns" --quiet="false"
--recover="reconnect" --recovery_timeout="15mins" --registration_backoff_factor="10ms" --resources="cpus:2;gpus:0;mem:1024;disk:1024;ports:[31000-32000]"
--revocable_cpu_low_priority="true" --runtime_dir="/tmp/Endpoint_SlaveEndpointTest_UnauthorizedRequest_2_6NdGwz"
--sandbox_directory="/mnt/mesos/sandbox" --strict="true" --switch_user="true" --systemd_enable_support="true"
--systemd_runtime_directory="/run/systemd/system" --version="false" --work_dir="/tmp/Endpoint_SlaveEndpointTest_UnauthorizedRequest_2_DlJsYZ"
I1210 02:15:35.310096 25243 credentials.hpp:86] Loading credential for authentication from
'/tmp/Endpoint_SlaveEndpointTest_UnauthorizedRequest_2_6NdGwz/credential'
I1210 02:15:35.310166 25243 slave.cpp:347] Agent using credential for: test-principal
I1210 02:15:35.310178 25243 credentials.hpp:37] Loading credentials for authentication from
'/tmp/Endpoint_SlaveEndpointTest_UnauthorizedRequest_2_6NdGwz/http_credentials'
I1210 02:15:35.310272 25243 http.cpp:922] Using default 'basic' HTTP authenticator for realm
'mesos-agent-readonly'
I1210 02:15:35.310322 25243 http.cpp:922] Using default 'basic' HTTP authenticator for realm
'mesos-agent-readwrite'
I1210 02:15:35.310732 25243 slave.cpp:534] Agent resources: cpus(*):2; mem(*):1024; disk(*):1024;
ports(*):[31000-32000]
I1210 02:15:35.310766 25243 slave.cpp:542] Agent attributes: [  ]
I1210 02:15:35.310776 25243 slave.cpp:547] Agent hostname: 3f03f3f12f58
I1210 02:15:35.311192 25245 state.cpp:57] Recovering state from '/tmp/Endpoint_SlaveEndpointTest_UnauthorizedRequest_2_DlJsYZ/meta'
I1210 02:15:35.311353 25248 status_update_manager.cpp:203] Recovering status update manager
I1210 02:15:35.311460 25236 containerizer.cpp:594] Recovering containerizer
I1210 02:15:35.312093 25245 provisioner.cpp:253] Provisioner recovery complete
I1210 02:15:35.312285 25238 slave.cpp:5415] Finished recovery
I1210 02:15:35.312669 25238 slave.cpp:5589] Querying resource estimator for oversubscribable
resources
I1210 02:15:35.312796 25246 slave.cpp:5603] Received oversubscribable resources {} from the
resource estimator
I1210 02:15:35.313313 25245 process.cpp:3679] Handling HTTP event for process 'slave(663)'
with path: '/slave(663)/containers'
I1210 02:15:35.313678 25245 http.cpp:874] Authorizing principal 'test-principal' to GET the
'/containers' endpoint
I1210 02:15:35.314762 25233 slave.cpp:791] Agent terminating
[       OK ] Endpoint/SlaveEndpointTest.UnauthorizedRequest/2 (10 ms)
[ RUN      ] Endpoint/SlaveEndpointTest.NoAuthorizer/0
I1210 02:15:35.320458 25233 containerizer.cpp:220] Using isolation: posix/cpu,posix/mem,filesystem/posix,network/cni
W1210 02:15:35.320837 25233 backend.cpp:76] Failed to create 'aufs' backend: AufsBackend requires
root privileges, but is running as user mesos
W1210 02:15:35.320926 25233 backend.cpp:76] Failed to create 'bind' backend: BindBackend requires
root privileges
I1210 02:15:35.321718 25233 cluster.cpp:446] Creating default 'local' authorizer
I1210 02:15:35.322386 25242 slave.cpp:209] Mesos agent started on (664)@172.17.0.3:60285
I1210 02:15:35.322420 25242 slave.cpp:210] Flags at startup: --acls="" --appc_simple_discovery_uri_prefix="http://"
--appc_store_dir="/tmp/mesos/store/appc" --authenticate_http_readonly="true" --authenticate_http_readwrite="true"
--authenticatee="crammd5" --authentication_backoff_factor="1secs" --authorizer="local" --cgroups_cpu_enable_pids_and_tids_count="false"
--cgroups_enable_cfs="false" --cgroups_hierarchy="/sys/fs/cgroup" --cgroups_limit_swap="false"
--cgroups_root="mesos" --container_disk_watch_interval="15secs" --containerizers="mesos" --credential="/tmp/Endpoint_SlaveEndpointTest_NoAuthorizer_0_MgMUPR/credential"
--default_role="*" --disk_watch_interval="1mins" --docker="docker" --docker_kill_orphans="true"
--docker_registry="https://registry-1.docker.io" --docker_remove_delay="6hrs" --docker_socket="/var/run/docker.sock"
--docker_stop_timeout="0ns" --docker_store_dir="/tmp/mesos/store/docker" --docker_volume_checkpoint_dir="/var/run/mesos/isolators/docker/volume"
--enforce_container_disk_quota="false" --executor_registration_timeout="1mins" --executor_shutdown_grace_period="5secs"
--fetcher_cache_dir="/tmp/Endpoint_SlaveEndpointTest_NoAuthorizer_0_MgMUPR/fetch" --fetcher_cache_size="2GB"
--frameworks_home="" --gc_delay="1weeks" --gc_disk_headroom="0.1" --hadoop_home="" --help="false"
--hostname_lookup="true" --http_authenticators="basic" --http_command_executor="false" --http_credentials="/tmp/Endpoint_SlaveEndpointTest_NoAuthorizer_0_MgMUPR/http_credentials"
--image_provisioner_backend="copy" --initialize_driver_logging="true" --io_switchboard_enable_server="true"
--isolation="posix/cpu,posix/mem" --launcher="posix" --launcher_dir="/mesos/build/src" --logbufsecs="0"
--logging_level="INFO" --max_completed_executors_per_framework="150" --oversubscribed_resources_interval="15secs"
--perf_duration="10secs" --perf_interval="1mins" --qos_correction_interval_min="0ns" --quiet="false"
--recover="reconnect" --recovery_timeout="15mins" --registration_backoff_factor="10ms" --resources="cpus:2;gpus:0;mem:1024;disk:1024;ports:[31000-32000]"
--revocable_cpu_low_priority="true" --runtime_dir="/tmp/Endpoint_SlaveEndpointTest_NoAuthorizer_0_MgMUPR"
--sandbox_directory="/mnt/mesos/sandbox" --strict="true" --switch_user="true" --systemd_enable_support="true"
--systemd_runtime_directory="/run/systemd/system" --version="false" --work_dir="/tmp/Endpoint_SlaveEndpointTest_NoAuthorizer_0_xFqNfi"
I1210 02:15:35.322933 25242 credentials.hpp:86] Loading credential for authentication from
'/tmp/Endpoint_SlaveEndpointTest_NoAuthorizer_0_MgMUPR/credential'
I1210 02:15:35.323050 25242 slave.cpp:347] Agent using credential for: test-principal
I1210 02:15:35.323068 25242 credentials.hpp:37] Loading credentials for authentication from
'/tmp/Endpoint_SlaveEndpointTest_NoAuthorizer_0_MgMUPR/http_credentials'
I1210 02:15:35.323225 25242 http.cpp:922] Using default 'basic' HTTP authenticator for realm
'mesos-agent-readonly'
I1210 02:15:35.323293 25242 http.cpp:922] Using default 'basic' HTTP authenticator for realm
'mesos-agent-readwrite'
I1210 02:15:35.323777 25242 slave.cpp:534] Agent resources: cpus(*):2; mem(*):1024; disk(*):1024;
ports(*):[31000-32000]
I1210 02:15:35.323822 25242 slave.cpp:542] Agent attributes: [  ]
I1210 02:15:35.323832 25242 slave.cpp:547] Agent hostname: 3f03f3f12f58
I1210 02:15:35.324306 25245 state.cpp:57] Recovering state from '/tmp/Endpoint_SlaveEndpointTest_NoAuthorizer_0_xFqNfi/meta'
I1210 02:15:35.324514 25244 status_update_manager.cpp:203] Recovering status update manager
I1210 02:15:35.324636 25237 containerizer.cpp:594] Recovering containerizer
I1210 02:15:35.325376 25240 provisioner.cpp:253] Provisioner recovery complete
I1210 02:15:35.325557 25239 slave.cpp:5415] Finished recovery
I1210 02:15:35.326006 25239 slave.cpp:5589] Querying resource estimator for oversubscribable
resources
I1210 02:15:35.326278 25249 slave.cpp:5603] Received oversubscribable resources {} from the
resource estimator
I1210 02:15:35.327155 25245 process.cpp:3679] Handling HTTP event for process 'slave(664)'
with path: '/slave(664)/monitor/statistics'
I1210 02:15:35.327559 25247 http.cpp:874] Authorizing principal 'test-principal' to GET the
'/monitor/statistics' endpoint
I1210 02:15:35.328881 25233 slave.cpp:791] Agent terminating
[       OK ] Endpoint/SlaveEndpointTest.NoAuthorizer/0 (13 ms)
[ RUN      ] Endpoint/SlaveEndpointTest.NoAuthorizer/1
I1210 02:15:35.333487 25233 containerizer.cpp:220] Using isolation: posix/cpu,posix/mem,filesystem/posix,network/cni
W1210 02:15:35.333788 25233 backend.cpp:76] Failed to create 'aufs' backend: AufsBackend requires
root privileges, but is running as user mesos
W1210 02:15:35.333863 25233 backend.cpp:76] Failed to create 'bind' backend: BindBackend requires
root privileges
I1210 02:15:35.334643 25233 cluster.cpp:446] Creating default 'local' authorizer
I1210 02:15:35.335237 25241 slave.cpp:209] Mesos agent started on (665)@172.17.0.3:60285
I1210 02:15:35.335266 25241 slave.cpp:210] Flags at startup: --acls="" --appc_simple_discovery_uri_prefix="http://"
--appc_store_dir="/tmp/mesos/store/appc" --authenticate_http_readonly="true" --authenticate_http_readwrite="true"
--authenticatee="crammd5" --authentication_backoff_factor="1secs" --authorizer="local" --cgroups_cpu_enable_pids_and_tids_count="false"
--cgroups_enable_cfs="false" --cgroups_hierarchy="/sys/fs/cgroup" --cgroups_limit_swap="false"
--cgroups_root="mesos" --container_disk_watch_interval="15secs" --containerizers="mesos" --credential="/tmp/Endpoint_SlaveEndpointTest_NoAuthorizer_1_mEAQha/credential"
--default_role="*" --disk_watch_interval="1mins" --docker="docker" --docker_kill_orphans="true"
--docker_registry="https://registry-1.docker.io" --docker_remove_delay="6hrs" --docker_socket="/var/run/docker.sock"
--docker_stop_timeout="0ns" --docker_store_dir="/tmp/mesos/store/docker" --docker_volume_checkpoint_dir="/var/run/mesos/isolators/docker/volume"
--enforce_container_disk_quota="false" --executor_registration_timeout="1mins" --executor_shutdown_grace_period="5secs"
--fetcher_cache_dir="/tmp/Endpoint_SlaveEndpointTest_NoAuthorizer_1_mEAQha/fetch" --fetcher_cache_size="2GB"
--frameworks_home="" --gc_delay="1weeks" --gc_disk_headroom="0.1" --hadoop_home="" --help="false"
--hostname_lookup="true" --http_authenticators="basic" --http_command_executor="false" --http_credentials="/tmp/Endpoint_SlaveEndpointTest_NoAuthorizer_1_mEAQha/http_credentials"
--image_provisioner_backend="copy" --initialize_driver_logging="true" --io_switchboard_enable_server="true"
--isolation="posix/cpu,posix/mem" --launcher="posix" --launcher_dir="/mesos/build/src" --logbufsecs="0"
--logging_level="INFO" --max_completed_executors_per_framework="150" --oversubscribed_resources_interval="15secs"
--perf_duration="10secs" --perf_interval="1mins" --qos_correction_interval_min="0ns" --quiet="false"
--recover="reconnect" --recovery_timeout="15mins" --registration_backoff_factor="10ms" --resources="cpus:2;gpus:0;mem:1024;disk:1024;ports:[31000-32000]"
--revocable_cpu_low_priority="true" --runtime_dir="/tmp/Endpoint_SlaveEndpointTest_NoAuthorizer_1_mEAQha"
--sandbox_directory="/mnt/mesos/sandbox" --strict="true" --switch_user="true" --systemd_enable_support="true"
--systemd_runtime_directory="/run/systemd/system" --version="false" --work_dir="/tmp/Endpoint_SlaveEndpointTest_NoAuthorizer_1_VCpzFA"
I1210 02:15:35.335779 25241 credentials.hpp:86] Loading credential for authentication from
'/tmp/Endpoint_SlaveEndpointTest_NoAuthorizer_1_mEAQha/credential'
I1210 02:15:35.335893 25241 slave.cpp:347] Agent using credential for: test-principal
I1210 02:15:35.335911 25241 credentials.hpp:37] Loading credentials for authentication from
'/tmp/Endpoint_SlaveEndpointTest_NoAuthorizer_1_mEAQha/http_credentials'
I1210 02:15:35.336062 25241 http.cpp:922] Using default 'basic' HTTP authenticator for realm
'mesos-agent-readonly'
I1210 02:15:35.336135 25241 http.cpp:922] Using default 'basic' HTTP authenticator for realm
'mesos-agent-readwrite'
I1210 02:15:35.336642 25241 slave.cpp:534] Agent resources: cpus(*):2; mem(*):1024; disk(*):1024;
ports(*):[31000-32000]
I1210 02:15:35.336686 25241 slave.cpp:542] Agent attributes: [  ]
I1210 02:15:35.336699 25241 slave.cpp:547] Agent hostname: 3f03f3f12f58
I1210 02:15:35.337205 25247 state.cpp:57] Recovering state from '/tmp/Endpoint_SlaveEndpointTest_NoAuthorizer_1_VCpzFA/meta'
I1210 02:15:35.337402 25239 status_update_manager.cpp:203] Recovering status update manager
I1210 02:15:35.337491 25237 containerizer.cpp:594] Recovering containerizer
I1210 02:15:35.338225 25241 provisioner.cpp:253] Provisioner recovery complete
I1210 02:15:35.338490 25237 slave.cpp:5415] Finished recovery
I1210 02:15:35.338927 25237 slave.cpp:5589] Querying resource estimator for oversubscribable
resources
I1210 02:15:35.339069 25245 slave.cpp:5603] Received oversubscribable resources {} from the
resource estimator
I1210 02:15:35.339953 25249 process.cpp:3679] Handling HTTP event for process 'slave(665)'
with path: '/slave(665)/monitor/statistics.json'
I1210 02:15:35.340600 25238 http.cpp:874] Authorizing principal 'test-principal' to GET the
'/monitor/statistics.json' endpoint
I1210 02:15:35.342357 25240 slave.cpp:791] Agent terminating
[       OK ] Endpoint/SlaveEndpointTest.NoAuthorizer/1 (14 ms)
[ RUN      ] Endpoint/SlaveEndpointTest.NoAuthorizer/2
I1210 02:15:35.349020 25233 containerizer.cpp:220] Using isolation: posix/cpu,posix/mem,filesystem/posix,network/cni
W1210 02:15:35.349411 25233 backend.cpp:76] Failed to create 'aufs' backend: AufsBackend requires
root privileges, but is running as user mesos
W1210 02:15:35.349519 25233 backend.cpp:76] Failed to create 'bind' backend: BindBackend requires
root privileges
I1210 02:15:35.350270 25233 cluster.cpp:446] Creating default 'local' authorizer
I1210 02:15:35.350872 25240 slave.cpp:209] Mesos agent started on (666)@172.17.0.3:60285
I1210 02:15:35.350899 25240 slave.cpp:210] Flags at startup: --acls="" --appc_simple_discovery_uri_prefix="http://"
--appc_store_dir="/tmp/mesos/store/appc" --authenticate_http_readonly="true" --authenticate_http_readwrite="true"
--authenticatee="crammd5" --authentication_backoff_factor="1secs" --authorizer="local" --cgroups_cpu_enable_pids_and_tids_count="false"
--cgroups_enable_cfs="false" --cgroups_hierarchy="/sys/fs/cgroup" --cgroups_limit_swap="false"
--cgroups_root="mesos" --container_disk_watch_interval="15secs" --containerizers="mesos" --credential="/tmp/Endpoint_SlaveEndpointTest_NoAuthorizer_2_o9NgTs/credential"
--default_role="*" --disk_watch_interval="1mins" --docker="docker" --docker_kill_orphans="true"
--docker_registry="https://registry-1.docker.io" --docker_remove_delay="6hrs" --docker_socket="/var/run/docker.sock"
--docker_stop_timeout="0ns" --docker_store_dir="/tmp/mesos/store/docker" --docker_volume_checkpoint_dir="/var/run/mesos/isolators/docker/volume"
--enforce_container_disk_quota="false" --executor_registration_timeout="1mins" --executor_shutdown_grace_period="5secs"
--fetcher_cache_dir="/tmp/Endpoint_SlaveEndpointTest_NoAuthorizer_2_o9NgTs/fetch" --fetcher_cache_size="2GB"
--frameworks_home="" --gc_delay="1weeks" --gc_disk_headroom="0.1" --hadoop_home="" --help="false"
--hostname_lookup="true" --http_authenticators="basic" --http_command_executor="false" --http_credentials="/tmp/Endpoint_SlaveEndpointTest_NoAuthorizer_2_o9NgTs/http_credentials"
--image_provisioner_backend="copy" --initialize_driver_logging="true" --io_switchboard_enable_server="true"
--isolation="posix/cpu,posix/mem" --launcher="posix" --launcher_dir="/mesos/build/src" --logbufsecs="0"
--logging_level="INFO" --max_completed_executors_per_framework="150" --oversubscribed_resources_interval="15secs"
--perf_duration="10secs" --perf_interval="1mins" --qos_correction_interval_min="0ns" --quiet="false"
--recover="reconnect" --recovery_timeout="15mins" --registration_backoff_factor="10ms" --resources="cpus:2;gpus:0;mem:1024;disk:1024;ports:[31000-32000]"
--revocable_cpu_low_priority="true" --runtime_dir="/tmp/Endpoint_SlaveEndpointTest_NoAuthorizer_2_o9NgTs"
--sandbox_directory="/mnt/mesos/sandbox" --strict="true" --switch_user="true" --systemd_enable_support="true"
--systemd_runtime_directory="/run/systemd/system" --version="false" --work_dir="/tmp/Endpoint_SlaveEndpointTest_NoAuthorizer_2_nrOveT"
I1210 02:15:35.351361 25240 credentials.hpp:86] Loading credential for authentication from
'/tmp/Endpoint_SlaveEndpointTest_NoAuthorizer_2_o9NgTs/credential'
I1210 02:15:35.351485 25240 slave.cpp:347] Agent using credential for: test-principal
I1210 02:15:35.351503 25240 credentials.hpp:37] Loading credentials for authentication from
'/tmp/Endpoint_SlaveEndpointTest_NoAuthorizer_2_o9NgTs/http_credentials'
I1210 02:15:35.351634 25240 http.cpp:922] Using default 'basic' HTTP authenticator for realm
'mesos-agent-readonly'
I1210 02:15:35.351703 25240 http.cpp:922] Using default 'basic' HTTP authenticator for realm
'mesos-agent-readwrite'
I1210 02:15:35.352161 25240 slave.cpp:534] Agent resources: cpus(*):2; mem(*):1024; disk(*):1024;
ports(*):[31000-32000]
I1210 02:15:35.352203 25240 slave.cpp:542] Agent attributes: [  ]
I1210 02:15:35.352210 25240 slave.cpp:547] Agent hostname: 3f03f3f12f58
I1210 02:15:35.352663 25247 state.cpp:57] Recovering state from '/tmp/Endpoint_SlaveEndpointTest_NoAuthorizer_2_nrOveT/meta'
I1210 02:15:35.352854 25243 status_update_manager.cpp:203] Recovering status update manager
I1210 02:15:35.353045 25236 containerizer.cpp:594] Recovering containerizer
I1210 02:15:35.353638 25243 provisioner.cpp:253] Provisioner recovery complete
I1210 02:15:35.353855 25234 slave.cpp:5415] Finished recovery
I1210 02:15:35.354271 25234 slave.cpp:5589] Querying resource estimator for oversubscribable
resources
I1210 02:15:35.354517 25242 slave.cpp:5603] Received oversubscribable resources {} from the
resource estimator
I1210 02:15:35.355270 25246 process.cpp:3679] Handling HTTP event for process 'slave(666)'
with path: '/slave(666)/containers'
I1210 02:15:35.355820 25235 http.cpp:874] Authorizing principal 'test-principal' to GET the
'/containers' endpoint
I1210 02:15:35.357126 25243 slave.cpp:791] Agent terminating
[       OK ] Endpoint/SlaveEndpointTest.NoAuthorizer/2 (13 ms)
[----------] 9 tests from Endpoint/SlaveEndpointTest (116 ms total)

[----------] Global test environment tear-down
[==========] 1376 tests from 157 test cases ran. (261215 ms total)
[  PASSED  ] 1375 tests.
[  FAILED  ] 1 test, listed below:
[  FAILED  ] DiskResource/PersistentVolumeTest.SharedPersistentVolumeMasterFailover/1, where
GetParam() = 1

 1 FAILED TEST
  YOU HAVE 9 DISABLED TESTS

make[3]: *** [CMakeFiles/check] Error 1
make[3]: Leaving directory `/mesos/build'
make[2]: *** [CMakeFiles/check.dir/all] Error 2
make[2]: Leaving directory `/mesos/build'
make[1]: *** [CMakeFiles/check.dir/rule] Error 2
make[1]: Leaving directory `/mesos/build'
make: *** [check] Error 2
+ docker rmi mesos-1481333904-10568
Untagged: mesos-1481333904-10568:latest
Deleted: sha256:dbf7a75e491c20278d780f0c2a2c97f8a8a7e7a8307c3d712a579718a6c905f7
Deleted: sha256:223eb018508aeb99501b6cd5370e03ece86038d99dffe4a67504d1bc1adcf0a2
Deleted: sha256:01ae5748eb45abdcb55a256652e9e025545257ba61456f1065def9b9f08633a5
Deleted: sha256:ce24caff180da659324167f6a32eaf9bf192e39cf8f82906d70667110b20029d
Deleted: sha256:c11c31a73b13fa692393df93d050defa1264d1e64a988081274dad61a9552f8a
Deleted: sha256:cc5ba86626266dfe941e3d260c73f3c008160a48fd283fff7f086eb3b7553c6f
Deleted: sha256:17dc5ad5e1a4db571ecb2a7afec98c2c1b27fc8c44d6829d37b0ed42af948c64
Deleted: sha256:9aade1d943058d599999ee7ef68264b86113eddc8c5021e5aeab44c63bc3130d
Deleted: sha256:dbac7539fc6690e226b49439b2e94836d8d6fbfb323702f5ec6e0883e09cda7f
Deleted: sha256:332aeded73720a63cae8ce39d70f27c593d24783b74193f52b101063efe26024
Deleted: sha256:1fa9720e0cfa0183a4612d6944f782d2df0347acb1d7b4dea2f4887cd7023adc
Deleted: sha256:8276378dd2b8dde0e42739cb2d1fc9ba8814a6b63129cb1195f33b4b17d3706f
Deleted: sha256:cf8495de2932a1a6b8146756622cb83affcf434d02c40f6434c3f83e67e82fec
Deleted: sha256:04f70adfb1725731841734c8e04c893bb9e801be6e6d5ed66d7a42b6dcf00325
Deleted: sha256:ec6117fceb2fd224740b68f48b483c62f3935a414150b178bd9472daf51b5836
Deleted: sha256:d253633b300e7d4abda1a337d531493b2e02be3db1c081e0386e46df97d9962f
Deleted: sha256:09b6996a8706128e1aadf3a167a7189e8c1127c97ce76bf1c1c5cedd08e29e45
Deleted: sha256:40d9cf6cf5a5aa696acf00e423088fb627ad1cd351edc8f46e37478870f99312
Deleted: sha256:77a2dcf7d2ec4da9346c1c48e204ed4a17cd1714333774b73d2bc93782d2edc7
Deleted: sha256:814e8844004af37e3af5facda492aaab05929d4dd85e41b72a43e94ee51be94f
Deleted: sha256:dbdf5797545b3f0ef3cc651584b63235b17ddfbe916607694ead2915713a3602
Deleted: sha256:5e9def7afbc33a58abc4fbeccdaa183a5a85e0355ff174dd44ed0b60debb9521
Deleted: sha256:795820903523a9f345b15190477a13507de5c68657aafc8e4ffa9b907a70dfcc
Deleted: sha256:c44025b665fe2705af22a1ddeac50331c2033d2efc8ec5273312fba4124b5332
Build step 'Execute shell' marked build as failure

Mime
View raw message