mesos-builds mailing list archives

Site index · List index
Message view « Date » · « Thread »
Top « Date » · « Thread »
From Apache Jenkins Server <jenk...@builds.apache.org>
Subject Build failed in Jenkins: Mesos-Windows #930
Date Tue, 06 Dec 2016 02:56:05 GMT
See <https://builds.apache.org/job/Mesos-Windows/930/changes>

Changes:

[anand] Made sure parser settings member is properly initialized.

------------------------------------------
[...truncated 7299 lines...]
W1205 18:56:06.240566  4564 fcntl.hpp:30] `os::cloexec` has been called, but is a no-op on
Windows
W1205 18:56:06.241559  4564 fcntl.hpp:82] `os::isNonblock` has been called, but is a stub
on Windows
W1205 18:56:06.242565   360 fcntl.hpp:82] `os::isNonblock` has been called, but is a[    
  OK ] HTTPConnectionTest.RequestStreaming (23 ms)
[----------] 8 tests from HTTPConnectionTest (185 ms total)

[----------] 2 tests from URLTest
[ RUN      ] URLTest.Stringification
[       OK ] URLTest.Stringification (1 ms)
[ RUN      ] URLTest.ParseUrls
[       OK ] URLTest.ParseUrls (1 ms)
[----------] 2 tests from URLTest (2 ms total)

[----------] 6 tests from HttpAuthenticationTest
[ RUN      ] HttpAuthenticationTest.NoAuthenticator
[       OK ] HttpAuthenticationTest.NoAuthenticator (19 ms)
[ RUN      ] HttpAuthenticationTest.Unauthorized
[       OK ] HttpAuthenticationTest.Unauthorized (21 ms)
[ RUN      ] HttpAuthenticationTest.Forbidden
[       OK ] HttpAuthenticationTest.Forbidden (20 ms)
[ RUN      ] HttpAuthenticationTest.Authenticated
[       OK ] HttpAuthenticationTest.Authenticated (21 ms)
[ RUN      ] HttpAuthenticationTest.Pipelining
[       OK ] HttpAuthenticationTest.Pipelining (32 ms)
[ RUN      ] HttpAuthenticationTest.Basic
 stub on Windows
W1205 18:56:06.246567  4564 fcntl.hpp:82] `os::isNonblock` has been called, but is a stub
on Windows
W1205 18:56:06.250558  4564 fcntl.hpp:82] `os::isNonblock` has been called, but is a stub
on Windows
W1205 18:56:06.251551  4564 fcntl.hpp:82] `os::isNonblock` has been called, but is a stub
on Windows
W1205 18:56:06.259603   360 fcntl.hpp:82] `os::isNonblock` has been called, but is a stub
on Windows
W1205 18:56:06.267577  4536 fcntl.hpp:30] `os::cloexec` has been called, but is a no-op on
Windows
W1205 18:56:06.268569  4564 fcntl.hpp:30] `os::cloexec` has been called, but is a no-op on
Windows
W1205 18:56:06.268569  4564 fcntl.hpp:82] `os::isNonblock` has been called, but is a stub
on Windows
W1205 18:56:06.270910   360 fcntl.hpp:82] `os::isNonblock` has been called, but is a stub
on Windows
W1205 18:56:06.274571  4564 fcntl.hpp:82] `os::isNonblock` has been called, but is a stub
on Windows
W1205 18:56:06.288566  4536 fcntl.hpp:30] `os::cloexec` has been called, but is a no-op on
Windows
W1205 18:56:06.288566  4564 fcntl.hpp:30] `os::cloexec` has been called, but is a no-op on
Windows
W1205 18:56:06.289563  4564 fcntl.hpp:82] `os::isNonblock` has been called, but is a stub
on Windows
W1205 18:56:06.290577  5052 fcntl.hpp:82] `os::isNonblock` has been called, but is a stub
on Windows
W1205 18:56:06.292573  4564 fcntl.hpp:82] `os::isNonblock` has been called, but is a stub
on Windows
W1205 18:56:06.309563  4536 fcntl.hpp:30] `os::cloexec` has been called, but is a no-op on
Windows
W1205 18:56:06.310560  4564 fcntl.hpp:30] `os::cloexec` has been called, but is a no-op on
Windows
W1205 18:56:06.310560  4564 fcntl.hpp:82] `os::isNonblock` has been called, but is a stub
on Windows
W1205 18:56:06.311571  3268 fcntl.hpp:82] `os::isNonblock` has been called, but is a stub
on Windows
W1205 18:56:06.315582  4564 fcntl.hpp:82] `os::isNonblock` has been called, but is a stub
on Windows
W1205 18:56:06.328563  4536 fcntl.hpp:30] `os::cloexec` has been called, but is a no-op on
Windows
W1205 18:56:06.329567  4564 fcntl.hpp:30] `os::cloexec` has been called, but is a no-op on
Windows
W1205 18:56:06.330605  4564 fcntl.hpp:82] `os::isNonblock` has been called, but is a stub
on Windows
W1205 18:56:06.331564   360 fcntl.hpp:82] `os::isNonblock` has been called, but is a stub
on Windows
W1205 18:56:06.335572  4564 fcntl.hpp:82] `os::isNonblock` has been called, but is a stub
on Windows
W1205 18:56:06.352565  4536 fcntl.hpp:30] `os::cloexec` has been called, but is a no-op on
Windows
W1205 18:56:06.352565  4564 fcntl.hpp:30] `os::cloexec` has been called, but is a no-op on
Windows
W1205 18:56:06.353569  4564 fcntl.hpp:82] `os::isNonblock` has been called, but is a stub
on Windows
W1205 18:56:06.354574  3268 fcntl.hpp:82] `os::isNonblock` has been called, but is a stub
on Windows
W1205 18:56:06.359581  4564 fcntl.hpp:82] `os::isNonblock` has been called, but is a stub
on Windows
W1205 18:56:06.361579  4564 fcntl.hpp:82] `os::isNonblock` has been called, but is a stub
on Windows
W1205 18:56:06.371563  1804 fcntl.hpp:82] `os::isNonblock` has been called, but is a stub
on Windows
W1205 18:56:06.374562  1804 fcntl.hpp:82] `os::isNonblock` has been called, but is a stub
on Windows
W1205 18:56:06.382570  4536 fcntl.hpp:30] `os::cloexec` has been called, but is a no-op on
Windows
W1205 18:56:06.382570  4564 fcntl.hpp:30] `os::cloexec` has been called, but is a no-op on
Windows
W1205 18:56:06.383568  4564 fcntl.hpp:82] `os::isNonblock` has been called, but is a stub
on Windows
W1205 18:56:06.384567  5500 fcntl.hpp:82] `os::isNonblock` has been called, but is a stub
on Windows
W1205 18:56:06.386576  4564 fcntl.hpp:82] `os::isNonblock` has been called, but is a stub
on Windows
W1205 18:56:06.402575  4536 fcntl.hpp:30] `os::cloexec` has been called, but is a no-op on
Windows
W1205 18:56:06.403575  4564 fcntl.hpp:30] `os::cloexec` has been called, but is a no-op on
Windows
W1205 18:56:06.404582  4564 fcntl.hpp:82] `os::isNonblock` has been called, but is a stub
on Windows
W1205 18:56:06.405575   360 fcntl.hpp:82] `os::isNonblock` has been[       OK ] HttpAuthenticationTest.Basic
(79 ms)
[----------] 6 tests from HttpAuthenticationTest (193 ms total)

[----------] 2 tests from HttpServeTest
[ RUN      ] HttpServeTest.Pipelining
F:\jenkins\jenkins-slave\workspace\Mesos-Windows\3rdparty\libprocess\src\tests\http_tests.cpp(1788):
error: (connect).failure(): Failed to connect to 0.0.0.0:55893: The requested address is not
valid in its context.


[  FAILED  ] HttpServeTest.Pipelining (7 ms)
[ RUN      ] HttpServeTest.Discard
F:\jenkins\jenkins-slave\workspace\Mesos-Windows\3rdparty\libprocess\src\tests\http_tests.cpp(1883):
error: (connect).failure(): Failed to connect to 0.0.0.0:55895: The requested address is not
valid in its context.


[  FAILED  ] HttpServeTest.Discard (3 ms)
[----------] 2 tests from HttpServeTest (10 ms total)

[----------] 4 tests from LoopTest
[ RUN      ] LoopTest.Sync
[       OK ] LoopTest.Sync (2 ms)
[ RUN      ] LoopTest.Async
[       OK ] LoopTest.Async (2 ms)
[ RUN      ] LoopTest.DiscardIterate
[       OK ] LoopTest.DiscardIterate (2 ms)
[ RUN      ] LoopTest.DiscardBody
[       OK ] LoopTest.DiscardBody (1 ms)
[----------] 4 tests from LoopTest (7 ms total)

[----------] 5 tests from MetricsTest
[ RUN      ] MetricsTest.Counter
[       OK ] MetricsTest.Counter (5 ms)
[ RUN      ] MetricsTest.Statistics
[       OK ] MetricsTest.Statistics (2 ms)
[ RUN      ] MetricsTest.SnapshotStatistics
[       OK ] MetricsTest.SnapshotStatistics (33 ms)
[ RUN      ] MetricsTest.Timer
[       OK ] MetricsTest.Timer (1 ms)
[ RUN      ] MetricsTest.AsyncTimer
[       OK ] MetricsTest.AsyncTimer (3 ms)
[----------] 5 tests from MetricsTest (46 ms total)

[----------] 3 tests from MutexTest
[ RUN      ] MutexTest.Lock
[       OK ] MutexTest.Lock (0 ms)
[ RUN      ] MutexTest.Block
[       OK ] MutexTest.Block (0 ms)
[ RUN      ] MutexTest.Queue
[       OK ] MutexTest.Queue (1 ms)
[----------] 3 tests from MutexTest (1 ms total)

[----------] 4 tests from OwnedTest
[ RUN      ] OwnedTest.Access
[       OK ] OwnedTest.Access (0 ms)
[ RUN      ] OwnedTest.Null
[       OK ] OwnedTest.Null (0 ms)
[ RUN      ] OwnedTest.Share
[       OK ] OwnedTest.Share (0 ms)
[ RUN      ] OwnedTest.Release
[       OK ] OwnedTest.Release (0 ms)
[----------] 4 tests from OwnedTest (1 ms total)

[----------] 4 tests from ProcessTest
[ RUN      ] ProcessTest.Event
[       OK ] ProcessTest.Event (0 ms)
[ RUN      ] ProcessTest.Exited
[       OK ] ProcessTest.Exited (4 ms)
[ RUN      ] ProcessTest.InjectExited
[       OK ] ProcessTest.InjectExited (2 ms)
[ RUN      ] ProcessTest.PercentEncodedURLs
[       OK ] ProcessTest.PercentEncodedURLs (30 ms)
[----------] 4 tests from ProcessTest (36 ms total)

[----------] 3 tests from QueueTest
[ RUN      ] QueueTest.Block
[       OK ] QueueTest.Block (1 ms)
[ RUN      ] QueueTest.Noblock
[       OK ] QueueTest.Noblock (0 ms)
[ RUN      ] QueueTest.Queue
[       OK ] QueueTest.Queue (1 ms)
[----------] 3 tests from QueueTest (2 ms total)

[----------] 4 tests from SequenceTest
[ RUN      ] SequenceTest.Serialize
[       OK ] SequenceTest.Serialize (5 ms)
[ RUN      ] SequenceTest.DiscardOne
[       OK ] SequenceTest.DiscardOne (5 ms)
[ RUN      ] SequenceTest.DiscardAll
[       OK ] SequenceTest.DiscardAll (6 ms)
[ RUN      ] SequenceTest.Random
[       OK ] SequenceTest.Random (43 ms)
[----------] 4 tests from SequenceTest (59 ms total)

[----------] 4 tests from SharedTest
[ RUN      ] SharedTest.ConstAccess
[       OK ] SharedTest.ConstAccess (0 ms)
[ RUN      ] SharedTest.Null
[       OK ] SharedTest.Null (0 ms)
[ RUN      ] SharedTest.Reset
[       OK ] SharedTest.Reset (0 ms)
[ RUN      ] SharedTest.Own
[       OK ] SharedTest.Own (1 ms)
[----------] 4 tests from SharedTest (2 ms total)

[----------] 3 tests from StatisticsTest
[ RUN      ] StatisticsTest.Empty
[       OK ] StatisticsTest.Empty (0 ms)
[ RUN      ] StatisticsTest.Single
[       OK ] StatisticsTest.Single (0 ms)
[ RUN      ] StatisticsTest.Statistics
[       OK ] StatisticsTest.Statistics (0 ms)
[----------] 3 tests from StatisticsTest (1 ms total)

[----------] 3 tests from SubprocessTest
[ RUN      ] SubprocessTest.PipeOutputToFileDescriptor
[       OK ] SubprocessTest.PipeOutputToFileDescriptor (18 ms)
[ RUN      ] SubprocessTest.PipeOutputToPath
[       OK ] SubprocessTest.PipeOutputToPath (19 ms)
[ RUN      ] SubprocessTest.EnvironmentEcho
[       OK ] SubprocessTest.EnvironmentEcho (12 ms)
[----------] 3 tests from SubprocessTest (49 ms total)

[----------] 4 tests from TimeTest
[ RUN      ] TimeTest.Arithmetic
[       OK ] TimeTest.Arithmetic (0 ms)
[ RUN      ] TimeTest.RFC1123Output
[       OK ] TimeTest.RFC1123Output (0 ms)
[ RUN      ] TimeTest.RFC3339Output
[       OK ] TimeTest.RFC3339Output (0 ms)
[ RUN      ] TimeTest.Output
[       OK ] TimeTest.Output (0 ms)
[----------] 4 tests from TimeTest (2 ms total)

[----------] 3 tests from TimeSeriesTest
[ RUN      ] TimeSeriesTest.Set
[       OK ] TimeSeriesTest.Set (0 ms)
[ RUN      ] TimeSeriesTest.Sparsify
[       OK ] TimeSeriesTest.Sparsify (2 ms)
[ RUN      ] TimeSeriesTest.Truncate
[       OK ] TimeSeriesTest.Truncate (3 ms)
[----------] 3 tests from TimeSeriesTest (5 ms total)

[----------] Global test environment tear-down
[==========] 109 tests from 24 test cases ran. (867 ms total)
[  PASSED  ] 107 tests.
[  FAILED  ] 2 tests, listed below:
[  FAILED  ] HttpServeTest.Pipelining
[  FAILED  ] HttpServeTest.Discard

 2 FAILED TESTS
  YOU HAVE 44 DISABLED TESTS

 called, but is a stub on Windows
W1205 18:56:06.409577  4564 fcntl.hpp:82] `os::isNonblock` has been called, but is a stub
on Windows
W1205 18:56:06.420577  4536 fcntl.hpp:30] `os::cloexec` has been called, but is a no-op on
Windows
W1205 18:56:06.421578  4564 fcntl.hpp:30] `os::cloexec` has been called, but is a no-op on
Windows
W1205 18:56:06.422588  4564 fcntl.hpp:82] `os::isNonblock` has been called, but is a stub
on Windows
W1205 18:56:06.423573  5384 fcntl.hpp:82] `os::isNonblock` has been called, but is a stub
on Windows
W1205 18:56:06.426581  4564 fcntl.hpp:82] `os::isNonblock` has been called, but is a stub
on Windows
W1205 18:56:06.439577  4536 fcntl.hpp:30] `os::cloexec` has been called, but is a no-op on
Windows
W1205 18:56:06.439577  4564 fcntl.hpp:30] `os::cloexec` has been called, but is a no-op on
Windows
W1205 18:56:06.440570  4564 fcntl.hpp:82] `os::isNonblock` has been called, but is a stub
on Windows
W1205 18:56:06.442584  1804 fcntl.hpp:82] `os::isNonblock` has been called, but is a stub
on Windows
W1205 18:56:06.445559  4564 fcntl.hpp:82] `os::isNonblock` has been called, but is a stub
on Windows
W1205 18:56:06.461566  4536 fcntl.hpp:30] `os::cloexec` has been called, but is a no-op on
Windows
W1205 18:56:06.462563  4536 fcntl.hpp:30] `os::cloexec` has been called, but is a no-op on
Windows
W1205 18:56:06.467566  4536 fcntl.hpp:30] `os::cloexec` has been called, but is a no-op on
Windows
W1205 18:56:06.467566  4536 fcntl.hpp:30] `os::cloexec` has been called, but is a no-op on
Windows
W1205 18:56:06.486578  4536 fcntl.hpp:30] `os::cloexec` has been called, but is a no-op on
Windows
W1205 18:56:06.488612  4564 fcntl.hpp:30] `os::cloexec` has been called, but is a no-op on
Windows
W1205 18:56:06.488612  4564 fcntl.hpp:82] `os::isNonblock` has been called, but is a stub
on Windows
W1205 18:56:06.490588  4748 fcntl.hpp:82] `os::isNonblock` has been called, but is a stub
on Windows
W1205 18:56:06.493561  4564 fcntl.hpp:82] `os::isNonblock` has been called, but is a stub
on Windows
W1205 18:56:06.531558  4536 fcntl.hpp:30] `os::cloexec` has been called, but is a no-op on
Windows
W1205 18:56:06.532563  4564 fcntl.hpp:30] `os::cloexec` has been called, but is a no-op on
Windows
W1205 18:56:06.532563  4564 fcntl.hpp:82] `os::isNonblock` has been called, but is a stub
on Windows
W1205 18:56:06.534564  5052 fcntl.hpp:82] `os::isNonblock` has been called, but is a stub
on Windows
W1205 18:56:06.539566  4564 fcntl.hpp:82] `os::isNonblock` has been called, but is a stub
on Windows
W1205 18:56:06.542588  4536 fcntl.hpp:30] `os::cloexec` has been called, but is a no-op on
Windows
W1205 18:56:06.543576  4564 fcntl.hpp:30] `os::cloexec` has been called, but is a no-op on
Windows
W1205 18:56:06.543576  4564 fcntl.hpp:82] `os::isNonblock` has been called, but is a stub
on Windows
W1205 18:56:06.545558   360 fcntl.hpp:82] `os::isNonblock` has been called, but is a stub
on Windows
W1205 18:56:06.548563  4564 fcntl.hpp:82] `os::isNonblock` has been called, but is a stub
on Windows

<https://builds.apache.org/job/Mesos-Windows/ws/build>if> 1 NEQ 0 exit /b 1 
Build step 'Execute Windows batch command' marked build as failure

Mime
View raw message