mesos-builds mailing list archives

Site index · List index
Message view « Date » · « Thread »
Top « Date » · « Thread »
From Apache Jenkins Server <jenk...@builds.apache.org>
Subject Build failed in Jenkins: Mesos » cmake,gcc,--verbose,GLOG_v=1 MESOS_VERBOSE=1,ubuntu:14.04,(docker||Hadoop)&&(!ubuntu-us1)&&(!ubuntu-6)&&(!ubuntu-eu2) #3016
Date Thu, 08 Dec 2016 01:13:15 GMT
See <https://builds.apache.org/job/Mesos/BUILDTOOL=cmake,COMPILER=gcc,CONFIGURATION=--verbose,ENVIRONMENT=GLOG_v=1%20MESOS_VERBOSE=1,OS=ubuntu%3A14.04,label_exp=(docker%7C%7CHadoop)&&(!ubuntu-us1)&&(!ubuntu-6)&&(!ubuntu-eu2)/3016/changes>

Changes:

[adam] Added authorization support when attaching to container input/output.

[alexr] Removed redundant semicolons.

[alexr] Added Ryuichi Okumura to the contributors list.

[yujie.jay] Added default values for all required IOSwitchboardServerFlags.

[yujie.jay] Used agent environment variables for I/O switchboard.

[bmahler] Added a helper function to get roles from FrameworkInfo.

[anand] Made the IO Switchboard wait for the reader to signal before exiting.

[vinodkone] Added Mesos logo to the list of files installed for the web UI.

------------------------------------------
[...truncated 215083 lines...]
[ RUN      ] Endpoint/SlaveEndpointTest.AuthorizedRequest/1
I1208 01:13:07.620043 26720 containerizer.cpp:207] Using isolation: posix/cpu,posix/mem,filesystem/posix,network/cni
W1208 01:13:07.620486 26720 backend.cpp:76] Failed to create 'aufs' backend: AufsBackend requires
root privileges, but is running as user mesos
W1208 01:13:07.620573 26720 backend.cpp:76] Failed to create 'bind' backend: BindBackend requires
root privileges
I1208 01:13:07.621796 26734 slave.cpp:208] Mesos agent started on (652)@172.17.0.2:57339
I1208 01:13:07.621809 26734 slave.cpp:209] Flags at startup: --acls="" --appc_simple_discovery_uri_prefix="http://"
--appc_store_dir="/tmp/mesos/store/appc" --authenticate_http_readonly="true" --authenticate_http_readwrite="true"
--authenticatee="crammd5" --authentication_backoff_factor="1secs" --authorizer="local" --cgroups_cpu_enable_pids_and_tids_count="false"
--cgroups_enable_cfs="false" --cgroups_hierarchy="/sys/fs/cgroup" --cgroups_limit_swap="false"
--cgroups_root="mesos" --container_disk_watch_interval="15secs" --containerizers="mesos" --credential="/tmp/Endpoint_SlaveEndpointTest_AuthorizedRequest_1_FKxFYt/credential"
--default_role="*" --disk_watch_interval="1mins" --docker="docker" --docker_kill_orphans="true"
--docker_registry="https://registry-1.docker.io" --docker_remove_delay="6hrs" --docker_socket="/var/run/docker.sock"
--docker_stop_timeout="0ns" --docker_store_dir="/tmp/mesos/store/docker" --docker_volume_checkpoint_dir="/var/run/mesos/isolators/docker/volume"
--enforce_container_disk_quota="false" --executor_registration_timeout="1mins" --executor_shutdown_grace_period="5secs"
--fetcher_cache_dir="/tmp/Endpoint_SlaveEndpointTest_AuthorizedRequest_1_FKxFYt/fetch" --fetcher_cache_size="2GB"
--frameworks_home="" --gc_delay="1weeks" --gc_disk_headroom="0.1" --hadoop_home="" --help="false"
--hostname_lookup="true" --http_authenticators="basic" --http_command_executor="false" --http_credentials="/tmp/Endpoint_SlaveEndpointTest_AuthorizedRequest_1_FKxFYt/http_credentials"
--image_provisioner_backend="copy" --initialize_driver_logging="true" --io_switchboard_enable_server="true"
--isolation="posix/cpu,posix/mem" --launcher="posix" --launcher_dir="/mesos/build/src" --logbufsecs="0"
--logging_level="INFO" --max_completed_executors_per_framework="150" --oversubscribed_resources_interval="15secs"
--perf_duration="10secs" --perf_interval="1mins" --qos_correction_interval_min="0ns" --quiet="false"
--recover="reconnect" --recovery_timeout="15mins" --registration_backoff_factor="10ms" --resources="cpus:2;gpus:0;mem:1024;disk:1024;ports:[31000-32000]"
--revocable_cpu_low_priority="true" --runtime_dir="/tmp/Endpoint_SlaveEndpointTest_AuthorizedRequest_1_FKxFYt"
--sandbox_directory="/mnt/mesos/sandbox" --strict="true" --switch_user="true" --systemd_enable_support="true"
--systemd_runtime_directory="/run/systemd/system" --version="false" --work_dir="/tmp/Endpoint_SlaveEndpointTest_AuthorizedRequest_1_F19xAK"
I1208 01:13:07.622088 26734 credentials.hpp:86] Loading credential for authentication from
'/tmp/Endpoint_SlaveEndpointTest_AuthorizedRequest_1_FKxFYt/credential'
I1208 01:13:07.622174 26734 slave.cpp:346] Agent using credential for: test-principal
I1208 01:13:07.622191 26734 credentials.hpp:37] Loading credentials for authentication from
'/tmp/Endpoint_SlaveEndpointTest_AuthorizedRequest_1_FKxFYt/http_credentials'
I1208 01:13:07.622300 26734 http.cpp:922] Using default 'basic' HTTP authenticator for realm
'mesos-agent-readonly'
I1208 01:13:07.622371 26734 http.cpp:922] Using default 'basic' HTTP authenticator for realm
'mesos-agent-readwrite'
I1208 01:13:07.622714 26734 slave.cpp:533] Agent resources: cpus(*):2; mem(*):1024; disk(*):1024;
ports(*):[31000-32000]
I1208 01:13:07.622746 26734 slave.cpp:541] Agent attributes: [  ]
I1208 01:13:07.622756 26734 slave.cpp:546] Agent hostname: 17b67c4b8dfe
I1208 01:13:07.623301 26724 state.cpp:57] Recovering state from '/tmp/Endpoint_SlaveEndpointTest_AuthorizedRequest_1_F19xAK/meta'
I1208 01:13:07.623437 26731 status_update_manager.cpp:203] Recovering status update manager
I1208 01:13:07.623579 26735 containerizer.cpp:581] Recovering containerizer
I1208 01:13:07.624168 26721 provisioner.cpp:253] Provisioner recovery complete
I1208 01:13:07.624348 26723 slave.cpp:5414] Finished recovery
I1208 01:13:07.624716 26723 slave.cpp:5588] Querying resource estimator for oversubscribable
resources
I1208 01:13:07.624845 26729 slave.cpp:5602] Received oversubscribable resources {} from the
resource estimator
I1208 01:13:07.625571 26731 process.cpp:3679] Handling HTTP event for process 'slave(652)'
with path: '/slave(652)/monitor/statistics.json'
I1208 01:13:07.626054 26733 http.cpp:874] Authorizing principal 'test-principal' to GET the
'/monitor/statistics.json' endpoint
I1208 01:13:07.627755 26724 slave.cpp:790] Agent terminating
[       OK ] Endpoint/SlaveEndpointTest.AuthorizedRequest/1 (13 ms)
[ RUN      ] Endpoint/SlaveEndpointTest.AuthorizedRequest/2
I1208 01:13:07.633292 26720 containerizer.cpp:207] Using isolation: posix/cpu,posix/mem,filesystem/posix,network/cni
W1208 01:13:07.633674 26720 backend.cpp:76] Failed to create 'aufs' backend: AufsBackend requires
root privileges, but is running as user mesos
W1208 01:13:07.633759 26720 backend.cpp:76] Failed to create 'bind' backend: BindBackend requires
root privileges
I1208 01:13:07.635176 26726 slave.cpp:208] Mesos agent started on (653)@172.17.0.2:57339
I1208 01:13:07.635196 26726 slave.cpp:209] Flags at startup: --acls="" --appc_simple_discovery_uri_prefix="http://"
--appc_store_dir="/tmp/mesos/store/appc" --authenticate_http_readonly="true" --authenticate_http_readwrite="true"
--authenticatee="crammd5" --authentication_backoff_factor="1secs" --authorizer="local" --cgroups_cpu_enable_pids_and_tids_count="false"
--cgroups_enable_cfs="false" --cgroups_hierarchy="/sys/fs/cgroup" --cgroups_limit_swap="false"
--cgroups_root="mesos" --container_disk_watch_interval="15secs" --containerizers="mesos" --credential="/tmp/Endpoint_SlaveEndpointTest_AuthorizedRequest_2_ntCkEp/credential"
--default_role="*" --disk_watch_interval="1mins" --docker="docker" --docker_kill_orphans="true"
--docker_registry="https://registry-1.docker.io" --docker_remove_delay="6hrs" --docker_socket="/var/run/docker.sock"
--docker_stop_timeout="0ns" --docker_store_dir="/tmp/mesos/store/docker" --docker_volume_checkpoint_dir="/var/run/mesos/isolators/docker/volume"
--enforce_container_disk_quota="false" --executor_registration_timeout="1mins" --executor_shutdown_grace_period="5secs"
--fetcher_cache_dir="/tmp/Endpoint_SlaveEndpointTest_AuthorizedRequest_2_ntCkEp/fetch" --fetcher_cache_size="2GB"
--frameworks_home="" --gc_delay="1weeks" --gc_disk_headroom="0.1" --hadoop_home="" --help="false"
--hostname_lookup="true" --http_authenticators="basic" --http_command_executor="false" --http_credentials="/tmp/Endpoint_SlaveEndpointTest_AuthorizedRequest_2_ntCkEp/http_credentials"
--image_provisioner_backend="copy" --initialize_driver_logging="true" --io_switchboard_enable_server="true"
--isolation="posix/cpu,posix/mem" --launcher="posix" --launcher_dir="/mesos/build/src" --logbufsecs="0"
--logging_level="INFO" --max_completed_executors_per_framework="150" --oversubscribed_resources_interval="15secs"
--perf_duration="10secs" --perf_interval="1mins" --qos_correction_interval_min="0ns" --quiet="false"
--recover="reconnect" --recovery_timeout="15mins" --registration_backoff_factor="10ms" --resources="cpus:2;gpus:0;mem:1024;disk:1024;ports:[31000-32000]"
--revocable_cpu_low_priority="true" --runtime_dir="/tmp/Endpoint_SlaveEndpointTest_AuthorizedRequest_2_ntCkEp"
--sandbox_directory="/mnt/mesos/sandbox" --strict="true" --switch_user="true" --systemd_enable_support="true"
--systemd_runtime_directory="/run/systemd/system" --version="false" --work_dir="/tmp/Endpoint_SlaveEndpointTest_AuthorizedRequest_2_Vdq4dG"
I1208 01:13:07.635694 26726 credentials.hpp:86] Loading credential for authentication from
'/tmp/Endpoint_SlaveEndpointTest_AuthorizedRequest_2_ntCkEp/credential'
I1208 01:13:07.635810 26726 slave.cpp:346] Agent using credential for: test-principal
I1208 01:13:07.635839 26726 credentials.hpp:37] Loading credentials for authentication from
'/tmp/Endpoint_SlaveEndpointTest_AuthorizedRequest_2_ntCkEp/http_credentials'
I1208 01:13:07.636018 26726 http.cpp:922] Using default 'basic' HTTP authenticator for realm
'mesos-agent-readonly'
I1208 01:13:07.636096 26726 http.cpp:922] Using default 'basic' HTTP authenticator for realm
'mesos-agent-readwrite'
I1208 01:13:07.636482 26726 slave.cpp:533] Agent resources: cpus(*):2; mem(*):1024; disk(*):1024;
ports(*):[31000-32000]
I1208 01:13:07.636525 26726 slave.cpp:541] Agent attributes: [  ]
I1208 01:13:07.636533 26726 slave.cpp:546] Agent hostname: 17b67c4b8dfe
I1208 01:13:07.637028 26722 state.cpp:57] Recovering state from '/tmp/Endpoint_SlaveEndpointTest_AuthorizedRequest_2_Vdq4dG/meta'
I1208 01:13:07.637166 26734 status_update_manager.cpp:203] Recovering status update manager
I1208 01:13:07.637281 26734 containerizer.cpp:581] Recovering containerizer
I1208 01:13:07.638108 26730 provisioner.cpp:253] Provisioner recovery complete
I1208 01:13:07.638334 26736 slave.cpp:5414] Finished recovery
I1208 01:13:07.638794 26736 slave.cpp:5588] Querying resource estimator for oversubscribable
resources
I1208 01:13:07.639019 26734 slave.cpp:5602] Received oversubscribable resources {} from the
resource estimator
I1208 01:13:07.640072 26727 process.cpp:3679] Handling HTTP event for process 'slave(653)'
with path: '/slave(653)/containers'
I1208 01:13:07.640620 26733 http.cpp:874] Authorizing principal 'test-principal' to GET the
'/containers' endpoint
I1208 01:13:07.641974 26724 slave.cpp:790] Agent terminating
[       OK ] Endpoint/SlaveEndpointTest.AuthorizedRequest/2 (14 ms)
[ RUN      ] Endpoint/SlaveEndpointTest.UnauthorizedRequest/0
I1208 01:13:07.658939 26720 containerizer.cpp:207] Using isolation: posix/cpu,posix/mem,filesystem/posix,network/cni
W1208 01:13:07.659344 26720 backend.cpp:76] Failed to create 'aufs' backend: AufsBackend requires
root privileges, but is running as user mesos
W1208 01:13:07.659495 26720 backend.cpp:76] Failed to create 'bind' backend: BindBackend requires
root privileges
I1208 01:13:07.660766 26735 slave.cpp:208] Mesos agent started on (654)@172.17.0.2:57339
I1208 01:13:07.660787 26735 slave.cpp:209] Flags at startup: --acls="" --appc_simple_discovery_uri_prefix="http://"
--appc_store_dir="/tmp/mesos/store/appc" --authenticate_http_readonly="true" --authenticate_http_readwrite="true"
--authenticatee="crammd5" --authentication_backoff_factor="1secs" --authorizer="local" --cgroups_cpu_enable_pids_and_tids_count="false"
--cgroups_enable_cfs="false" --cgroups_hierarchy="/sys/fs/cgroup" --cgroups_limit_swap="false"
--cgroups_root="mesos" --container_disk_watch_interval="15secs" --containerizers="mesos" --credential="/tmp/Endpoint_SlaveEndpointTest_UnauthorizedRequest_0_zLSyyl/credential"
--default_role="*" --disk_watch_interval="1mins" --docker="docker" --docker_kill_orphans="true"
--docker_registry="https://registry-1.docker.io" --docker_remove_delay="6hrs" --docker_socket="/var/run/docker.sock"
--docker_stop_timeout="0ns" --docker_store_dir="/tmp/mesos/store/docker" --docker_volume_checkpoint_dir="/var/run/mesos/isolators/docker/volume"
--enforce_container_disk_quota="false" --executor_registration_timeout="1mins" --executor_shutdown_grace_period="5secs"
--fetcher_cache_dir="/tmp/Endpoint_SlaveEndpointTest_UnauthorizedRequest_0_zLSyyl/fetch" --fetcher_cache_size="2GB"
--frameworks_home="" --gc_delay="1weeks" --gc_disk_headroom="0.1" --hadoop_home="" --help="false"
--hostname_lookup="true" --http_authenticators="basic" --http_command_executor="false" --http_credentials="/tmp/Endpoint_SlaveEndpointTest_UnauthorizedRequest_0_zLSyyl/http_credentials"
--image_provisioner_backend="copy" --initialize_driver_logging="true" --io_switchboard_enable_server="true"
--isolation="posix/cpu,posix/mem" --launcher="posix" --launcher_dir="/mesos/build/src" --logbufsecs="0"
--logging_level="INFO" --max_completed_executors_per_framework="150" --oversubscribed_resources_interval="15secs"
--perf_duration="10secs" --perf_interval="1mins" --qos_correction_interval_min="0ns" --quiet="false"
--recover="reconnect" --recovery_timeout="15mins" --registration_backoff_factor="10ms" --resources="cpus:2;gpus:0;mem:1024;disk:1024;ports:[31000-32000]"
--revocable_cpu_low_priority="true" --runtime_dir="/tmp/Endpoint_SlaveEndpointTest_UnauthorizedRequest_0_zLSyyl"
--sandbox_directory="/mnt/mesos/sandbox" --strict="true" --switch_user="true" --systemd_enable_support="true"
--systemd_runtime_directory="/run/systemd/system" --version="false" --work_dir="/tmp/Endpoint_SlaveEndpointTest_UnauthorizedRequest_0_bx5b4B"
I1208 01:13:07.661224 26735 credentials.hpp:86] Loading credential for authentication from
'/tmp/Endpoint_SlaveEndpointTest_UnauthorizedRequest_0_zLSyyl/credential'
I1208 01:13:07.661345 26735 slave.cpp:346] Agent using credential for: test-principal
I1208 01:13:07.661368 26735 credentials.hpp:37] Loading credentials for authentication from
'/tmp/Endpoint_SlaveEndpointTest_UnauthorizedRequest_0_zLSyyl/http_credentials'
I1208 01:13:07.661510 26735 http.cpp:922] Using default 'basic' HTTP authenticator for realm
'mesos-agent-readonly'
I1208 01:13:07.661577 26735 http.cpp:922] Using default 'basic' HTTP authenticator for realm
'mesos-agent-readwrite'
I1208 01:13:07.662016 26735 slave.cpp:533] Agent resources: cpus(*):2; mem(*):1024; disk(*):1024;
ports(*):[31000-32000]
I1208 01:13:07.662060 26735 slave.cpp:541] Agent attributes: [  ]
I1208 01:13:07.662070 26735 slave.cpp:546] Agent hostname: 17b67c4b8dfe
I1208 01:13:07.662499 26730 state.cpp:57] Recovering state from '/tmp/Endpoint_SlaveEndpointTest_UnauthorizedRequest_0_bx5b4B/meta'
I1208 01:13:07.662690 26735 status_update_manager.cpp:203] Recovering status update manager
I1208 01:13:07.662794 26735 containerizer.cpp:581] Recovering containerizer
I1208 01:13:07.663450 26730 provisioner.cpp:253] Provisioner recovery complete
I1208 01:13:07.663686 26733 slave.cpp:5414] Finished recovery
I1208 01:13:07.664131 26733 slave.cpp:5588] Querying resource estimator for oversubscribable
resources
I1208 01:13:07.664270 26736 slave.cpp:5602] Received oversubscribable resources {} from the
resource estimator
I1208 01:13:07.664939 26732 process.cpp:3679] Handling HTTP event for process 'slave(654)'
with path: '/slave(654)/monitor/statistics'
I1208 01:13:07.665392 26723 http.cpp:874] Authorizing principal 'test-principal' to GET the
'/monitor/statistics' endpoint
I1208 01:13:07.666669 26731 slave.cpp:790] Agent terminating
[       OK ] Endpoint/SlaveEndpointTest.UnauthorizedRequest/0 (13 ms)
[ RUN      ] Endpoint/SlaveEndpointTest.UnauthorizedRequest/1
I1208 01:13:07.676952 26720 containerizer.cpp:207] Using isolation: posix/cpu,posix/mem,filesystem/posix,network/cni
W1208 01:13:07.677323 26720 backend.cpp:76] Failed to create 'aufs' backend: AufsBackend requires
root privileges, but is running as user mesos
W1208 01:13:07.677412 26720 backend.cpp:76] Failed to create 'bind' backend: BindBackend requires
root privileges
I1208 01:13:07.678701 26726 slave.cpp:208] Mesos agent started on (655)@172.17.0.2:57339
I1208 01:13:07.678725 26726 slave.cpp:209] Flags at startup: --acls="" --appc_simple_discovery_uri_prefix="http://"
--appc_store_dir="/tmp/mesos/store/appc" --authenticate_http_readonly="true" --authenticate_http_readwrite="true"
--authenticatee="crammd5" --authentication_backoff_factor="1secs" --authorizer="local" --cgroups_cpu_enable_pids_and_tids_count="false"
--cgroups_enable_cfs="false" --cgroups_hierarchy="/sys/fs/cgroup" --cgroups_limit_swap="false"
--cgroups_root="mesos" --container_disk_watch_interval="15secs" --containerizers="mesos" --credential="/tmp/Endpoint_SlaveEndpointTest_UnauthorizedRequest_1_9nDGFh/credential"
--default_role="*" --disk_watch_interval="1mins" --docker="docker" --docker_kill_orphans="true"
--docker_registry="https://registry-1.docker.io" --docker_remove_delay="6hrs" --docker_socket="/var/run/docker.sock"
--docker_stop_timeout="0ns" --docker_store_dir="/tmp/mesos/store/docker" --docker_volume_checkpoint_dir="/var/run/mesos/isolators/docker/volume"
--enforce_container_disk_quota="false" --executor_registration_timeout="1mins" --executor_shutdown_grace_period="5secs"
--fetcher_cache_dir="/tmp/Endpoint_SlaveEndpointTest_UnauthorizedRequest_1_9nDGFh/fetch" --fetcher_cache_size="2GB"
--frameworks_home="" --gc_delay="1weeks" --gc_disk_headroom="0.1" --hadoop_home="" --help="false"
--hostname_lookup="true" --http_authenticators="basic" --http_command_executor="false" --http_credentials="/tmp/Endpoint_SlaveEndpointTest_UnauthorizedRequest_1_9nDGFh/http_credentials"
--image_provisioner_backend="copy" --initialize_driver_logging="true" --io_switchboard_enable_server="true"
--isolation="posix/cpu,posix/mem" --launcher="posix" --launcher_dir="/mesos/build/src" --logbufsecs="0"
--logging_level="INFO" --max_completed_executors_per_framework="150" --oversubscribed_resources_interval="15secs"
--perf_duration="10secs" --perf_interval="1mins" --qos_correction_interval_min="0ns" --quiet="false"
--recover="reconnect" --recovery_timeout="15mins" --registration_backoff_factor="10ms" --resources="cpus:2;gpus:0;mem:1024;disk:1024;ports:[31000-32000]"
--revocable_cpu_low_priority="true" --runtime_dir="/tmp/Endpoint_SlaveEndpointTest_UnauthorizedRequest_1_9nDGFh"
--sandbox_directory="/mnt/mesos/sandbox" --strict="true" --switch_user="true" --systemd_enable_support="true"
--systemd_runtime_directory="/run/systemd/system" --version="false" --work_dir="/tmp/Endpoint_SlaveEndpointTest_UnauthorizedRequest_1_93eo8x"
I1208 01:13:07.679190 26726 credentials.hpp:86] Loading credential for authentication from
'/tmp/Endpoint_SlaveEndpointTest_UnauthorizedRequest_1_9nDGFh/credential'
I1208 01:13:07.679340 26726 slave.cpp:346] Agent using credential for: test-principal
I1208 01:13:07.679358 26726 credentials.hpp:37] Loading credentials for authentication from
'/tmp/Endpoint_SlaveEndpointTest_UnauthorizedRequest_1_9nDGFh/http_credentials'
I1208 01:13:07.679497 26726 http.cpp:922] Using default 'basic' HTTP authenticator for realm
'mesos-agent-readonly'
I1208 01:13:07.679589 26726 http.cpp:922] Using default 'basic' HTTP authenticator for realm
'mesos-agent-readwrite'
I1208 01:13:07.680040 26726 slave.cpp:533] Agent resources: cpus(*):2; mem(*):1024; disk(*):1024;
ports(*):[31000-32000]
I1208 01:13:07.680083 26726 slave.cpp:541] Agent attributes: [  ]
I1208 01:13:07.680090 26726 slave.cpp:546] Agent hostname: 17b67c4b8dfe
I1208 01:13:07.680464 26734 state.cpp:57] Recovering state from '/tmp/Endpoint_SlaveEndpointTest_UnauthorizedRequest_1_93eo8x/meta'
I1208 01:13:07.680680 26732 status_update_manager.cpp:203] Recovering status update manager
I1208 01:13:07.680793 26727 containerizer.cpp:581] Recovering containerizer
I1208 01:13:07.681402 26732 provisioner.cpp:253] Provisioner recovery complete
I1208 01:13:07.681687 26735 slave.cpp:5414] Finished recovery
I1208 01:13:07.682059 26735 slave.cpp:5588] Querying resource estimator for oversubscribable
resources
I1208 01:13:07.682181 26724 slave.cpp:5602] Received oversubscribable resources {} from the
resource estimator
I1208 01:13:07.682842 26724 process.cpp:3679] Handling HTTP event for process 'slave(655)'
with path: '/slave(655)/monitor/statistics.json'
I1208 01:13:07.683342 26724 http.cpp:874] Authorizing principal 'test-principal' to GET the
'/monitor/statistics.json' endpoint
I1208 01:13:07.684475 26734 slave.cpp:790] Agent terminating
[       OK ] Endpoint/SlaveEndpointTest.UnauthorizedRequest/1 (13 ms)
[ RUN      ] Endpoint/SlaveEndpointTest.UnauthorizedRequest/2
I1208 01:13:07.691797 26720 containerizer.cpp:207] Using isolation: posix/cpu,posix/mem,filesystem/posix,network/cni
W1208 01:13:07.692198 26720 backend.cpp:76] Failed to create 'aufs' backend: AufsBackend requires
root privileges, but is running as user mesos
W1208 01:13:07.692302 26720 backend.cpp:76] Failed to create 'bind' backend: BindBackend requires
root privileges
I1208 01:13:07.693470 26736 slave.cpp:208] Mesos agent started on (656)@172.17.0.2:57339
I1208 01:13:07.693492 26736 slave.cpp:209] Flags at startup: --acls="" --appc_simple_discovery_uri_prefix="http://"
--appc_store_dir="/tmp/mesos/store/appc" --authenticate_http_readonly="true" --authenticate_http_readwrite="true"
--authenticatee="crammd5" --authentication_backoff_factor="1secs" --authorizer="local" --cgroups_cpu_enable_pids_and_tids_count="false"
--cgroups_enable_cfs="false" --cgroups_hierarchy="/sys/fs/cgroup" --cgroups_limit_swap="false"
--cgroups_root="mesos" --container_disk_watch_interval="15secs" --containerizers="mesos" --credential="/tmp/Endpoint_SlaveEndpointTest_UnauthorizedRequest_2_rGAaXd/credential"
--default_role="*" --disk_watch_interval="1mins" --docker="docker" --docker_kill_orphans="true"
--docker_registry="https://registry-1.docker.io" --docker_remove_delay="6hrs" --docker_socket="/var/run/docker.sock"
--docker_stop_timeout="0ns" --docker_store_dir="/tmp/mesos/store/docker" --docker_volume_checkpoint_dir="/var/run/mesos/isolators/docker/volume"
--enforce_container_disk_quota="false" --executor_registration_timeout="1mins" --executor_shutdown_grace_period="5secs"
--fetcher_cache_dir="/tmp/Endpoint_SlaveEndpointTest_UnauthorizedRequest_2_rGAaXd/fetch" --fetcher_cache_size="2GB"
--frameworks_home="" --gc_delay="1weeks" --gc_disk_headroom="0.1" --hadoop_home="" --help="false"
--hostname_lookup="true" --http_authenticators="basic" --http_command_executor="false" --http_credentials="/tmp/Endpoint_SlaveEndpointTest_UnauthorizedRequest_2_rGAaXd/http_credentials"
--image_provisioner_backend="copy" --initialize_driver_logging="true" --io_switchboard_enable_server="true"
--isolation="posix/cpu,posix/mem" --launcher="posix" --launcher_dir="/mesos/build/src" --logbufsecs="0"
--logging_level="INFO" --max_completed_executors_per_framework="150" --oversubscribed_resources_interval="15secs"
--perf_duration="10secs" --perf_interval="1mins" --qos_correction_interval_min="0ns" --quiet="false"
--recover="reconnect" --recovery_timeout="15mins" --registration_backoff_factor="10ms" --resources="cpus:2;gpus:0;mem:1024;disk:1024;ports:[31000-32000]"
--revocable_cpu_low_priority="true" --runtime_dir="/tmp/Endpoint_SlaveEndpointTest_UnauthorizedRequest_2_rGAaXd"
--sandbox_directory="/mnt/mesos/sandbox" --strict="true" --switch_user="true" --systemd_enable_support="true"
--systemd_runtime_directory="/run/systemd/system" --version="false" --work_dir="/tmp/Endpoint_SlaveEndpointTest_UnauthorizedRequest_2_Vzhpnu"
I1208 01:13:07.693856 26736 credentials.hpp:86] Loading credential for authentication from
'/tmp/Endpoint_SlaveEndpointTest_UnauthorizedRequest_2_rGAaXd/credential'
I1208 01:13:07.693948 26736 slave.cpp:346] Agent using credential for: test-principal
I1208 01:13:07.693970 26736 credentials.hpp:37] Loading credentials for authentication from
'/tmp/Endpoint_SlaveEndpointTest_UnauthorizedRequest_2_rGAaXd/http_credentials'
I1208 01:13:07.694087 26736 http.cpp:922] Using default 'basic' HTTP authenticator for realm
'mesos-agent-readonly'
I1208 01:13:07.694146 26736 http.cpp:922] Using default 'basic' HTTP authenticator for realm
'mesos-agent-readwrite'
I1208 01:13:07.694543 26736 slave.cpp:533] Agent resources: cpus(*):2; mem(*):1024; disk(*):1024;
ports(*):[31000-32000]
I1208 01:13:07.694586 26736 slave.cpp:541] Agent attributes: [  ]
I1208 01:13:07.694593 26736 slave.cpp:546] Agent hostname: 17b67c4b8dfe
I1208 01:13:07.694939 26730 state.cpp:57] Recovering state from '/tmp/Endpoint_SlaveEndpointTest_UnauthorizedRequest_2_Vzhpnu/meta'
I1208 01:13:07.695324 26726 status_update_manager.cpp:203] Recovering status update manager
I1208 01:13:07.695498 26729 containerizer.cpp:581] Recovering containerizer
I1208 01:13:07.696084 26728 provisioner.cpp:253] Provisioner recovery complete
I1208 01:13:07.696341 26723 slave.cpp:5414] Finished recovery
I1208 01:13:07.696732 26723 slave.cpp:5588] Querying resource estimator for oversubscribable
resources
I1208 01:13:07.696868 26734 slave.cpp:5602] Received oversubscribable resources {} from the
resource estimator
I1208 01:13:07.697535 26736 process.cpp:3679] Handling HTTP event for process 'slave(656)'
with path: '/slave(656)/containers'
I1208 01:13:07.698048 26731 http.cpp:874] Authorizing principal 'test-principal' to GET the
'/containers' endpoint
I1208 01:13:07.699074 26720 slave.cpp:790] Agent terminating
[       OK ] Endpoint/SlaveEndpointTest.UnauthorizedRequest/2 (12 ms)
[ RUN      ] Endpoint/SlaveEndpointTest.NoAuthorizer/0
I1208 01:13:07.704545 26720 containerizer.cpp:207] Using isolation: posix/cpu,posix/mem,filesystem/posix,network/cni
W1208 01:13:07.704919 26720 backend.cpp:76] Failed to create 'aufs' backend: AufsBackend requires
root privileges, but is running as user mesos
W1208 01:13:07.705025 26720 backend.cpp:76] Failed to create 'bind' backend: BindBackend requires
root privileges
I1208 01:13:07.705773 26720 cluster.cpp:446] Creating default 'local' authorizer
I1208 01:13:07.706296 26730 slave.cpp:208] Mesos agent started on (657)@172.17.0.2:57339
I1208 01:13:07.706311 26730 slave.cpp:209] Flags at startup: --acls="" --appc_simple_discovery_uri_prefix="http://"
--appc_store_dir="/tmp/mesos/store/appc" --authenticate_http_readonly="true" --authenticate_http_readwrite="true"
--authenticatee="crammd5" --authentication_backoff_factor="1secs" --authorizer="local" --cgroups_cpu_enable_pids_and_tids_count="false"
--cgroups_enable_cfs="false" --cgroups_hierarchy="/sys/fs/cgroup" --cgroups_limit_swap="false"
--cgroups_root="mesos" --container_disk_watch_interval="15secs" --containerizers="mesos" --credential="/tmp/Endpoint_SlaveEndpointTest_NoAuthorizer_0_1UT9ma/credential"
--default_role="*" --disk_watch_interval="1mins" --docker="docker" --docker_kill_orphans="true"
--docker_registry="https://registry-1.docker.io" --docker_remove_delay="6hrs" --docker_socket="/var/run/docker.sock"
--docker_stop_timeout="0ns" --docker_store_dir="/tmp/mesos/store/docker" --docker_volume_checkpoint_dir="/var/run/mesos/isolators/docker/volume"
--enforce_container_disk_quota="false" --executor_registration_timeout="1mins" --executor_shutdown_grace_period="5secs"
--fetcher_cache_dir="/tmp/Endpoint_SlaveEndpointTest_NoAuthorizer_0_1UT9ma/fetch" --fetcher_cache_size="2GB"
--frameworks_home="" --gc_delay="1weeks" --gc_disk_headroom="0.1" --hadoop_home="" --help="false"
--hostname_lookup="true" --http_authenticators="basic" --http_command_executor="false" --http_credentials="/tmp/Endpoint_SlaveEndpointTest_NoAuthorizer_0_1UT9ma/http_credentials"
--image_provisioner_backend="copy" --initialize_driver_logging="true" --io_switchboard_enable_server="true"
--isolation="posix/cpu,posix/mem" --launcher="posix" --launcher_dir="/mesos/build/src" --logbufsecs="0"
--logging_level="INFO" --max_completed_executors_per_framework="150" --oversubscribed_resources_interval="15secs"
--perf_duration="10secs" --perf_interval="1mins" --qos_correction_interval_min="0ns" --quiet="false"
--recover="reconnect" --recovery_timeout="15mins" --registration_backoff_factor="10ms" --resources="cpus:2;gpus:0;mem:1024;disk:1024;ports:[31000-32000]"
--revocable_cpu_low_priority="true" --runtime_dir="/tmp/Endpoint_SlaveEndpointTest_NoAuthorizer_0_1UT9ma"
--sandbox_directory="/mnt/mesos/sandbox" --strict="true" --switch_user="true" --systemd_enable_support="true"
--systemd_runtime_directory="/run/systemd/system" --version="false" --work_dir="/tmp/Endpoint_SlaveEndpointTest_NoAuthorizer_0_RV0lLq"
I1208 01:13:07.706727 26730 credentials.hpp:86] Loading credential for authentication from
'/tmp/Endpoint_SlaveEndpointTest_NoAuthorizer_0_1UT9ma/credential'
I1208 01:13:07.706842 26730 slave.cpp:346] Agent using credential for: test-principal
I1208 01:13:07.706866 26730 credentials.hpp:37] Loading credentials for authentication from
'/tmp/Endpoint_SlaveEndpointTest_NoAuthorizer_0_1UT9ma/http_credentials'
I1208 01:13:07.706997 26730 http.cpp:922] Using default 'basic' HTTP authenticator for realm
'mesos-agent-readonly'
I1208 01:13:07.707056 26730 http.cpp:922] Using default 'basic' HTTP authenticator for realm
'mesos-agent-readwrite'
I1208 01:13:07.707515 26730 slave.cpp:533] Agent resources: cpus(*):2; mem(*):1024; disk(*):1024;
ports(*):[31000-32000]
I1208 01:13:07.707558 26730 slave.cpp:541] Agent attributes: [  ]
I1208 01:13:07.707572 26730 slave.cpp:546] Agent hostname: 17b67c4b8dfe
I1208 01:13:07.708009 26729 state.cpp:57] Recovering state from '/tmp/Endpoint_SlaveEndpointTest_NoAuthorizer_0_RV0lLq/meta'
I1208 01:13:07.708277 26736 status_update_manager.cpp:203] Recovering status update manager
I1208 01:13:07.708376 26732 containerizer.cpp:581] Recovering containerizer
I1208 01:13:07.709007 26726 provisioner.cpp:253] Provisioner recovery complete
I1208 01:13:07.709226 26724 slave.cpp:5414] Finished recovery
I1208 01:13:07.709723 26724 slave.cpp:5588] Querying resource estimator for oversubscribable
resources
I1208 01:13:07.709913 26735 slave.cpp:5602] Received oversubscribable resources {} from the
resource estimator
I1208 01:13:07.710564 26724 process.cpp:3679] Handling HTTP event for process 'slave(657)'
with path: '/slave(657)/monitor/statistics'
I1208 01:13:07.711050 26722 http.cpp:874] Authorizing principal 'test-principal' to GET the
'/monitor/statistics' endpoint
I1208 01:13:07.712575 26733 slave.cpp:790] Agent terminating
[       OK ] Endpoint/SlaveEndpointTest.NoAuthorizer/0 (13 ms)
[ RUN      ] Endpoint/SlaveEndpointTest.NoAuthorizer/1
I1208 01:13:07.718725 26720 containerizer.cpp:207] Using isolation: posix/cpu,posix/mem,filesystem/posix,network/cni
W1208 01:13:07.719190 26720 backend.cpp:76] Failed to create 'aufs' backend: AufsBackend requires
root privileges, but is running as user mesos
W1208 01:13:07.719296 26720 backend.cpp:76] Failed to create 'bind' backend: BindBackend requires
root privileges
I1208 01:13:07.719991 26720 cluster.cpp:446] Creating default 'local' authorizer
I1208 01:13:07.720461 26727 slave.cpp:208] Mesos agent started on (658)@172.17.0.2:57339
I1208 01:13:07.720481 26727 slave.cpp:209] Flags at startup: --acls="" --appc_simple_discovery_uri_prefix="http://"
--appc_store_dir="/tmp/mesos/store/appc" --authenticate_http_readonly="true" --authenticate_http_readwrite="true"
--authenticatee="crammd5" --authentication_backoff_factor="1secs" --authorizer="local" --cgroups_cpu_enable_pids_and_tids_count="false"
--cgroups_enable_cfs="false" --cgroups_hierarchy="/sys/fs/cgroup" --cgroups_limit_swap="false"
--cgroups_root="mesos" --container_disk_watch_interval="15secs" --containerizers="mesos" --credential="/tmp/Endpoint_SlaveEndpointTest_NoAuthorizer_1_cM5bW6/credential"
--default_role="*" --disk_watch_interval="1mins" --docker="docker" --docker_kill_orphans="true"
--docker_registry="https://registry-1.docker.io" --docker_remove_delay="6hrs" --docker_socket="/var/run/docker.sock"
--docker_stop_timeout="0ns" --docker_store_dir="/tmp/mesos/store/docker" --docker_volume_checkpoint_dir="/var/run/mesos/isolators/docker/volume"
--enforce_container_disk_quota="false" --executor_registration_timeout="1mins" --executor_shutdown_grace_period="5secs"
--fetcher_cache_dir="/tmp/Endpoint_SlaveEndpointTest_NoAuthorizer_1_cM5bW6/fetch" --fetcher_cache_size="2GB"
--frameworks_home="" --gc_delay="1weeks" --gc_disk_headroom="0.1" --hadoop_home="" --help="false"
--hostname_lookup="true" --http_authenticators="basic" --http_command_executor="false" --http_credentials="/tmp/Endpoint_SlaveEndpointTest_NoAuthorizer_1_cM5bW6/http_credentials"
--image_provisioner_backend="copy" --initialize_driver_logging="true" --io_switchboard_enable_server="true"
--isolation="posix/cpu,posix/mem" --launcher="posix" --launcher_dir="/mesos/build/src" --logbufsecs="0"
--logging_level="INFO" --max_completed_executors_per_framework="150" --oversubscribed_resources_interval="15secs"
--perf_duration="10secs" --perf_interval="1mins" --qos_correction_interval_min="0ns" --quiet="false"
--recover="reconnect" --recovery_timeout="15mins" --registration_backoff_factor="10ms" --resources="cpus:2;gpus:0;mem:1024;disk:1024;ports:[31000-32000]"
--revocable_cpu_low_priority="true" --runtime_dir="/tmp/Endpoint_SlaveEndpointTest_NoAuthorizer_1_cM5bW6"
--sandbox_directory="/mnt/mesos/sandbox" --strict="true" --switch_user="true" --systemd_enable_support="true"
--systemd_runtime_directory="/run/systemd/system" --version="false" --work_dir="/tmp/Endpoint_SlaveEndpointTest_NoAuthorizer_1_yTR4hn"
I1208 01:13:07.720873 26727 credentials.hpp:86] Loading credential for authentication from
'/tmp/Endpoint_SlaveEndpointTest_NoAuthorizer_1_cM5bW6/credential'
I1208 01:13:07.720962 26727 slave.cpp:346] Agent using credential for: test-principal
I1208 01:13:07.720976 26727 credentials.hpp:37] Loading credentials for authentication from
'/tmp/Endpoint_SlaveEndpointTest_NoAuthorizer_1_cM5bW6/http_credentials'
I1208 01:13:07.721082 26727 http.cpp:922] Using default 'basic' HTTP authenticator for realm
'mesos-agent-readonly'
I1208 01:13:07.721134 26727 http.cpp:922] Using default 'basic' HTTP authenticator for realm
'mesos-agent-readwrite'
I1208 01:13:07.721475 26727 slave.cpp:533] Agent resources: cpus(*):2; mem(*):1024; disk(*):1024;
ports(*):[31000-32000]
I1208 01:13:07.721514 26727 slave.cpp:541] Agent attributes: [  ]
I1208 01:13:07.721524 26727 slave.cpp:546] Agent hostname: 17b67c4b8dfe
I1208 01:13:07.721886 26724 state.cpp:57] Recovering state from '/tmp/Endpoint_SlaveEndpointTest_NoAuthorizer_1_yTR4hn/meta'
I1208 01:13:07.722061 26734 status_update_manager.cpp:203] Recovering status update manager
I1208 01:13:07.722206 26732 containerizer.cpp:581] Recovering containerizer
I1208 01:13:07.723628 26732 provisioner.cpp:253] Provisioner recovery complete
I1208 01:13:07.723882 26726 slave.cpp:5414] Finished recovery
I1208 01:13:07.724267 26726 slave.cpp:5588] Querying resource estimator for oversubscribable
resources
I1208 01:13:07.724411 26731 slave.cpp:5602] Received oversubscribable resources {} from the
resource estimator
I1208 01:13:07.725028 26723 process.cpp:3679] Handling HTTP event for process 'slave(658)'
with path: '/slave(658)/monitor/statistics.json'
I1208 01:13:07.725551 26730 http.cpp:874] Authorizing principal 'test-principal' to GET the
'/monitor/statistics.json' endpoint
I1208 01:13:07.727030 26720 slave.cpp:790] Agent terminating
[       OK ] Endpoint/SlaveEndpointTest.NoAuthorizer/1 (13 ms)
[ RUN      ] Endpoint/SlaveEndpointTest.NoAuthorizer/2
I1208 01:13:07.739217 26720 containerizer.cpp:207] Using isolation: posix/cpu,posix/mem,filesystem/posix,network/cni
W1208 01:13:07.739583 26720 backend.cpp:76] Failed to create 'aufs' backend: AufsBackend requires
root privileges, but is running as user mesos
W1208 01:13:07.739683 26720 backend.cpp:76] Failed to create 'bind' backend: BindBackend requires
root privileges
I1208 01:13:07.740321 26720 cluster.cpp:446] Creating default 'local' authorizer
I1208 01:13:07.740880 26730 slave.cpp:208] Mesos agent started on (659)@172.17.0.2:57339
I1208 01:13:07.740900 26730 slave.cpp:209] Flags at startup: --acls="" --appc_simple_discovery_uri_prefix="http://"
--appc_store_dir="/tmp/mesos/store/appc" --authenticate_http_readonly="true" --authenticate_http_readwrite="true"
--authenticatee="crammd5" --authentication_backoff_factor="1secs" --authorizer="local" --cgroups_cpu_enable_pids_and_tids_count="false"
--cgroups_enable_cfs="false" --cgroups_hierarchy="/sys/fs/cgroup" --cgroups_limit_swap="false"
--cgroups_root="mesos" --container_disk_watch_interval="15secs" --containerizers="mesos" --credential="/tmp/Endpoint_SlaveEndpointTest_NoAuthorizer_2_nrwDH3/credential"
--default_role="*" --disk_watch_interval="1mins" --docker="docker" --docker_kill_orphans="true"
--docker_registry="https://registry-1.docker.io" --docker_remove_delay="6hrs" --docker_socket="/var/run/docker.sock"
--docker_stop_timeout="0ns" --docker_store_dir="/tmp/mesos/store/docker" --docker_volume_checkpoint_dir="/var/run/mesos/isolators/docker/volume"
--enforce_container_disk_quota="false" --executor_registration_timeout="1mins" --executor_shutdown_grace_period="5secs"
--fetcher_cache_dir="/tmp/Endpoint_SlaveEndpointTest_NoAuthorizer_2_nrwDH3/fetch" --fetcher_cache_size="2GB"
--frameworks_home="" --gc_delay="1weeks" --gc_disk_headroom="0.1" --hadoop_home="" --help="false"
--hostname_lookup="true" --http_authenticators="basic" --http_command_executor="false" --http_credentials="/tmp/Endpoint_SlaveEndpointTest_NoAuthorizer_2_nrwDH3/http_credentials"
--image_provisioner_backend="copy" --initialize_driver_logging="true" --io_switchboard_enable_server="true"
--isolation="posix/cpu,posix/mem" --launcher="posix" --launcher_dir="/mesos/build/src" --logbufsecs="0"
--logging_level="INFO" --max_completed_executors_per_framework="150" --oversubscribed_resources_interval="15secs"
--perf_duration="10secs" --perf_interval="1mins" --qos_correction_interval_min="0ns" --quiet="false"
--recover="reconnect" --recovery_timeout="15mins" --registration_backoff_factor="10ms" --resources="cpus:2;gpus:0;mem:1024;disk:1024;ports:[31000-32000]"
--revocable_cpu_low_priority="true" --runtime_dir="/tmp/Endpoint_SlaveEndpointTest_NoAuthorizer_2_nrwDH3"
--sandbox_directory="/mnt/mesos/sandbox" --strict="true" --switch_user="true" --systemd_enable_support="true"
--systemd_runtime_directory="/run/systemd/system" --version="false" --work_dir="/tmp/Endpoint_SlaveEndpointTest_NoAuthorizer_2_s9Za0j"
I1208 01:13:07.741408 26730 credentials.hpp:86] Loading credential for authentication from
'/tmp/Endpoint_SlaveEndpointTest_NoAuthorizer_2_nrwDH3/credential'
I1208 01:13:07.741514 26730 slave.cpp:346] Agent using credential for: test-principal
I1208 01:13:07.741531 26730 credentials.hpp:37] Loading credentials for authentication from
'/tmp/Endpoint_SlaveEndpointTest_NoAuthorizer_2_nrwDH3/http_credentials'
I1208 01:13:07.741655 26730 http.cpp:922] Using default 'basic' HTTP authenticator for realm
'mesos-agent-readonly'
I1208 01:13:07.741714 26730 http.cpp:922] Using default 'basic' HTTP authenticator for realm
'mesos-agent-readwrite'
I1208 01:13:07.742081 26730 slave.cpp:533] Agent resources: cpus(*):2; mem(*):1024; disk(*):1024;
ports(*):[31000-32000]
I1208 01:13:07.742121 26730 slave.cpp:541] Agent attributes: [  ]
I1208 01:13:07.742131 26730 slave.cpp:546] Agent hostname: 17b67c4b8dfe
I1208 01:13:07.742445 26723 state.cpp:57] Recovering state from '/tmp/Endpoint_SlaveEndpointTest_NoAuthorizer_2_s9Za0j/meta'
I1208 01:13:07.742599 26721 status_update_manager.cpp:203] Recovering status update manager
I1208 01:13:07.742735 26730 containerizer.cpp:581] Recovering containerizer
I1208 01:13:07.743378 26733 provisioner.cpp:253] Provisioner recovery complete
I1208 01:13:07.743572 26734 slave.cpp:5414] Finished recovery
I1208 01:13:07.744029 26734 slave.cpp:5588] Querying resource estimator for oversubscribable
resources
I1208 01:13:07.744186 26728 slave.cpp:5602] Received oversubscribable resources {} from the
resource estimator
I1208 01:13:07.744832 26734 process.cpp:3679] Handling HTTP event for process 'slave(659)'
with path: '/slave(659)/containers'
I1208 01:13:07.745255 26735 http.cpp:874] Authorizing principal 'test-principal' to GET the
'/containers' endpoint
I1208 01:13:07.746605 26735 slave.cpp:790] Agent terminating
[       OK ] Endpoint/SlaveEndpointTest.NoAuthorizer/2 (13 ms)
[----------] 9 tests from Endpoint/SlaveEndpointTest (153 ms total)

[----------] Global test environment tear-down
[==========] 1367 tests from 155 test cases ran. (803779 ms total)
[  PASSED  ] 1366 tests.
[  FAILED  ] 1 test, listed below:
[  FAILED  ] MesosContainerizer/DefaultExecutorTest.KillTask/0, where GetParam() = "mesos"

 1 FAILED TEST
  YOU HAVE 9 DISABLED TESTS

Inconsistency detected by ld.so: dl-close.c: 762: _dl_close: Assertion `map->l_init_called'
failed!
make[3]: *** [CMakeFiles/check] Error 127
make[3]: Leaving directory `/mesos/build'
make[2]: *** [CMakeFiles/check.dir/all] Error 2
make[2]: Leaving directory `/mesos/build'
make[1]: *** [CMakeFiles/check.dir/rule] Error 2
make[1]: Leaving directory `/mesos/build'
make: *** [check] Error 2
+ docker rmi mesos-1481155997-8791
Untagged: mesos-1481155997-8791:latest
Deleted: sha256:1def490197dfbc2522e2f85686e0fe62c2f663c8b35c44d38e59ccebe154c124
Deleted: sha256:53173f91cca207709fb8fb66b1b1b58558e791f78c44373cda9a68c13bf4b145
Deleted: sha256:bc82ecb35752b8ba2adc08a7fabdbc1140e78b545eeddd45054a262d432b0c04
Deleted: sha256:a8d88a64b11f224852fa70ac9e02c4524f57748935a63040dee447d6ca4d9114
Deleted: sha256:2f8f2c5e235ae95f792209c2c21f347a34c259e96eb7a790a3816409d335b61b
Deleted: sha256:329a8fb5d3ff312ae9de731737cb2f8e3b9f16a1a5db100d70cbd433998824fb
Deleted: sha256:aa5321e7ee71382260a121b578aa76550f172a0866f2b18bd2b5e6e508cd1a39
Deleted: sha256:fcb3a78fcd0204762381c8f379768c9288542469b87541e7530bf13ad33195fb
Deleted: sha256:5513a3cbdbbdf87b6cbed053670b91407c0aa947dc83e01c521dbb72474409cc
Deleted: sha256:c03099ba0a2e921154ad4f93068f67757a5c008dc1d7949e2ed4dccf5157ed9e
Deleted: sha256:b22e657a4ca49e41c2ad4314ba1f75b04638b281905e0358ba58152eddab9341
Deleted: sha256:e3d9482bf667fcfacb65b23f6d9017ea4c60de1eb356ebdd994dcee0951ff217
Deleted: sha256:c68613b226306ba1dab627d3593078e305d703a01445a01e2b62a80d9f3e221f
Deleted: sha256:8e2c302424a085c9d5bdf2d2aea34fdf6e7a69963ee1b89af15d4d3c463b5657
Deleted: sha256:b6b05136cd4ba891252ef2d20955821a09516933aefd6f617765f2c386fad7fa
Deleted: sha256:9b9019f6bd84fcc26b5dfa1e98d3fcf340fc90d1224ebaf6c73394b71bd5246a
Deleted: sha256:8d22303dd6611c8e34658b2de1465b57f648b19037e568e9d809650de0c49f0b
Deleted: sha256:c8793c96e89d55b1a7885e832f3d094ce8810ce0dc72aaa6ea339eb279c2d05f
Deleted: sha256:96014b27ce69653406245b834179b1dd022abba73747fefe80d5ce01b97f50b7
Deleted: sha256:0659fe8b54383a72c65b061425e693bbc7aa53e15c87e556ce5955af5a69deb6
Deleted: sha256:ceea08d71895a9063636ab102489f8bb37e2c3b1f157349a6107686887a21eea
Deleted: sha256:5134ffaa7968493508ab493c0b8ccba4cb734bd118d0b3da789dc227939b5b85
Deleted: sha256:a5defdf00f40f2514105902c70e95c7d60bef321110e380707ef07e792369178
Deleted: sha256:a71ce7335bb6edbf6429287cfdbeab744a442ca13960f60986d7bc696d29ef0c
Build step 'Execute shell' marked build as failure

Mime
View raw message