mesos-builds mailing list archives

Site index · List index
Message view « Date » · « Thread »
Top « Date » · « Thread »
From Alex R <al...@apache.org>
Subject Re: Build failed in Jenkins: Mesos » autotools,gcc,--verbose --enable-libevent --enable-ssl,GLOG_v=1 MESOS_VERBOSE=1,centos:7,(docker||Hadoop)&&(!ubuntu-us1)&&(!ubuntu-6)&&(!ubuntu-eu2) #2927
Date Mon, 14 Nov 2016 15:31:54 GMT
Looks like VM lags again, updated
https://issues.apache.org/jira/browse/INFRA-12852

On 14 November 2016 at 16:14, Apache Jenkins Server <
jenkins@builds.apache.org> wrote:

> See <https://builds.apache.org/job/Mesos/BUILDTOOL=autotools,
> COMPILER=gcc,CONFIGURATION=--verbose%20--enable-libevent%
> 20--enable-ssl,ENVIRONMENT=GLOG_v=1%20MESOS_VERBOSE=1,OS=
> centos%3A7,label_exp=(docker%7C%7CHadoop)&&(!ubuntu-us1)&&(
> !ubuntu-6)&&(!ubuntu-eu2)/2927/changes>
>
> Changes:
>
> [alexr] Added Stephen Hankinson to contributors list.
>
> ------------------------------------------
> [...truncated 221058 lines...]
> W1114 15:13:55.289245 31937 backend.cpp:76] Failed to create 'bind'
> backend: BindBackend requires root privileges
> I1114 15:13:55.291970 31958 slave.cpp:208] Mesos agent started on (641)@
> 172.17.0.2:48313
> I1114 15:13:55.292012 31958 slave.cpp:209] Flags at startup: --acls=""
> --appc_simple_discovery_uri_prefix="http://" --appc_store_dir="/tmp/mesos/store/appc"
> --authenticate_http_readonly="true" --authenticate_http_readwrite="true"
> --authenticatee="crammd5" --authentication_backoff_factor="1secs"
> --authorizer="local" --cgroups_cpu_enable_pids_and_tids_count="false"
> --cgroups_enable_cfs="false" --cgroups_hierarchy="/sys/fs/cgroup"
> --cgroups_limit_swap="false" --cgroups_root="mesos" --container_disk_watch_interval="15secs"
> --containerizers="mesos" --credential="/tmp/Endpoint_SlaveEndpointTest_
> AuthorizedRequest_1_WCsHil/credential" --default_role="*"
> --disk_watch_interval="1mins" --docker="docker"
> --docker_kill_orphans="true" --docker_registry="https://
> registry-1.docker.io" --docker_remove_delay="6hrs"
> --docker_socket="/var/run/docker.sock" --docker_stop_timeout="0ns"
> --docker_store_dir="/tmp/mesos/store/docker" --docker_volume_checkpoint_
> dir="/var/run/mesos/isolators/docker/volume" --enforce_container_disk_quota="false"
> --executor_registration_timeout="1mins" --executor_shutdown_grace_period="5secs"
> --fetcher_cache_dir="/tmp/Endpoint_SlaveEndpointTest_
> AuthorizedRequest_1_WCsHil/fetch" --fetcher_cache_size="2GB"
> --frameworks_home="" --gc_delay="1weeks" --gc_disk_headroom="0.1"
> --hadoop_home="" --help="false" --hostname_lookup="true"
> --http_authenticators="basic" --http_command_executor="false"
> --http_credentials="/tmp/Endpoint_SlaveEndpointTest_
> AuthorizedRequest_1_WCsHil/http_credentials" --image_provisioner_backend="copy"
> --initialize_driver_logging="true" --isolation="posix/cpu,posix/mem"
> --launcher="posix" --launcher_dir="/mesos/mesos-1.2.0/_build/src"
> --logbufsecs="0" --logging_level="INFO" --max_completed_executors_per_framework="150"
> --oversubscribed_resources_interval="15secs" --perf_duration="10secs"
> --perf_interval="1mins" --qos_correction_interval_min="0ns"
> --quiet="false" --recover="reconnect" --recovery_timeout="15mins"
> --registration_backoff_factor="10ms" --resources="cpus:2;gpus:0;
> mem:1024;disk:1024;ports:[31000-32000]" --revocable_cpu_low_priority="true"
> --runtime_dir="/tmp/Endpoint_SlaveEndpointTest_AuthorizedRequest_1_WCsHil"
> --sandbox_directory="/mnt/mesos/sandbox" --strict="true"
> --switch_user="true" --systemd_enable_support="true"
> --systemd_runtime_directory="/run/systemd/system" --version="false"
> --work_dir="/tmp/Endpoint_SlaveEndpointTest_AuthorizedRequest_1_TxCyPn"
> I1114 15:13:55.292682 31958 credentials.hpp:86] Loading credential for
> authentication from '/tmp/Endpoint_SlaveEndpointTest_
> AuthorizedRequest_1_WCsHil/credential'
> I1114 15:13:55.292845 31958 slave.cpp:346] Agent using credential for:
> test-principal
> I1114 15:13:55.292871 31958 credentials.hpp:37] Loading credentials for
> authentication from '/tmp/Endpoint_SlaveEndpointTest_
> AuthorizedRequest_1_WCsHil/http_credentials'
> I1114 15:13:55.293156 31958 http.cpp:895] Using default 'basic' HTTP
> authenticator for realm 'mesos-agent-readonly'
> I1114 15:13:55.293296 31958 http.cpp:895] Using default 'basic' HTTP
> authenticator for realm 'mesos-agent-readwrite'
> I1114 15:13:55.294399 31958 slave.cpp:533] Agent resources: cpus(*):2;
> mem(*):1024; disk(*):1024; ports(*):[31000-32000]
> I1114 15:13:55.294488 31958 slave.cpp:541] Agent attributes: [  ]
> I1114 15:13:55.294503 31958 slave.cpp:546] Agent hostname: 0fd097464b53
> I1114 15:13:55.296150 31963 state.cpp:57] Recovering state from
> '/tmp/Endpoint_SlaveEndpointTest_AuthorizedRequest_1_TxCyPn/meta'
> I1114 15:13:55.296403 31965 status_update_manager.cpp:203] Recovering
> status update manager
> I1114 15:13:55.296636 31963 containerizer.cpp:561] Recovering containerizer
> I1114 15:13:55.298071 31963 provisioner.cpp:253] Provisioner recovery
> complete
> I1114 15:13:55.298506 31969 slave.cpp:5411] Finished recovery
> I1114 15:13:55.299114 31969 slave.cpp:5585] Querying resource estimator
> for oversubscribable resources
> I1114 15:13:55.299355 31970 slave.cpp:5599] Received oversubscribable
> resources {} from the resource estimator
> I1114 15:13:55.300827 31970 process.cpp:3570] Handling HTTP event for
> process 'slave(641)' with path: '/slave(641)/monitor/statistics.json'
> I1114 15:13:55.301710 31966 http.cpp:847] Authorizing principal
> 'test-principal' to GET the '/monitor/statistics.json' endpoint
> I1114 15:13:55.305363 31961 slave.cpp:787] Agent terminating
> [       OK ] Endpoint/SlaveEndpointTest.AuthorizedRequest/1 (27 ms)
> [ RUN      ] Endpoint/SlaveEndpointTest.AuthorizedRequest/2
> I1114 15:13:55.316088 31937 containerizer.cpp:202] Using isolation:
> posix/cpu,posix/mem,filesystem/posix,network/cni
> W1114 15:13:55.316823 31937 backend.cpp:76] Failed to create 'aufs'
> backend: AufsBackend requires root privileges, but is running as user mesos
> W1114 15:13:55.317013 31937 backend.cpp:76] Failed to create 'bind'
> backend: BindBackend requires root privileges
> I1114 15:13:55.319744 31961 slave.cpp:208] Mesos agent started on (642)@
> 172.17.0.2:48313
> I1114 15:13:55.319769 31961 slave.cpp:209] Flags at startup: --acls=""
> --appc_simple_discovery_uri_prefix="http://" --appc_store_dir="/tmp/mesos/store/appc"
> --authenticate_http_readonly="true" --authenticate_http_readwrite="true"
> --authenticatee="crammd5" --authentication_backoff_factor="1secs"
> --authorizer="local" --cgroups_cpu_enable_pids_and_tids_count="false"
> --cgroups_enable_cfs="false" --cgroups_hierarchy="/sys/fs/cgroup"
> --cgroups_limit_swap="false" --cgroups_root="mesos" --container_disk_watch_interval="15secs"
> --containerizers="mesos" --credential="/tmp/Endpoint_SlaveEndpointTest_
> AuthorizedRequest_2_ctgxqb/credential" --default_role="*"
> --disk_watch_interval="1mins" --docker="docker"
> --docker_kill_orphans="true" --docker_registry="https://
> registry-1.docker.io" --docker_remove_delay="6hrs"
> --docker_socket="/var/run/docker.sock" --docker_stop_timeout="0ns"
> --docker_store_dir="/tmp/mesos/store/docker" --docker_volume_checkpoint_
> dir="/var/run/mesos/isolators/docker/volume" --enforce_container_disk_quota="false"
> --executor_registration_timeout="1mins" --executor_shutdown_grace_period="5secs"
> --fetcher_cache_dir="/tmp/Endpoint_SlaveEndpointTest_
> AuthorizedRequest_2_ctgxqb/fetch" --fetcher_cache_size="2GB"
> --frameworks_home="" --gc_delay="1weeks" --gc_disk_headroom="0.1"
> --hadoop_home="" --help="false" --hostname_lookup="true"
> --http_authenticators="basic" --http_command_executor="false"
> --http_credentials="/tmp/Endpoint_SlaveEndpointTest_
> AuthorizedRequest_2_ctgxqb/http_credentials" --image_provisioner_backend="copy"
> --initialize_driver_logging="true" --isolation="posix/cpu,posix/mem"
> --launcher="posix" --launcher_dir="/mesos/mesos-1.2.0/_build/src"
> --logbufsecs="0" --logging_level="INFO" --max_completed_executors_per_framework="150"
> --oversubscribed_resources_interval="15secs" --perf_duration="10secs"
> --perf_interval="1mins" --qos_correction_interval_min="0ns"
> --quiet="false" --recover="reconnect" --recovery_timeout="15mins"
> --registration_backoff_factor="10ms" --resources="cpus:2;gpus:0;
> mem:1024;disk:1024;ports:[31000-32000]" --revocable_cpu_low_priority="true"
> --runtime_dir="/tmp/Endpoint_SlaveEndpointTest_AuthorizedRequest_2_ctgxqb"
> --sandbox_directory="/mnt/mesos/sandbox" --strict="true"
> --switch_user="true" --systemd_enable_support="true"
> --systemd_runtime_directory="/run/systemd/system" --version="false"
> --work_dir="/tmp/Endpoint_SlaveEndpointTest_AuthorizedRequest_2_dsHTSd"
> I1114 15:13:55.320302 31961 credentials.hpp:86] Loading credential for
> authentication from '/tmp/Endpoint_SlaveEndpointTest_
> AuthorizedRequest_2_ctgxqb/credential'
> I1114 15:13:55.320446 31961 slave.cpp:346] Agent using credential for:
> test-principal
> I1114 15:13:55.320467 31961 credentials.hpp:37] Loading credentials for
> authentication from '/tmp/Endpoint_SlaveEndpointTest_
> AuthorizedRequest_2_ctgxqb/http_credentials'
> I1114 15:13:55.320715 31961 http.cpp:895] Using default 'basic' HTTP
> authenticator for realm 'mesos-agent-readonly'
> I1114 15:13:55.320878 31961 http.cpp:895] Using default 'basic' HTTP
> authenticator for realm 'mesos-agent-readwrite'
> I1114 15:13:55.322024 31961 slave.cpp:533] Agent resources: cpus(*):2;
> mem(*):1024; disk(*):1024; ports(*):[31000-32000]
> I1114 15:13:55.322103 31961 slave.cpp:541] Agent attributes: [  ]
> I1114 15:13:55.322116 31961 slave.cpp:546] Agent hostname: 0fd097464b53
> I1114 15:13:55.323395 31962 state.cpp:57] Recovering state from
> '/tmp/Endpoint_SlaveEndpointTest_AuthorizedRequest_2_dsHTSd/meta'
> I1114 15:13:55.323634 31961 status_update_manager.cpp:203] Recovering
> status update manager
> I1114 15:13:55.323827 31960 containerizer.cpp:561] Recovering containerizer
> I1114 15:13:55.325090 31967 provisioner.cpp:253] Provisioner recovery
> complete
> I1114 15:13:55.325539 31961 slave.cpp:5411] Finished recovery
> I1114 15:13:55.325970 31961 slave.cpp:5585] Querying resource estimator
> for oversubscribable resources
> I1114 15:13:55.326227 31970 slave.cpp:5599] Received oversubscribable
> resources {} from the resource estimator
> I1114 15:13:55.327524 31965 process.cpp:3570] Handling HTTP event for
> process 'slave(642)' with path: '/slave(642)/containers'
> I1114 15:13:55.328734 31963 http.cpp:847] Authorizing principal
> 'test-principal' to GET the '/containers' endpoint
> I1114 15:13:55.331943 31961 slave.cpp:787] Agent terminating
> [       OK ] Endpoint/SlaveEndpointTest.AuthorizedRequest/2 (24 ms)
> [ RUN      ] Endpoint/SlaveEndpointTest.UnauthorizedRequest/0
> I1114 15:13:55.341377 31937 containerizer.cpp:202] Using isolation:
> posix/cpu,posix/mem,filesystem/posix,network/cni
> W1114 15:13:55.342150 31937 backend.cpp:76] Failed to create 'aufs'
> backend: AufsBackend requires root privileges, but is running as user mesos
> W1114 15:13:55.342314 31937 backend.cpp:76] Failed to create 'bind'
> backend: BindBackend requires root privileges
> I1114 15:13:55.345106 31956 slave.cpp:208] Mesos agent started on (643)@
> 172.17.0.2:48313
> I1114 15:13:55.345130 31956 slave.cpp:209] Flags at startup: --acls=""
> --appc_simple_discovery_uri_prefix="http://" --appc_store_dir="/tmp/mesos/store/appc"
> --authenticate_http_readonly="true" --authenticate_http_readwrite="true"
> --authenticatee="crammd5" --authentication_backoff_factor="1secs"
> --authorizer="local" --cgroups_cpu_enable_pids_and_tids_count="false"
> --cgroups_enable_cfs="false" --cgroups_hierarchy="/sys/fs/cgroup"
> --cgroups_limit_swap="false" --cgroups_root="mesos" --container_disk_watch_interval="15secs"
> --containerizers="mesos" --credential="/tmp/Endpoint_SlaveEndpointTest_
> UnauthorizedRequest_0_AaL1O1/credential" --default_role="*"
> --disk_watch_interval="1mins" --docker="docker"
> --docker_kill_orphans="true" --docker_registry="https://
> registry-1.docker.io" --docker_remove_delay="6hrs"
> --docker_socket="/var/run/docker.sock" --docker_stop_timeout="0ns"
> --docker_store_dir="/tmp/mesos/store/docker" --docker_volume_checkpoint_
> dir="/var/run/mesos/isolators/docker/volume" --enforce_container_disk_quota="false"
> --executor_registration_timeout="1mins" --executor_shutdown_grace_period="5secs"
> --fetcher_cache_dir="/tmp/Endpoint_SlaveEndpointTest_
> UnauthorizedRequest_0_AaL1O1/fetch" --fetcher_cache_size="2GB"
> --frameworks_home="" --gc_delay="1weeks" --gc_disk_headroom="0.1"
> --hadoop_home="" --help="false" --hostname_lookup="true"
> --http_authenticators="basic" --http_command_executor="false"
> --http_credentials="/tmp/Endpoint_SlaveEndpointTest_
> UnauthorizedRequest_0_AaL1O1/http_credentials"
> --image_provisioner_backend="copy" --initialize_driver_logging="true"
> --isolation="posix/cpu,posix/mem" --launcher="posix"
> --launcher_dir="/mesos/mesos-1.2.0/_build/src" --logbufsecs="0"
> --logging_level="INFO" --max_completed_executors_per_framework="150"
> --oversubscribed_resources_interval="15secs" --perf_duration="10secs"
> --perf_interval="1mins" --qos_correction_interval_min="0ns"
> --quiet="false" --recover="reconnect" --recovery_timeout="15mins"
> --registration_backoff_factor="10ms" --resources="cpus:2;gpus:0;
> mem:1024;disk:1024;ports:[31000-32000]" --revocable_cpu_low_priority="true"
> --runtime_dir="/tmp/Endpoint_SlaveEndpointTest_UnauthorizedRequest_0_AaL1O1"
> --sandbox_directory="/mnt/mesos/sandbox" --strict="true"
> --switch_user="true" --systemd_enable_support="true"
> --systemd_runtime_directory="/run/systemd/system" --version="false"
> --work_dir="/tmp/Endpoint_SlaveEndpointTest_UnauthorizedRequest_0_R4sid4"
> I1114 15:13:55.345719 31956 credentials.hpp:86] Loading credential for
> authentication from '/tmp/Endpoint_SlaveEndpointTest_
> UnauthorizedRequest_0_AaL1O1/credential'
> I1114 15:13:55.345854 31956 slave.cpp:346] Agent using credential for:
> test-principal
> I1114 15:13:55.345880 31956 credentials.hpp:37] Loading credentials for
> authentication from '/tmp/Endpoint_SlaveEndpointTest_
> UnauthorizedRequest_0_AaL1O1/http_credentials'
> I1114 15:13:55.346093 31956 http.cpp:895] Using default 'basic' HTTP
> authenticator for realm 'mesos-agent-readonly'
> I1114 15:13:55.346220 31956 http.cpp:895] Using default 'basic' HTTP
> authenticator for realm 'mesos-agent-readwrite'
> I1114 15:13:55.347283 31956 slave.cpp:533] Agent resources: cpus(*):2;
> mem(*):1024; disk(*):1024; ports(*):[31000-32000]
> I1114 15:13:55.347364 31956 slave.cpp:541] Agent attributes: [  ]
> I1114 15:13:55.347384 31956 slave.cpp:546] Agent hostname: 0fd097464b53
> I1114 15:13:55.348701 31962 state.cpp:57] Recovering state from
> '/tmp/Endpoint_SlaveEndpointTest_UnauthorizedRequest_0_R4sid4/meta'
> I1114 15:13:55.348918 31959 status_update_manager.cpp:203] Recovering
> status update manager
> I1114 15:13:55.349113 31963 containerizer.cpp:561] Recovering containerizer
> I1114 15:13:55.350286 31971 provisioner.cpp:253] Provisioner recovery
> complete
> I1114 15:13:55.350661 31959 slave.cpp:5411] Finished recovery
> I1114 15:13:55.351114 31959 slave.cpp:5585] Querying resource estimator
> for oversubscribable resources
> I1114 15:13:55.351366 31971 slave.cpp:5599] Received oversubscribable
> resources {} from the resource estimator
> I1114 15:13:55.352695 31956 process.cpp:3570] Handling HTTP event for
> process 'slave(643)' with path: '/slave(643)/monitor/statistics'
> I1114 15:13:55.353638 31963 http.cpp:847] Authorizing principal
> 'test-principal' to GET the '/monitor/statistics' endpoint
> I1114 15:13:55.355501 31957 slave.cpp:787] Agent terminating
> [       OK ] Endpoint/SlaveEndpointTest.UnauthorizedRequest/0 (24 ms)
> [ RUN      ] Endpoint/SlaveEndpointTest.UnauthorizedRequest/1
> I1114 15:13:55.365176 31937 containerizer.cpp:202] Using isolation:
> posix/cpu,posix/mem,filesystem/posix,network/cni
> W1114 15:13:55.365842 31937 backend.cpp:76] Failed to create 'aufs'
> backend: AufsBackend requires root privileges, but is running as user mesos
> W1114 15:13:55.365983 31937 backend.cpp:76] Failed to create 'bind'
> backend: BindBackend requires root privileges
> I1114 15:13:55.368731 31959 slave.cpp:208] Mesos agent started on (644)@
> 172.17.0.2:48313
> I1114 15:13:55.368767 31959 slave.cpp:209] Flags at startup: --acls=""
> --appc_simple_discovery_uri_prefix="http://" --appc_store_dir="/tmp/mesos/store/appc"
> --authenticate_http_readonly="true" --authenticate_http_readwrite="true"
> --authenticatee="crammd5" --authentication_backoff_factor="1secs"
> --authorizer="local" --cgroups_cpu_enable_pids_and_tids_count="false"
> --cgroups_enable_cfs="false" --cgroups_hierarchy="/sys/fs/cgroup"
> --cgroups_limit_swap="false" --cgroups_root="mesos" --container_disk_watch_interval="15secs"
> --containerizers="mesos" --credential="/tmp/Endpoint_SlaveEndpointTest_
> UnauthorizedRequest_1_U6yntS/credential" --default_role="*"
> --disk_watch_interval="1mins" --docker="docker"
> --docker_kill_orphans="true" --docker_registry="https://
> registry-1.docker.io" --docker_remove_delay="6hrs"
> --docker_socket="/var/run/docker.sock" --docker_stop_timeout="0ns"
> --docker_store_dir="/tmp/mesos/store/docker" --docker_volume_checkpoint_
> dir="/var/run/mesos/isolators/docker/volume" --enforce_container_disk_quota="false"
> --executor_registration_timeout="1mins" --executor_shutdown_grace_period="5secs"
> --fetcher_cache_dir="/tmp/Endpoint_SlaveEndpointTest_
> UnauthorizedRequest_1_U6yntS/fetch" --fetcher_cache_size="2GB"
> --frameworks_home="" --gc_delay="1weeks" --gc_disk_headroom="0.1"
> --hadoop_home="" --help="false" --hostname_lookup="true"
> --http_authenticators="basic" --http_command_executor="false"
> --http_credentials="/tmp/Endpoint_SlaveEndpointTest_
> UnauthorizedRequest_1_U6yntS/http_credentials"
> --image_provisioner_backend="copy" --initialize_driver_logging="true"
> --isolation="posix/cpu,posix/mem" --launcher="posix"
> --launcher_dir="/mesos/mesos-1.2.0/_build/src" --logbufsecs="0"
> --logging_level="INFO" --max_completed_executors_per_framework="150"
> --oversubscribed_resources_interval="15secs" --perf_duration="10secs"
> --perf_interval="1mins" --qos_correction_interval_min="0ns"
> --quiet="false" --recover="reconnect" --recovery_timeout="15mins"
> --registration_backoff_factor="10ms" --resources="cpus:2;gpus:0;
> mem:1024;disk:1024;ports:[31000-32000]" --revocable_cpu_low_priority="true"
> --runtime_dir="/tmp/Endpoint_SlaveEndpointTest_UnauthorizedRequest_1_U6yntS"
> --sandbox_directory="/mnt/mesos/sandbox" --strict="true"
> --switch_user="true" --systemd_enable_support="true"
> --systemd_runtime_directory="/run/systemd/system" --version="false"
> --work_dir="/tmp/Endpoint_SlaveEndpointTest_UnauthorizedRequest_1_j54JNU"
> I1114 15:13:55.369266 31959 credentials.hpp:86] Loading credential for
> authentication from '/tmp/Endpoint_SlaveEndpointTest_
> UnauthorizedRequest_1_U6yntS/credential'
> I1114 15:13:55.369390 31959 slave.cpp:346] Agent using credential for:
> test-principal
> I1114 15:13:55.369410 31959 credentials.hpp:37] Loading credentials for
> authentication from '/tmp/Endpoint_SlaveEndpointTest_
> UnauthorizedRequest_1_U6yntS/http_credentials'
> I1114 15:13:55.369624 31959 http.cpp:895] Using default 'basic' HTTP
> authenticator for realm 'mesos-agent-readonly'
> I1114 15:13:55.369741 31959 http.cpp:895] Using default 'basic' HTTP
> authenticator for realm 'mesos-agent-readwrite'
> I1114 15:13:55.370857 31959 slave.cpp:533] Agent resources: cpus(*):2;
> mem(*):1024; disk(*):1024; ports(*):[31000-32000]
> I1114 15:13:55.370942 31959 slave.cpp:541] Agent attributes: [  ]
> I1114 15:13:55.370955 31959 slave.cpp:546] Agent hostname: 0fd097464b53
> I1114 15:13:55.372329 31970 state.cpp:57] Recovering state from
> '/tmp/Endpoint_SlaveEndpointTest_UnauthorizedRequest_1_j54JNU/meta'
> I1114 15:13:55.372685 31962 status_update_manager.cpp:203] Recovering
> status update manager
> I1114 15:13:55.372918 31959 containerizer.cpp:561] Recovering containerizer
> I1114 15:13:55.374339 31957 provisioner.cpp:253] Provisioner recovery
> complete
> I1114 15:13:55.374681 31956 slave.cpp:5411] Finished recovery
> I1114 15:13:55.375326 31956 slave.cpp:5585] Querying resource estimator
> for oversubscribable resources
> I1114 15:13:55.375557 31962 slave.cpp:5599] Received oversubscribable
> resources {} from the resource estimator
> I1114 15:13:55.377068 31966 process.cpp:3570] Handling HTTP event for
> process 'slave(644)' with path: '/slave(644)/monitor/statistics.json'
> I1114 15:13:55.378070 31968 http.cpp:847] Authorizing principal
> 'test-principal' to GET the '/monitor/statistics.json' endpoint
> I1114 15:13:55.380553 31968 slave.cpp:787] Agent terminating
> [       OK ] Endpoint/SlaveEndpointTest.UnauthorizedRequest/1 (25 ms)
> [ RUN      ] Endpoint/SlaveEndpointTest.UnauthorizedRequest/2
> I1114 15:13:55.391234 31937 containerizer.cpp:202] Using isolation:
> posix/cpu,posix/mem,filesystem/posix,network/cni
> W1114 15:13:55.391975 31937 backend.cpp:76] Failed to create 'aufs'
> backend: AufsBackend requires root privileges, but is running as user mesos
> W1114 15:13:55.392154 31937 backend.cpp:76] Failed to create 'bind'
> backend: BindBackend requires root privileges
> I1114 15:13:55.395339 31967 slave.cpp:208] Mesos agent started on (645)@
> 172.17.0.2:48313
> I1114 15:13:55.395398 31967 slave.cpp:209] Flags at startup: --acls=""
> --appc_simple_discovery_uri_prefix="http://" --appc_store_dir="/tmp/mesos/store/appc"
> --authenticate_http_readonly="true" --authenticate_http_readwrite="true"
> --authenticatee="crammd5" --authentication_backoff_factor="1secs"
> --authorizer="local" --cgroups_cpu_enable_pids_and_tids_count="false"
> --cgroups_enable_cfs="false" --cgroups_hierarchy="/sys/fs/cgroup"
> --cgroups_limit_swap="false" --cgroups_root="mesos" --container_disk_watch_interval="15secs"
> --containerizers="mesos" --credential="/tmp/Endpoint_SlaveEndpointTest_
> UnauthorizedRequest_2_qJleoJ/credential" --default_role="*"
> --disk_watch_interval="1mins" --docker="docker"
> --docker_kill_orphans="true" --docker_registry="https://
> registry-1.docker.io" --docker_remove_delay="6hrs"
> --docker_socket="/var/run/docker.sock" --docker_stop_timeout="0ns"
> --docker_store_dir="/tmp/mesos/store/docker" --docker_volume_checkpoint_
> dir="/var/run/mesos/isolators/docker/volume" --enforce_container_disk_quota="false"
> --executor_registration_timeout="1mins" --executor_shutdown_grace_period="5secs"
> --fetcher_cache_dir="/tmp/Endpoint_SlaveEndpointTest_
> UnauthorizedRequest_2_qJleoJ/fetch" --fetcher_cache_size="2GB"
> --frameworks_home="" --gc_delay="1weeks" --gc_disk_headroom="0.1"
> --hadoop_home="" --help="false" --hostname_lookup="true"
> --http_authenticators="basic" --http_command_executor="false"
> --http_credentials="/tmp/Endpoint_SlaveEndpointTest_
> UnauthorizedRequest_2_qJleoJ/http_credentials"
> --image_provisioner_backend="copy" --initialize_driver_logging="true"
> --isolation="posix/cpu,posix/mem" --launcher="posix"
> --launcher_dir="/mesos/mesos-1.2.0/_build/src" --logbufsecs="0"
> --logging_level="INFO" --max_completed_executors_per_framework="150"
> --oversubscribed_resources_interval="15secs" --perf_duration="10secs"
> --perf_interval="1mins" --qos_correction_interval_min="0ns"
> --quiet="false" --recover="reconnect" --recovery_timeout="15mins"
> --registration_backoff_factor="10ms" --resources="cpus:2;gpus:0;
> mem:1024;disk:1024;ports:[31000-32000]" --revocable_cpu_low_priority="true"
> --runtime_dir="/tmp/Endpoint_SlaveEndpointTest_UnauthorizedRequest_2_qJleoJ"
> --sandbox_directory="/mnt/mesos/sandbox" --strict="true"
> --switch_user="true" --systemd_enable_support="true"
> --systemd_runtime_directory="/run/systemd/system" --version="false"
> --work_dir="/tmp/Endpoint_SlaveEndpointTest_UnauthorizedRequest_2_bhJnEL"
> I1114 15:13:55.396050 31967 credentials.hpp:86] Loading credential for
> authentication from '/tmp/Endpoint_SlaveEndpointTest_
> UnauthorizedRequest_2_qJleoJ/credential'
> I1114 15:13:55.396241 31967 slave.cpp:346] Agent using credential for:
> test-principal
> I1114 15:13:55.396273 31967 credentials.hpp:37] Loading credentials for
> authentication from '/tmp/Endpoint_SlaveEndpointTest_
> UnauthorizedRequest_2_qJleoJ/http_credentials'
> I1114 15:13:55.396571 31967 http.cpp:895] Using default 'basic' HTTP
> authenticator for realm 'mesos-agent-readonly'
> I1114 15:13:55.396742 31967 http.cpp:895] Using default 'basic' HTTP
> authenticator for realm 'mesos-agent-readwrite'
> I1114 15:13:55.398185 31967 slave.cpp:533] Agent resources: cpus(*):2;
> mem(*):1024; disk(*):1024; ports(*):[31000-32000]
> I1114 15:13:55.398291 31967 slave.cpp:541] Agent attributes: [  ]
> I1114 15:13:55.398317 31967 slave.cpp:546] Agent hostname: 0fd097464b53
> I1114 15:13:55.400064 31962 state.cpp:57] Recovering state from
> '/tmp/Endpoint_SlaveEndpointTest_UnauthorizedRequest_2_bhJnEL/meta'
> I1114 15:13:55.400421 31964 status_update_manager.cpp:203] Recovering
> status update manager
> I1114 15:13:55.400877 31957 containerizer.cpp:561] Recovering containerizer
> I1114 15:13:55.402654 31956 provisioner.cpp:253] Provisioner recovery
> complete
> I1114 15:13:55.403177 31966 slave.cpp:5411] Finished recovery
> I1114 15:13:55.403852 31966 slave.cpp:5585] Querying resource estimator
> for oversubscribable resources
> I1114 15:13:55.404175 31965 slave.cpp:5599] Received oversubscribable
> resources {} from the resource estimator
> I1114 15:13:55.406162 31970 process.cpp:3570] Handling HTTP event for
> process 'slave(645)' with path: '/slave(645)/containers'
> I1114 15:13:55.407140 31970 http.cpp:847] Authorizing principal
> 'test-principal' to GET the '/containers' endpoint
> I1114 15:13:55.409245 31971 slave.cpp:787] Agent terminating
> [       OK ] Endpoint/SlaveEndpointTest.UnauthorizedRequest/2 (28 ms)
> [ RUN      ] Endpoint/SlaveEndpointTest.NoAuthorizer/0
> I1114 15:13:55.419759 31937 containerizer.cpp:202] Using isolation:
> posix/cpu,posix/mem,filesystem/posix,network/cni
> W1114 15:13:55.420467 31937 backend.cpp:76] Failed to create 'aufs'
> backend: AufsBackend requires root privileges, but is running as user mesos
> W1114 15:13:55.420665 31937 backend.cpp:76] Failed to create 'bind'
> backend: BindBackend requires root privileges
> I1114 15:13:55.422129 31937 cluster.cpp:435] Creating default 'local'
> authorizer
> I1114 15:13:55.423694 31966 slave.cpp:208] Mesos agent started on (646)@
> 172.17.0.2:48313
> I1114 15:13:55.423722 31966 slave.cpp:209] Flags at startup: --acls=""
> --appc_simple_discovery_uri_prefix="http://" --appc_store_dir="/tmp/mesos/store/appc"
> --authenticate_http_readonly="true" --authenticate_http_readwrite="true"
> --authenticatee="crammd5" --authentication_backoff_factor="1secs"
> --authorizer="local" --cgroups_cpu_enable_pids_and_tids_count="false"
> --cgroups_enable_cfs="false" --cgroups_hierarchy="/sys/fs/cgroup"
> --cgroups_limit_swap="false" --cgroups_root="mesos" --container_disk_watch_interval="15secs"
> --containerizers="mesos" --credential="/tmp/Endpoint_SlaveEndpointTest_
> NoAuthorizer_0_ixIwBA/credential" --default_role="*"
> --disk_watch_interval="1mins" --docker="docker"
> --docker_kill_orphans="true" --docker_registry="https://
> registry-1.docker.io" --docker_remove_delay="6hrs"
> --docker_socket="/var/run/docker.sock" --docker_stop_timeout="0ns"
> --docker_store_dir="/tmp/mesos/store/docker" --docker_volume_checkpoint_
> dir="/var/run/mesos/isolators/docker/volume" --enforce_container_disk_quota="false"
> --executor_registration_timeout="1mins" --executor_shutdown_grace_period="5secs"
> --fetcher_cache_dir="/tmp/Endpoint_SlaveEndpointTest_NoAuthorizer_0_ixIwBA/fetch"
> --fetcher_cache_size="2GB" --frameworks_home="" --gc_delay="1weeks"
> --gc_disk_headroom="0.1" --hadoop_home="" --help="false"
> --hostname_lookup="true" --http_authenticators="basic"
> --http_command_executor="false" --http_credentials="/tmp/
> Endpoint_SlaveEndpointTest_NoAuthorizer_0_ixIwBA/http_credentials"
> --image_provisioner_backend="copy" --initialize_driver_logging="true"
> --isolation="posix/cpu,posix/mem" --launcher="posix"
> --launcher_dir="/mesos/mesos-1.2.0/_build/src" --logbufsecs="0"
> --logging_level="INFO" --max_completed_executors_per_framework="150"
> --oversubscribed_resources_interval="15secs" --perf_duration="10secs"
> --perf_interval="1mins" --qos_correction_interval_min="0ns"
> --quiet="false" --recover="reconnect" --recovery_timeout="15mins"
> --registration_backoff_factor="10ms" --resources="cpus:2;gpus:0;
> mem:1024;disk:1024;ports:[31000-32000]" --revocable_cpu_low_priority="true"
> --runtime_dir="/tmp/Endpoint_SlaveEndpointTest_NoAuthorizer_0_ixIwBA"
> --sandbox_directory="/mnt/mesos/sandbox" --strict="true"
> --switch_user="true" --systemd_enable_support="true"
> --systemd_runtime_directory="/run/systemd/system" --version="false"
> --work_dir="/tmp/Endpoint_SlaveEndpointTest_NoAuthorizer_0_TVN4MC"
> I1114 15:13:55.424474 31966 credentials.hpp:86] Loading credential for
> authentication from '/tmp/Endpoint_SlaveEndpointTest_
> NoAuthorizer_0_ixIwBA/credential'
> I1114 15:13:55.424649 31966 slave.cpp:346] Agent using credential for:
> test-principal
> I1114 15:13:55.424677 31966 credentials.hpp:37] Loading credentials for
> authentication from '/tmp/Endpoint_SlaveEndpointTest_
> NoAuthorizer_0_ixIwBA/http_credentials'
> I1114 15:13:55.424999 31966 http.cpp:895] Using default 'basic' HTTP
> authenticator for realm 'mesos-agent-readonly'
> I1114 15:13:55.425124 31966 http.cpp:895] Using default 'basic' HTTP
> authenticator for realm 'mesos-agent-readwrite'
> I1114 15:13:55.426367 31966 slave.cpp:533] Agent resources: cpus(*):2;
> mem(*):1024; disk(*):1024; ports(*):[31000-32000]
> I1114 15:13:55.426451 31966 slave.cpp:541] Agent attributes: [  ]
> I1114 15:13:55.426465 31966 slave.cpp:546] Agent hostname: 0fd097464b53
> I1114 15:13:55.427794 31963 state.cpp:57] Recovering state from
> '/tmp/Endpoint_SlaveEndpointTest_NoAuthorizer_0_TVN4MC/meta'
> I1114 15:13:55.428072 31966 status_update_manager.cpp:203] Recovering
> status update manager
> I1114 15:13:55.428266 31960 containerizer.cpp:561] Recovering containerizer
> I1114 15:13:55.429555 31971 provisioner.cpp:253] Provisioner recovery
> complete
> I1114 15:13:55.429949 31960 slave.cpp:5411] Finished recovery
> I1114 15:13:55.430482 31960 slave.cpp:5585] Querying resource estimator
> for oversubscribable resources
> I1114 15:13:55.430757 31964 slave.cpp:5599] Received oversubscribable
> resources {} from the resource estimator
> I1114 15:13:55.432373 31960 process.cpp:3570] Handling HTTP event for
> process 'slave(646)' with path: '/slave(646)/monitor/statistics'
> I1114 15:13:55.433332 31965 http.cpp:847] Authorizing principal
> 'test-principal' to GET the '/monitor/statistics' endpoint
> I1114 15:13:55.436605 31962 slave.cpp:787] Agent terminating
> [       OK ] Endpoint/SlaveEndpointTest.NoAuthorizer/0 (27 ms)
> [ RUN      ] Endpoint/SlaveEndpointTest.NoAuthorizer/1
> I1114 15:13:55.447150 31937 containerizer.cpp:202] Using isolation:
> posix/cpu,posix/mem,filesystem/posix,network/cni
> W1114 15:13:55.447868 31937 backend.cpp:76] Failed to create 'aufs'
> backend: AufsBackend requires root privileges, but is running as user mesos
> W1114 15:13:55.448055 31937 backend.cpp:76] Failed to create 'bind'
> backend: BindBackend requires root privileges
> I1114 15:13:55.449651 31937 cluster.cpp:435] Creating default 'local'
> authorizer
> I1114 15:13:55.451098 31963 slave.cpp:208] Mesos agent started on (647)@
> 172.17.0.2:48313
> I1114 15:13:55.451122 31963 slave.cpp:209] Flags at startup: --acls=""
> --appc_simple_discovery_uri_prefix="http://" --appc_store_dir="/tmp/mesos/store/appc"
> --authenticate_http_readonly="true" --authenticate_http_readwrite="true"
> --authenticatee="crammd5" --authentication_backoff_factor="1secs"
> --authorizer="local" --cgroups_cpu_enable_pids_and_tids_count="false"
> --cgroups_enable_cfs="false" --cgroups_hierarchy="/sys/fs/cgroup"
> --cgroups_limit_swap="false" --cgroups_root="mesos" --container_disk_watch_interval="15secs"
> --containerizers="mesos" --credential="/tmp/Endpoint_SlaveEndpointTest_
> NoAuthorizer_1_SLjs6r/credential" --default_role="*"
> --disk_watch_interval="1mins" --docker="docker"
> --docker_kill_orphans="true" --docker_registry="https://
> registry-1.docker.io" --docker_remove_delay="6hrs"
> --docker_socket="/var/run/docker.sock" --docker_stop_timeout="0ns"
> --docker_store_dir="/tmp/mesos/store/docker" --docker_volume_checkpoint_
> dir="/var/run/mesos/isolators/docker/volume" --enforce_container_disk_quota="false"
> --executor_registration_timeout="1mins" --executor_shutdown_grace_period="5secs"
> --fetcher_cache_dir="/tmp/Endpoint_SlaveEndpointTest_NoAuthorizer_1_SLjs6r/fetch"
> --fetcher_cache_size="2GB" --frameworks_home="" --gc_delay="1weeks"
> --gc_disk_headroom="0.1" --hadoop_home="" --help="false"
> --hostname_lookup="true" --http_authenticators="basic"
> --http_command_executor="false" --http_credentials="/tmp/
> Endpoint_SlaveEndpointTest_NoAuthorizer_1_SLjs6r/http_credentials"
> --image_provisioner_backend="copy" --initialize_driver_logging="true"
> --isolation="posix/cpu,posix/mem" --launcher="posix"
> --launcher_dir="/mesos/mesos-1.2.0/_build/src" --logbufsecs="0"
> --logging_level="INFO" --max_completed_executors_per_framework="150"
> --oversubscribed_resources_interval="15secs" --perf_duration="10secs"
> --perf_interval="1mins" --qos_correction_interval_min="0ns"
> --quiet="false" --recover="reconnect" --recovery_timeout="15mins"
> --registration_backoff_factor="10ms" --resources="cpus:2;gpus:0;
> mem:1024;disk:1024;ports:[31000-32000]" --revocable_cpu_low_priority="true"
> --runtime_dir="/tmp/Endpoint_SlaveEndpointTest_NoAuthorizer_1_SLjs6r"
> --sandbox_directory="/mnt/mesos/sandbox" --strict="true"
> --switch_user="true" --systemd_enable_support="true"
> --systemd_runtime_directory="/run/systemd/system" --version="false"
> --work_dir="/tmp/Endpoint_SlaveEndpointTest_NoAuthorizer_1_d8kzdu"
> I1114 15:13:55.451630 31963 credentials.hpp:86] Loading credential for
> authentication from '/tmp/Endpoint_SlaveEndpointTest_
> NoAuthorizer_1_SLjs6r/credential'
> I1114 15:13:55.451791 31963 slave.cpp:346] Agent using credential for:
> test-principal
> I1114 15:13:55.451813 31963 credentials.hpp:37] Loading credentials for
> authentication from '/tmp/Endpoint_SlaveEndpointTest_
> NoAuthorizer_1_SLjs6r/http_credentials'
> I1114 15:13:55.452039 31963 http.cpp:895] Using default 'basic' HTTP
> authenticator for realm 'mesos-agent-readonly'
> I1114 15:13:55.452181 31963 http.cpp:895] Using default 'basic' HTTP
> authenticator for realm 'mesos-agent-readwrite'
> I1114 15:13:55.453352 31963 slave.cpp:533] Agent resources: cpus(*):2;
> mem(*):1024; disk(*):1024; ports(*):[31000-32000]
> I1114 15:13:55.453476 31963 slave.cpp:541] Agent attributes: [  ]
> I1114 15:13:55.453497 31963 slave.cpp:546] Agent hostname: 0fd097464b53
> I1114 15:13:55.454952 31965 state.cpp:57] Recovering state from
> '/tmp/Endpoint_SlaveEndpointTest_NoAuthorizer_1_d8kzdu/meta'
> I1114 15:13:55.455255 31961 status_update_manager.cpp:203] Recovering
> status update manager
> I1114 15:13:55.455471 31957 containerizer.cpp:561] Recovering containerizer
> I1114 15:13:55.456645 31966 provisioner.cpp:253] Provisioner recovery
> complete
> I1114 15:13:55.457069 31970 slave.cpp:5411] Finished recovery
> I1114 15:13:55.457578 31970 slave.cpp:5585] Querying resource estimator
> for oversubscribable resources
> I1114 15:13:55.457798 31963 slave.cpp:5599] Received oversubscribable
> resources {} from the resource estimator
> I1114 15:13:55.459007 31971 process.cpp:3570] Handling HTTP event for
> process 'slave(647)' with path: '/slave(647)/monitor/statistics.json'
> I1114 15:13:55.459825 31961 http.cpp:847] Authorizing principal
> 'test-principal' to GET the '/monitor/statistics.json' endpoint
> I1114 15:13:55.462957 31962 slave.cpp:787] Agent terminating
> [       OK ] Endpoint/SlaveEndpointTest.NoAuthorizer/1 (26 ms)
> [ RUN      ] Endpoint/SlaveEndpointTest.NoAuthorizer/2
> I1114 15:13:55.473310 31937 containerizer.cpp:202] Using isolation:
> posix/cpu,posix/mem,filesystem/posix,network/cni
> W1114 15:13:55.474553 31937 backend.cpp:76] Failed to create 'aufs'
> backend: AufsBackend requires root privileges, but is running as user mesos
> W1114 15:13:55.474766 31937 backend.cpp:76] Failed to create 'bind'
> backend: BindBackend requires root privileges
> I1114 15:13:55.476538 31937 cluster.cpp:435] Creating default 'local'
> authorizer
> I1114 15:13:55.478114 31969 slave.cpp:208] Mesos agent started on (648)@
> 172.17.0.2:48313
> I1114 15:13:55.478142 31969 slave.cpp:209] Flags at startup: --acls=""
> --appc_simple_discovery_uri_prefix="http://" --appc_store_dir="/tmp/mesos/store/appc"
> --authenticate_http_readonly="true" --authenticate_http_readwrite="true"
> --authenticatee="crammd5" --authentication_backoff_factor="1secs"
> --authorizer="local" --cgroups_cpu_enable_pids_and_tids_count="false"
> --cgroups_enable_cfs="false" --cgroups_hierarchy="/sys/fs/cgroup"
> --cgroups_limit_swap="false" --cgroups_root="mesos" --container_disk_watch_interval="15secs"
> --containerizers="mesos" --credential="/tmp/Endpoint_SlaveEndpointTest_
> NoAuthorizer_2_EXyvSj/credential" --default_role="*"
> --disk_watch_interval="1mins" --docker="docker"
> --docker_kill_orphans="true" --docker_registry="https://
> registry-1.docker.io" --docker_remove_delay="6hrs"
> --docker_socket="/var/run/docker.sock" --docker_stop_timeout="0ns"
> --docker_store_dir="/tmp/mesos/store/docker" --docker_volume_checkpoint_
> dir="/var/run/mesos/isolators/docker/volume" --enforce_container_disk_quota="false"
> --executor_registration_timeout="1mins" --executor_shutdown_grace_period="5secs"
> --fetcher_cache_dir="/tmp/Endpoint_SlaveEndpointTest_NoAuthorizer_2_EXyvSj/fetch"
> --fetcher_cache_size="2GB" --frameworks_home="" --gc_delay="1weeks"
> --gc_disk_headroom="0.1" --hadoop_home="" --help="false"
> --hostname_lookup="true" --http_authenticators="basic"
> --http_command_executor="false" --http_credentials="/tmp/
> Endpoint_SlaveEndpointTest_NoAuthorizer_2_EXyvSj/http_credentials"
> --image_provisioner_backend="copy" --initialize_driver_logging="true"
> --isolation="posix/cpu,posix/mem" --launcher="posix"
> --launcher_dir="/mesos/mesos-1.2.0/_build/src" --logbufsecs="0"
> --logging_level="INFO" --max_completed_executors_per_framework="150"
> --oversubscribed_resources_interval="15secs" --perf_duration="10secs"
> --perf_interval="1mins" --qos_correction_interval_min="0ns"
> --quiet="false" --recover="reconnect" --recovery_timeout="15mins"
> --registration_backoff_factor="10ms" --resources="cpus:2;gpus:0;
> mem:1024;disk:1024;ports:[31000-32000]" --revocable_cpu_low_priority="true"
> --runtime_dir="/tmp/Endpoint_SlaveEndpointTest_NoAuthorizer_2_EXyvSj"
> --sandbox_directory="/mnt/mesos/sandbox" --strict="true"
> --switch_user="true" --systemd_enable_support="true"
> --systemd_runtime_directory="/run/systemd/system" --version="false"
> --work_dir="/tmp/Endpoint_SlaveEndpointTest_NoAuthorizer_2_pQmnVl"
> I1114 15:13:55.478638 31969 credentials.hpp:86] Loading credential for
> authentication from '/tmp/Endpoint_SlaveEndpointTest_
> NoAuthorizer_2_EXyvSj/credential'
> I1114 15:13:55.478828 31969 slave.cpp:346] Agent using credential for:
> test-principal
> I1114 15:13:55.478850 31969 credentials.hpp:37] Loading credentials for
> authentication from '/tmp/Endpoint_SlaveEndpointTest_
> NoAuthorizer_2_EXyvSj/http_credentials'
> I1114 15:13:55.479069 31969 http.cpp:895] Using default 'basic' HTTP
> authenticator for realm 'mesos-agent-readonly'
> I1114 15:13:55.479209 31969 http.cpp:895] Using default 'basic' HTTP
> authenticator for realm 'mesos-agent-readwrite'
> I1114 15:13:55.480175 31969 slave.cpp:533] Agent resources: cpus(*):2;
> mem(*):1024; disk(*):1024; ports(*):[31000-32000]
> I1114 15:13:55.480250 31969 slave.cpp:541] Agent attributes: [  ]
> I1114 15:13:55.480263 31969 slave.cpp:546] Agent hostname: 0fd097464b53
> I1114 15:13:55.481765 31971 state.cpp:57] Recovering state from
> '/tmp/Endpoint_SlaveEndpointTest_NoAuthorizer_2_pQmnVl/meta'
> I1114 15:13:55.482105 31958 status_update_manager.cpp:203] Recovering
> status update manager
> I1114 15:13:55.482365 31971 containerizer.cpp:561] Recovering containerizer
> I1114 15:13:55.483806 31964 provisioner.cpp:253] Provisioner recovery
> complete
> I1114 15:13:55.484266 31959 slave.cpp:5411] Finished recovery
> I1114 15:13:55.484843 31959 slave.cpp:5585] Querying resource estimator
> for oversubscribable resources
> I1114 15:13:55.485121 31957 slave.cpp:5599] Received oversubscribable
> resources {} from the resource estimator
> I1114 15:13:55.486845 31969 process.cpp:3570] Handling HTTP event for
> process 'slave(648)' with path: '/slave(648)/containers'
> I1114 15:13:55.487702 31962 http.cpp:847] Authorizing principal
> 'test-principal' to GET the '/containers' endpoint
> I1114 15:13:55.490654 31968 slave.cpp:787] Agent terminating
> [       OK ] Endpoint/SlaveEndpointTest.NoAuthorizer/2 (26 ms)
> [----------] 9 tests from Endpoint/SlaveEndpointTest (237 ms total)
>
> [----------] Global test environment tear-down
> [==========] 1371 tests from 155 test cases ran. (558118 ms total)
> [  PASSED  ] 1369 tests.
> [  FAILED  ] 2 tests, listed below:
> [  FAILED  ] MasterTest.OfferTimeout
> [  FAILED  ] ContentType/ExecutorHttpApiTest.Subscribe/0, where
> GetParam() = application/x-protobuf
>
>  2 FAILED TESTS
>   YOU HAVE 4 DISABLED TESTS
>
> make[4]: *** [check-local] Error 1
> make[4]: Leaving directory `/mesos/mesos-1.2.0/_build/src'
> make[3]: *** [check-am] Error 2
> make[3]: Leaving directory `/mesos/mesos-1.2.0/_build/src'
> make[2]: *** [check] Error 2
> make[2]: Leaving directory `/mesos/mesos-1.2.0/_build/src'
> make[1]: *** [check-recursive] Error 1
> make[1]: Leaving directory `/mesos/mesos-1.2.0/_build'
> make: *** [distcheck] Error 1
> + docker rmi mesos-1479133972-10356
> Untagged: mesos-1479133972-10356:latest
> Deleted: sha256:ac1b493c9990241321b778da3e6708
> f1bdbdbea302766dae3f7b082b6e45b5b0
> Deleted: sha256:0f69e6ba859298cc02dda6639cdefa
> 68c48b34c12eaebfee25878461f60b138a
> Deleted: sha256:8214b910b8a2ed87db47265d110feb
> ed57e4e1cbf74aa3c4002ac3506836c37a
> Deleted: sha256:d990c7316d4bc4089198e59dad8177
> 6dc4e924878fd1d486e80b1b4bae259dbf
> Deleted: sha256:eacfda958777ec4c31827a9e499964
> 6591969cb4a245e15a104a66e3bdac9a74
> Deleted: sha256:ea21d5a7b53ac410fcc34ccc4ae4f8
> a6da9c17cfd395acbc1176035a230ae53e
> Deleted: sha256:d3b652bd4b84470569754217933e9c
> 66f8ff9b476401e2ee269fb1dfa8fea658
> Deleted: sha256:4a4b79b1eab27f146ff5a05e6a2ace
> 03e9b4229d9a63bd30b6d645370b528379
> Deleted: sha256:405adcc74cecb8dfcba74422ca08cc
> 10e4c847ba432540c979c380a34702498f
> Deleted: sha256:ab33d4544c21ce6e317103b799e8b8
> 130aae5d2e458e67462ada71eec8d26858
> Deleted: sha256:c63eae67d61368e69d94956d3890a1
> e01d5de4e75b493012084afc23bab0224e
> Deleted: sha256:fc9ef0ee2d64a5815570d18248f72f
> 10f8db482390ad53f099c280786d286125
> Deleted: sha256:ef3169fd9b173acabfe6368b7b7977
> b8277bb8ae16efe9c27257e2b665ee0b4a
> Deleted: sha256:3bec45b7f83131fe31f1842cd4b8d2
> 40cb2defb00dace114ef592e0d503d9b4d
> Deleted: sha256:fc38f92ba547615f02790ae3a826ac
> f8fd78a142afa6103725997d40882e15d5
> Deleted: sha256:fbd2be0bbacd954bee54ed122d0c0d
> f7e1b89f0d8b4e3b09158d94574332258f
> Deleted: sha256:96b1b1187398580aa802e9b7b8bcd1
> bc3a93d685fd438ac3de108c586e7eb3c8
> Deleted: sha256:a2e71731d1fcbecb447a2853bc2660
> e35f73849eca3d7dc6195bc0e8ef2dbf0c
> Deleted: sha256:508f03462d9ac11cae04da22304ce1
> e69b2cb0d5f21acfffa28617cbe0e77c77
> Deleted: sha256:208aa9e32c3e7806ad6426f78f113b
> 175975128a3757abcb0f36f4ccab7755e5
> Deleted: sha256:eb6b3b299194f984d3d7ac4f901043
> 58c1b366b8c0daaeb6a9536388b1672974
> Deleted: sha256:83cb2ea8baa0a2d71c058fa03b14c4
> f8c5add1d3ae35e7990de2d7077bb26f5c
> Deleted: sha256:b44fb7a041a3f62e3582ab31f20d5e
> e7cbc430ebdca0f34727fd84b1a485ced9
> Deleted: sha256:00d10fb26b6dd3d0d6cc33a1fcc3a7
> b3800d79da4fd8dd44c5e3d2cd41444db6
> Deleted: sha256:e1837c3d025de044002ca84a9987b5
> 39916c49d91ea6765445ff941e39a9dffa
> Build step 'Execute shell' marked build as failure
>

Mime
  • Unnamed multipart/alternative (inline, None, 0 bytes)
View raw message